from small one page howto to huge articles all in one place

search text in:




Other .linuxhowtos.org sites: www.linuxhowtos.org
toolsntoys.linuxhowtos.org



Last additions:
How to make X listen on port 6000

How to make X listen on port 6000

words:

34

views:

89129

userrating:

average rating: 1.2 (52 votes) (1=very good 6=terrible)


May, 25th 2007:
April, 26th 2007:
Apr, 10th. 2007:
Druckversion . pdf icon
You are here: Portage


Details of sys-devel/make:

available versions:

releasesalphaamd64armhppaia64mipsppcppc64ppc macoss390shsparcx86USE-Flagsdependenciesebuild warnings
Legend:
+ stable
~ testing
- not available
some ebuild warning depend on specific use-flags or architectures, all ebuild-warnings are shown.

Known bugs:
bug IDcomponentassigned tostatusdescriptionlast change
333285Toolstools-portageUNCONFIRMEDapp-portage/gentoolkit: revdep-rebuild: add variable to make.conf default emerge options for revdep-2013-01-18 16:29:12
365321Eclasses and Profilesbase-systemUNCONFIRMEDeutils.eclass lacks eclass-to-man formatting for documentation of make_desktop_entry function2011-05-02 01:44:57
366159EbuildsnetmonUNCONFIRMEDnet-analyzer/hping: Patch to make hping's traceroute mode increment TTL after N retries2011-05-10 20:33:04
370087Core systemtoolchainUNCONFIRMEDsys-libs/glibc-2.12.2: MAKEOPTS=-s: ld hits internal error at bfd/elf32-i386.c:2946:elf_i386_relocat2012-04-13 23:36:33
371865ApplicationscedkUNCONFIRMEDmedia-sound/sndpeek :highlight_maker: command not found2011-06-16 16:05:08
372285ApplicationsxmwUNCONFIRMEDapp-admin/makepasswd-1.10 does not support the option "--crypt-md5"2011-06-21 00:38:51
373473UnspecifiedrafaelmartinsUNCONFIRMEDg-octave/optiminterp-0.3.2 fails to emerge if MAKEOPTS is not "-j1"2011-07-08 21:19:20
377841Prefix SupportprefixUNCONFIRMEDXemake requires Xvfb from the host, but end users don't know that2011-08-05 02:05:43
378557Librarymedia-videoUNCONFIRMEDmedia-libs/libvpx-0.9.7: Compile failure with debug USE flag - "No rule to make target libvpx_g.so, 2012-09-15 05:01:43
380341Applicationsapp-backupUNCONFIRMEDapp-backup/cdbkup-1.0-r1: make jobserver unavailable2011-08-25 14:00:21
380379DevmanualqaUNCONFIRMEDQuickstart ebuild guide is outdated re: emake2011-08-23 15:27:47
384137EbuildsperlUNCONFIRMEDdev-perl/Inline-0.480.0: fails tests with parallel make2011-09-27 16:26:48
386565Ebuildsbase-systemUNCONFIRMEDsys-devel/libtool-2.4-r1: failed (emake failed)2011-10-11 05:39:18
389861ApplicationsgnustepUNCONFIRMEDgnustep-base/gnustep-make-2.6.1-r1[doc] - mkdir: cannot create directory `gnustep-howto.t2d': File e2011-11-08 15:59:39
391675EbuildsproaudioUNCONFIRMEDmedia-plugins/swh-plugins - make x86 extensions optional at compile time2012-07-04 13:47:31
391771Core - Configurationdev-portageUNCONFIRMEDAlternative config (PORTAGE_CONFIGROOT) does not consider PORTAGE_CONFIGROOT/etc/make.profile2011-11-25 17:20:03
392769ApplicationspatrickUNCONFIRMEDapp-emulation/virtualbox-guest-additions-4.1.6-r1 fails to build from /etc/kernel/postinst.d - make[2012-03-14 22:38:37
394419Enhancement/Feature Requestsdev-portageUNCONFIRMEDportage: provide a make.conf option for changing to cgroups (configuring them if needed) on package 2011-12-19 18:43:41
395949DevelopmenttitanofoldUNCONFIRMEDdev-util/premake-4.3 should generate architecture independent makefiles2011-12-26 23:59:11
399491Core systembase-systemUNCONFIRMEDsys-devel/automake-1.11.2-r1 - fails py-compile-basic.test py-compile-basic2.test py-compile-basedir2012-02-06 11:51:29
402493ApplicationsadaUNCONFIRMEDdev-ada/adasockets-1.8.4.7 - gnatmake: "listener.adb" compilation error2012-02-07 17:45:08
403479Ebuildsqmail-bugsUNCONFIRMEDmail-mta/netqmail-1.06 - typo in /etc/tcprules.d/Makefile.qmail2012-02-14 18:31:39
404263EbuildsdotnetUNCONFIRMEDdev-lang/mono-2.10.5: remove MAKEOPTS=-j1 limitation2012-02-19 11:00:47
404539Applicationsmedia-tvUNCONFIRMEDapp-misc/lirc-0.9.0 - /usr/src/linux-3.2.1-gentoo/arch/amd64/Makefile: No such file or directory mak2012-09-27 19:15:55
406891ApplicationsfontsUNCONFIRMEDmedia-libs/freetype-1.4_pre20080316-r2 compile failure: make[2]: execvp: ../libtool: Permission deni2012-03-05 20:19:14
407169Ebuildsfreedesktop-bugsUNCONFIRMEDsys-fs/udisks-1.0.4-r2 - file:///etc/xml/docbook:1: parser make[3]: *** [udisks.7] Fehler 4 parser e2012-10-03 07:06:31
408049BugzillabugzillaUNCONFIRMEDplease make "auto select" a default for attachments2012-08-05 10:49:24
408607Applicationspolynomial-cUNCONFIRMEDapp-emulation/virtualbox - make --disable-vmmraw optional2012-03-18 05:32:07
409259Applicationscron-bugsUNCONFIRMEDsys-process/vixie-cron: sed -i Makefile expands $CFLAGS, $LDFLAGS into sed call, which can confuse s2012-03-22 12:39:21
409469Core systembase-systemUNCONFIRMEDsys-process/runit - make getty-ttyX symlinks optional2012-03-24 16:18:08
410065ServererasUNCONFIRMEDnet-mail/dovecot-2.1.3 fails at parallel make: fatal error: ../../../src/plugins/quota/rquota.h: No 2012-07-12 15:51:16
410677Ebuildsdev-embeddedUNCONFIRMEDdev-embedded/libftdi-9999.1.0: install docs from cmake build directory2012-04-03 20:37:04
412217LibrarysoundUNCONFIRMEDdev-libs/redland-1.0.15 has malformed Makefile, won't emerge: "missing separator"2012-04-16 17:47:14
414817PMS/EAPIpms-bugsUNCONFIRMED[Future EAPI] Support for make.defaults, use.force, use.stable.force, use.mask, use.stable.mask, pac2013-01-12 13:13:11
415375Ebuildsmaintainer-wantedUNCONFIRMEDapp-office/makebeamerinfo - Creates .info file for use with app-office/impressive and dev-tex/latex-2012-05-10 14:51:46
415577ApplicationsopenofficeUNCONFIRMEDapp-office/libreoffice-3.5.3.2 QA Notice: make jobserver unavailable2012-05-16 02:57:58
416501Prefix SupportprefixUNCONFIRMEDdev-java/jffi-1.0.0 and jffi-1.0.11 failed to build: No rule to make target2012-05-18 14:04:04
417263EbuildsembeddedUNCONFIRMEDsys-apps/busybox - USE=make-symlinks should not overwrite existing files2012-06-28 04:01:46
417395ApplicationsproaudioUNCONFIRMEDmedia-plugins/ir_lv2 - make & install "convert4chan"-tool2012-05-24 16:48:34
417639DevelopmentswegenerUNCONFIRMEDdev-util/systemtap-1.7: error: gettext infrastructure mismatch: using a Makefile.in.in from gettext 2012-12-15 13:34:09
417871LiveCD/DVDtenUNCONFIRMED12.1 amd64 livedvd sshd default configuration AllowUsers line makes usage difficult2012-07-08 17:05:19
418037Applicationsmedia-videoUNCONFIRMEDmedia-video/subtitlecomposer-0.5.3 USE=xine fails due to underlinking: ld: CMakeFiles/subtitlecompos2012-05-29 00:01:02
419741Applicationsbase-systemUNCONFIRMEDdev-util/mono-tools-2.10 fails to emerge with Automake 1.11.52012-06-11 07:28:14
420393ApplicationsjlecUNCONFIRMEDapp-arch/p7zip-9.20.1-r2 fails to build 7zG/7zFM with "-l" in MAKEOPTS2012-06-09 14:44:20
420617Applicationsrobbat2UNCONFIRMEDapp-portage/g-cpan-0.16.4 does not read /etc/portage/make.conf2012-06-17 12:50:11
420715Applicationsx11UNCONFIRMEDx11-misc/imake hardcodes /usr/lib/X11 paths (ignoring multilib settings)2012-09-11 06:15:16
421223JavajavaUNCONFIRMEDdev-java/gnu-classpath should make installing /usr/gnu-classpath-*/bin scripts optional2012-06-15 11:06:00
424041ApplicationssgmlUNCONFIRMEDapp-text/sgml-common-0.6.3-r5 fails with automake-1.12 - mkdir -p2012-10-13 18:56:21
424453Core systembase-systemUNCONFIRMEDsys-devel/automake-1.1[12] cause warning in combination with dev-lang/perl-5.16.02012-07-03 16:25:08
424892Applicationsnet-dialupUNCONFIRMEDnet-dialup/capisuite-0.4.5-r6 fails to build with automake >= 1.12.12013-01-10 17:40:24
428410LibraryalexxyUNCONFIRMEDsys-apps/gptfdisk - make dev-libs/icu dependency optional2012-11-01 19:01:06
428678Core - Configurationdev-portageUNCONFIRMEDsys-apps/portage-2.1.10.65 omits some variables from cascaded profiles make.defaults2012-08-07 05:00:31
431000Applicationsmysql-bugsUNCONFIRMEDdev-db/mysql-5.1.62-r1 - make[1]: *** No rule to make target `../mysys/libmysys.la', needed by `fact2012-08-21 17:31:46
432110Core systemlu_zeroUNCONFIRMEDsys-libs/libspe2-2.2.80_p95-r1 without dev-vcs/subversion - make: svnversion: Command not found2012-08-21 13:59:13
432992Core - Ebuild Supportrobbat2UNCONFIRMEDsys-apps/portage-2.2.0_alpha121 breaks g-cpan (/etc/make.globals symlink is gone)2013-01-04 22:46:36
433003LibrarypythonUNCONFIRMEDdev-libs/libxml2 - File "/usr/lib/python2.7/xml/sax/__init__.py", line 93, in make_parser raise 2012-09-09 04:48:34
433373Installation Handbookdocs-teamUNCONFIRMEDSubstitute old make.conf path2012-10-31 18:52:18
433708ApplicationsmattmUNCONFIRMEDnet-analyzer/zabbix-2.0.2-r1: Makefiles are erroneously installed in /usr/share/zabbix2012-09-03 17:12:18
434138ApplicationscjkUNCONFIRMEDapp-i18n/scim-1.4.14 breaks x11-wm/windowmaker's root window mouse actions2012-09-14 15:30:36
434216KDEkdeUNCONFIRMEDdev-util/cmake-2.8.9: FindLua51.cmake finds dev-lang/lua-5.2.12012-10-02 07:29:27
434472ApplicationshannoUNCONFIRMEDnet-analyzer/openvas-scanner-3.2.4 - ld: CMakeFiles/openvassd.dir/preferences.c.o: undefined referen2013-01-01 12:37:32
434574Toolstools-portageUNCONFIRMEDapp-portage/genlop: bashcomp script fails when make.conf is in /etc/portage/2012-12-13 16:13:07
435620ApplicationsspingUNCONFIRMEDapp-portage/fetchcommandwrapper-0.7.1 has path "/etc/make.conf" hardcoded2012-09-20 14:44:27
435656EbuildshannoUNCONFIRMEDnet-analyzer/greenbone-security-assistant-2.0.1 - ld: CMakeFiles/gsad.dir/gsad.c.o: undefined refere2012-09-24 10:44:47
435690Applicationsmysql-bugsUNCONFIRMEDdev-db/mysql-5.1.62-r1 - Makefile:186: *** missing separator. Stop.2013-02-04 23:51:03
436594Core systembase-systemUNCONFIRMED>=sys-apps/memtest86+-2.00 should make use of/document "console="2012-09-29 15:40:51
439614GNOMErobbat2UNCONFIRMEDsys-apps/vbetool-1.1: Failed Running automake2013-02-06 22:06:33
442054Portage Documentationdev-portageUNCONFIRMEDman make.conf should warn users about not using extra spaces in *FLAGS variables2012-11-10 17:44:56
442056Enhancement/Feature Requestsdev-portageUNCONFIRMEDAdditional checks for sanity of user-supplied *FLAGS variables in make.conf2012-11-06 16:12:29
442814ApplicationsfloppymUNCONFIRMEDnet-misc/freerdp-1.1.0_pre20121004-r1 CMake Error at cunit/CMakeLists.txt:28 (add_executable): Canno2012-11-13 07:00:04
443076PrintingprintingUNCONFIRMEDnet-print/foomatic-filters-4.0.16 - configure.ac:6: version mismatch. This is Automake 1.11.6, but2013-01-19 06:59:22
445192Other documentsoverlaysUNCONFIRMEDDeprecated references to /etc/make.conf in the Gentoo overlays users' guide2012-12-01 07:27:56
445902Libraryx11UNCONFIRMEDapp-emulation/emul-linux-x86-opengl-20121202{,-r1} makes some wine programs very sluggish2013-01-11 11:54:06
446386Core systembase-systemUNCONFIRMEDsys-devel/automake-1.12.5 fails tests related to yacc2012-12-08 05:53:22
446498Core - Configurationdev-portageUNCONFIRMEDsys-apps/portage should handle typos in make.conf like those at the command line2012-12-08 17:10:05
446700Ebuildskernel-miscUNCONFIRMEDdev-libs/klibc-1.5.25 - make silentoldconfig: Console input/output is redirected. Run 'make oldconfi2012-12-10 11:38:29
446924LibrarymabiUNCONFIRMEDx11-libs/fox-1.6.40 - Upstream bug makes build ignore -opengl.2013-01-02 19:32:57
447474Core systembase-systemUNCONFIRMEDsys-devel/make-3.82-r4 - fails 1 test in features/parallelism2012-12-17 16:10:34
447970Core systemsandboxUNCONFIRMEDsys-apps/sandbox makes autoconf's getcwd long path test take hours2013-01-31 14:19:12
448104DevelopmentperlUNCONFIRMEDdev-perl/PortageXS-0.02.10-r2 - test-suite fails - Cannot open file /etc/portage/make.conf at lib//P2012-12-24 09:37:14
448322HardenedhardenedUNCONFIRMEDmake fails on kernel/sched/core.o when trying to build sys-kernel/hardened-sources-3.5.4-r12013-01-18 21:53:13
448352Core systemnet-mailUNCONFIRMEDdev-libs/cyrus-sasl-2.1.25-r3 fails to crosscompile: ./makemd5: ./makemd5: cannot execute binary fil2012-12-25 18:07:35
448670ApplicationsgraphicsUNCONFIRMEDmedia-gfx/inkscape-0.48.4 - Superfluous dependencies, make them USE-dependent or remove them.2012-12-26 23:33:10
448706Applicationsmedia-videoUNCONFIRMEDmedia-plugins/frei0r-plugins-1.3 - defish0r plugin makes kdenlive rendering fail2013-02-01 10:32:02
448896EbuildsgnomeUNCONFIRMEDdev-python/pygobject-3.4.2-r1 (and others): py-compile coming from 2012-12-28 19:03:04
450042EbuildsxfceUNCONFIRMED[xfce-dev overlay] New ebuild xfce4-notes-plugin-1.8.0_alpha and a patch to make it work2013-01-23 16:34:39
450386DevelopmentkdeUNCONFIRMEDdev-util/cmake: FindBLAS patch doesn't correctly use pkg-config results and may fail2013-01-08 12:36:44
450388Prefix SupportprefixUNCONFIRMEDsci-libs/dsdp-5.8-r2: emerge fails in make_shared_library on OS X2013-01-05 14:03:11
450964Core systemtoolchainUNCONFIRMEDsys-devel/gcc-4.6.3 - make[3]: *** [jc1] Error 12013-02-10 23:17:24
451054LibrarycjkUNCONFIRMEDdev-libs/oniguruma-5.9.2-r1 - autotools-utils_src_prepare: Cannot find the latest automake! Tried 1.2013-01-09 14:27:12
452124Core systemrobbat2UNCONFIRMEDsys-process/audit-2.2.2 with sys-devel/automake-1.13.1 - configure.ac:34: error: 'AM_CONFIG_HEADER':2013-01-15 17:29:39
453002LibrarypatrickUNCONFIRMEDsci-libs/openfoam-2.1.1 - Patches to make paraFoam work with Paraview 3.98.02013-02-18 18:55:08
454120OpenRCopenrcUNCONFIRMEDsys-apps/openrc-0.11.8: Service XY stop makes other services stop, but consequent start of XY leaves2013-01-26 09:43:51
454750UnspecifiedmaqUNCONFIRMEDnet-libs/libupnp-1.6.18 should not depend on sys-devel/automake-1.92013-01-31 04:08:04
454916DevelopmenthwoarangUNCONFIRMEDdev-util/qt-creator: apply patch to make ~arm work2013-02-17 11:25:06
454956GNOMEgnomeUNCONFIRMEDgnome-base/orbit-2.14.19-r1 with sys-devel/automake-1.13.1 - test/everything/Makefile.am:81: error: 2013-02-01 06:41:21
455430Librarysci-geosciencesUNCONFIRMEDsci-libs/shapelib-1.3.0-r1 - Please make a rev-bump after changing ebuild to install headers.2013-02-07 12:28:41
455816Librarynet-p2pUNCONFIRMEDnet-libs/gupnp-igd - src_prepare(): libgupnp-igd/Makefile.am:64: HAVE_INTROSPECTION does not appear 2013-02-06 13:54:26
455824ApplicationsrafaelmartinsUNCONFIRMEDwww-client/xombrero-1.4.0 - make branding configurable2013-02-07 17:56:52
456186ApplicationsjmbsvicettoUNCONFIRMEDmedia-sound/amarok-2.6.0 - make[2]: *** No rule to make target `/usr/lib64/libGLU.so', needed by `li2013-02-13 19:21:15
456934Other documentsoverlaysUNCONFIRMEDSince the 2012-09-09-make.conf-and-make.profile-move the overlay instructions are out of date2013-02-13 10:03:36
458182Libraryx11UNCONFIRMEDdev-libs/wayland-1.0.4 - No rule to make target `wl_display_connect.xml', needed by `wl_display_conn2013-02-20 15:50:05


back



Support us on Content Nation

New Packages

- as rdf newsfeed
- as rss newsfeed
- as Atom newsfeed
2026-10-13
freerdp - 3.32.2
Ebuild name:

net-misc/freerdp-3.32.2

Description

Free implementation of the Remote Desktop Protocol

Added to portage

2026-10-13

javacc - 8.1.0
Ebuild name:

dev-java/javacc-8.1.0

Description

Core module of JavaCC

Added to portage

2026-10-13

javacc-java - 8.1.0
Ebuild name:

dev-java/javacc-java-8.1.0

Description

Java code generator module of JavaCC

Added to portage

2026-10-13

johntheripper-jumbo - 9999
Ebuild name:

app-crypt/johntheripper-jumbo-9999

Description

Fast password cracker, community enhanced version

Added to portage

2026-10-13

kup - 0.10.0
Ebuild name:

kde-plasma/kup-0.10.0

Description

Backup scheduler for the Plasma desktop

Added to portage

2026-10-13

tomcat - 10.1.61
Ebuild name:

www-servers/tomcat-10.1.61

Description

Tomcat Servlet-6.0/JSP-3.1/EL-5.0/WebSocket-2.1/JASPIC-3.0 Container

Added to portage

2026-10-13

tomcat - 11.0.27
Ebuild name:

www-servers/tomcat-11.0.27

Description

Tomcat Servlet-6.1/JSP-4.0/EL-6.0/WebSocket-2.2/JASPIC-3.1 Container

Added to portage

2026-10-13

tomcat - 9.0.123
Ebuild name:

www-servers/tomcat-9.0.123

Description

Tomcat Servlet-4.0/JSP-2.3/EL-3.0/WebSocket-1.1/JASPIC-1.1 Container

Added to portage

2026-10-13

wsjtx_improved - 3.2.0_p20260908
Ebuild name:

media-radio/wsjtx_improved-3.2.0_p20260908

Description

Weak signal ham radio communication with improvements

Added to portage

2026-10-13

2026-10-12
aioquic - 1.5.0
Ebuild name:

dev-python/aioquic-1.5.0

Description

An implementation of QUIC and HTTP/3

Added to portage

2026-10-12

ansible-compat - 26.10.0
Ebuild name:

dev-python/ansible-compat-26.10.0

Description

Contains functions that facilitate working with various versions

Added to portage

2026-10-12

aws-sdk-cpp - 1.11.909
Ebuild name:

dev-cpp/aws-sdk-cpp-1.11.909

Description

AWS SDK for C++

Added to portage

2026-10-12

beartype - 0.23.1
Ebuild name:

dev-python/beartype-0.23.1

Description

Unbearably fast runtime type checking in pure Python

Added to portage

2026-10-12

bitarray - 3.12.1
Ebuild name:

dev-python/bitarray-3.12.1

Description

Efficient arrays of booleans -- C extension

Added to portage

2026-10-12

bracex - 3.1
Ebuild name:

dev-python/bracex-3.1

Description

Bash style brace expansion for Python

Added to portage

2026-10-12

btrfs-assistant - 2.3.2
Ebuild name:

app-admin/btrfs-assistant-2.3.2

Description

GUI management tool to make managing a Btrfs filesystem easier

Added to portage

2026-10-12

cen64-jg - 0.4.1
Ebuild name:

games-emulation/cen64-jg-0.4.1

Description

Jolly Good fork of CEN64

Added to portage

2026-10-12

cen64-jg - 9999
Ebuild name:

games-emulation/cen64-jg-9999

Description

Jolly Good fork of CEN64

Added to portage

2026-10-12

dealii - 9.7.1-r1
Ebuild name:

sci-libs/dealii-9.7.1-r1

Description

Solving partial differential equations with the finite element method

Added to portage

2026-10-12

dealii - 9.8.0-r1
Ebuild name:

sci-libs/dealii-9.8.0-r1

Description

Solving partial differential equations with the finite element method

Added to portage

2026-10-12

dist-kernel - 6.18.56
Ebuild name:

virtual/dist-kernel-6.18.56

Description

Virtual to depend on any Distribution Kernel

Added to portage

2026-10-12

dist-kernel - 7.2.10
Ebuild name:

virtual/dist-kernel-7.2.10

Description

Virtual to depend on any Distribution Kernel

Added to portage

2026-10-12

docker - 29.9.0
Ebuild name:

app-containers/docker-29.9.0

Description

The core functions you need to create Docker images and run Docker con

Added to portage

2026-10-12

docker-cli - 29.9.0
Ebuild name:

app-containers/docker-cli-29.9.0

Description

the command line binary for docker

Added to portage

2026-10-12

doxygen - 1.17.0-r1
Ebuild name:

app-text/doxygen-1.17.0-r1

Description

Documentation system for most programming languages

Added to portage

2026-10-12

doxygen - 1.18.0-r1
Ebuild name:

app-text/doxygen-1.18.0-r1

Description

Documentation system for most programming languages

Added to portage

2026-10-12

duckdb - 1.5.6
Ebuild name:

dev-db/duckdb-1.5.6

Description

high-performance analytical database system

Added to portage

2026-10-12

filelock - 4.1.1
Ebuild name:

dev-python/filelock-4.1.1

Description

A platform independent file lock for Python

Added to portage

2026-10-12

firefox-bin - 158.0
Ebuild name:

www-client/firefox-bin-158.0

Description

Firefox Web Browser

Added to portage

2026-10-12

gcc - 14.4.1_p20261008
Ebuild name:

sys-devel/gcc-14.4.1_p20261008

Description

The GNU Compiler Collection

Added to portage

2026-10-12

gcc - 15.3.1_p20261009
Ebuild name:

sys-devel/gcc-15.3.1_p20261009

Description

The GNU Compiler Collection

Added to portage

2026-10-12

gcc - 16.2.1_p20261010
Ebuild name:

sys-devel/gcc-16.2.1_p20261010

Description

The GNU Compiler Collection

Added to portage

2026-10-12

gcc - 17.0.0_p20261011
Ebuild name:

sys-devel/gcc-17.0.0_p20261011

Description

The GNU Compiler Collection

Added to portage

2026-10-12

gentoo-kernel - 6.18.56
Ebuild name:

sys-kernel/gentoo-kernel-6.18.56

Description

Linux kernel built with Gentoo patches

Added to portage

2026-10-12

gentoo-kernel - 7.2.10
Ebuild name:

sys-kernel/gentoo-kernel-7.2.10

Description

Linux kernel built with Gentoo patches

Added to portage

2026-10-12

gentoo-kernel-bin - 6.18.56
Ebuild name:

sys-kernel/gentoo-kernel-bin-6.18.56

Description

Pre-built Linux kernel with Gentoo patches

Added to portage

2026-10-12

gentoo-kernel-bin - 7.2.10
Ebuild name:

sys-kernel/gentoo-kernel-bin-7.2.10

Description

Pre-built Linux kernel with Gentoo patches

Added to portage

2026-10-12

gentoo-kernel-modprep - 6.18.56
Ebuild name:

sys-kernel/gentoo-kernel-modprep-6.18.56

Description

Minimal subset of gentoo-kernel-bin for building modules,

Added to portage

2026-10-12

gentoo-kernel-modprep - 7.2.10
Ebuild name:

sys-kernel/gentoo-kernel-modprep-7.2.10

Description

Minimal subset of gentoo-kernel-bin for building modules, f

Added to portage

2026-10-12

git-sources - 7.3_rc7
Ebuild name:

sys-kernel/git-sources-7.3_rc7

Description

The very latest -git version of the Linux kernel

Added to portage

2026-10-12

go - 1.26.9
Ebuild name:

dev-lang/go-1.26.9

Description

A concurrent garbage collected and typesafe programming language

Added to portage

2026-10-12

go - 1.27.2
Ebuild name:

dev-lang/go-1.27.2

Description

A concurrent garbage collected and typesafe programming language

Added to portage

2026-10-12

haskell-mode - 17.5_p20260206
Ebuild name:

app-emacs/haskell-mode-17.5_p20260206

Description

Mode for editing (and running) Haskell programs in Emacs

Added to portage

2026-10-12

hypothesis - 6.169.0
Ebuild name:

dev-python/hypothesis-6.169.0

Description

A library for property based testing

Added to portage

2026-10-12

inline-snapshot - 0.36.1
Ebuild name:

dev-python/inline-snapshot-0.36.1

Description

Create and update inline snapshots in your Python tests

Added to portage

2026-10-12

jacksum - 4.0.2
Ebuild name:

app-crypt/jacksum-4.0.2

Description

Java utility for working with checksums, CRCs, and message digests (hashes)

Added to portage

2026-10-12

jgemu - 1.0.0-r2
Ebuild name:

games-emulation/jgemu-1.0.0-r2

Description

Meta ebuild for the Jolly Good API

Added to portage

2026-10-12

jna - 5.19.1
Ebuild name:

dev-java/jna-5.19.1

Description

Java Native Access

Added to portage

2026-10-12

jsonpath-ng - 1.10.1
Ebuild name:

dev-python/jsonpath-ng-1.10.1

Description

Python JSONPath Next-Generation

Added to portage

2026-10-12

keystoneauth1 - 5.18.1
Ebuild name:

dev-python/keystoneauth1-5.18.1

Description

This package contains tools for authenticating to an OpenStack-base

Added to portage

2026-10-12

libhubbub - 9999
Ebuild name:

net-libs/libhubbub-9999

Description

HTML5 compliant parsing library, written in C

Added to portage

2026-10-12

libnsbmp - 9999
Ebuild name:

media-libs/libnsbmp-9999

Description

Decoding library for BMP and ICO image file formats, written in C

Added to portage

2026-10-12

libnsfb - 9999
Ebuild name:

dev-libs/libnsfb-9999

Description

C library for framebuffer abstraction

Added to portage

2026-10-12

libnspsl - 9999
Ebuild name:

media-libs/libnspsl-9999

Description

Public Suffix List (PSL) for the NetSurf browser

Added to portage

2026-10-12

libparserutils - 9999
Ebuild name:

dev-libs/libparserutils-9999

Description

C library for building efficient parsers

Added to portage

2026-10-12

librosprite - 9999
Ebuild name:

media-libs/librosprite-9999

Description

Framebuffer abstraction library, written in C

Added to portage

2026-10-12

libwapcaplet - 9999
Ebuild name:

dev-libs/libwapcaplet-9999

Description

string internment library, written in C

Added to portage

2026-10-12

libxmp - 4.7.4
Ebuild name:

media-libs/libxmp-4.7.4

Description

Library that renders module files to PCM data

Added to portage

2026-10-12

lollypop - 1.4.48
Ebuild name:

media-sound/lollypop-1.4.48

Description

Modern music player for GNOME

Added to portage

2026-10-12

ls-qpack - 2.6.4
Ebuild name:

dev-libs/ls-qpack-2.6.4

Description

QPACK compression library for use with HTTP/3

Added to portage

2026-10-12

ls-qpack - 2.7.0
Ebuild name:

dev-libs/ls-qpack-2.7.0

Description

QPACK compression library for use with HTTP/3

Added to portage

2026-10-12

moto - 5.2.4
Ebuild name:

dev-python/moto-5.2.4

Description

Mock library for boto

Added to portage

2026-10-12

mumps - 5.6.2-r1
Ebuild name:

sci-libs/mumps-5.6.2-r1

Description

MUltifrontal Massively Parallel sparse direct matrix Solver

Added to portage

2026-10-12

nbconvert - 7.17.2
Ebuild name:

dev-python/nbconvert-7.17.2

Description

Converting Jupyter Notebooks

Added to portage

2026-10-12

netsurf-buildsystem - 9999
Ebuild name:

dev-build/netsurf-buildsystem-9999

Description

Build system used for netsurf and its libraries

Added to portage

2026-10-12

nsgenbind - 9999
Ebuild name:

dev-libs/nsgenbind-9999

Description

Generate Javascript-to-DOM bindings from w3c webidl files

Added to portage

2026-10-12

paraview - 6.2.0
Ebuild name:

sci-visualization/paraview-6.2.0

Description

Powerful scientific data visualization application

Added to portage

2026-10-12

patiencediff - 1.0.0
Ebuild name:

dev-python/patiencediff-1.0.0

Description

Python implementation of the patiencediff algorithm

Added to portage

2026-10-12

pikepdf - 10.17.0
Ebuild name:

dev-python/pikepdf-10.17.0

Description

Python library to work with pdf files based on qpdf

Added to portage

2026-10-12

platformdirs - 4.13.0
Ebuild name:

dev-python/platformdirs-4.13.0

Description

A small Python module for determining appropriate platform-specific

Added to portage

2026-10-12

ps2eps - 1.70
Ebuild name:

app-text/ps2eps-1.70

Description

Generate Encapsulated Postscript Format files from one-page Postscript documen

Added to portage

2026-10-12

pycryptodome - 3.24.1
Ebuild name:

dev-python/pycryptodome-3.24.1

Description

A self-contained cryptographic library for Python

Added to portage

2026-10-12

pydantic - 2.14.1
Ebuild name:

dev-python/pydantic-2.14.1

Description

Data parsing and validation using Python type hints

Added to portage

2026-10-12

pyglet - 2.1.19
Ebuild name:

dev-python/pyglet-2.1.19

Description

Cross-platform windowing and multimedia library for Python

Added to portage

2026-10-12

pylint - 4.1.3
Ebuild name:

dev-python/pylint-4.1.3

Description

Python code static checker

Added to portage

2026-10-12

pylsqpack - 1.0.0
Ebuild name:

dev-python/pylsqpack-1.0.0

Description

Python wrapper for the ls-qpack QPACK library

Added to portage

2026-10-12

pypdf - 6.20.1
Ebuild name:

dev-python/pypdf-6.20.1

Description

Python library to work with PDF files

Added to portage

2026-10-12

pyrfc3339 - 2.1.1
Ebuild name:

dev-python/pyrfc3339-2.1.1

Description

Generates and parses RFC 3339 timestamps

Added to portage

2026-10-12

pyspelling - 2.13
Ebuild name:

dev-python/pyspelling-2.13

Description

Spell checker automation tool

Added to portage

2026-10-12

pytest-check - 3.0.0
Ebuild name:

dev-python/pytest-check-3.0.0

Description

pytest plugin that allows multiple failures per test

Added to portage

2026-10-12

python-utils - 4.1.1
Ebuild name:

dev-python/python-utils-4.1.1

Description

Collection of small Python functions & classes

Added to portage

2026-10-12

pyzstd - 0.20.0
Ebuild name:

dev-python/pyzstd-0.20.0

Description

Support for Zstandard (zstd) compression

Added to portage

2026-10-12

rust - 1.99.0
Ebuild name:

dev-lang/rust-1.99.0

Description

Systems programming language originally developed by Mozilla

Added to portage

2026-10-12

rust-bin - 1.99.0
Ebuild name:

dev-lang/rust-bin-1.99.0

Description

Added to portage

2026-10-12

rust-common - 1.99.0
Ebuild name:

dev-lang/rust-common-1.99.0

Description

Common files shared between multiple slots of Rust

Added to portage

2026-10-12

rust-std - 1.99.0
Ebuild name:

sys-devel/rust-std-1.99.0

Description

Rust standard library, standalone (for crossdev)

Added to portage

2026-10-12

sip - 6.17.1
Ebuild name:

dev-python/sip-6.17.1

Description

Python bindings generator for C/C++ libraries

Added to portage

2026-10-12

soupsieve - 3.0.2
Ebuild name:

dev-python/soupsieve-3.0.2

Description

A modern CSS selector implementation for BeautifulSoup

Added to portage

2026-10-12

soupsieve - 3.0.3
Ebuild name:

dev-python/soupsieve-3.0.3

Description

A modern CSS selector implementation for BeautifulSoup

Added to portage

2026-10-12

source-highlight - 9999
Ebuild name:

dev-util/source-highlight-9999

Description

Generate highlighted source code as an (x)html document

Added to portage

2026-10-12

texttable - 1.7.1
Ebuild name:

dev-python/texttable-1.7.1

Description

Module to create simple ASCII tables

Added to portage

2026-10-12

tmux - 3.8
Ebuild name:

app-misc/tmux-3.8

Description

Terminal multiplexer

Added to portage

2026-10-12

tox - 4.65.3
Ebuild name:

dev-python/tox-4.65.3

Description

virtualenv-based automation of test activities

Added to portage

2026-10-12

tox - 4.65.4
Ebuild name:

dev-python/tox-4.65.4

Description

virtualenv-based automation of test activities

Added to portage

2026-10-12

tree-sitter - 0.27.1
Ebuild name:

dev-libs/tree-sitter-0.27.1

Description

Tree-sitter is a parser generator tool and an incremental parsing libra

Added to portage

2026-10-12

tree-sitter-cli - 0.27.1
Ebuild name:

dev-util/tree-sitter-cli-0.27.1

Description

Command-line tool for creating and testing tree-sitter grammars

Added to portage

2026-10-12

trilinos - 16.2.2
Ebuild name:

sci-libs/trilinos-16.2.2

Description

Scientific library collection for large scale problems

Added to portage

2026-10-12

trilinos - 17.1.2
Ebuild name:

sci-libs/trilinos-17.1.2

Description

Scientific library collection for large scale problems

Added to portage

2026-10-12

trilinos - 17.2.1
Ebuild name:

sci-libs/trilinos-17.2.1

Description

Scientific library collection for large scale problems

Added to portage

2026-10-12

upterm - 0.37.0
Ebuild name:

app-misc/upterm-0.37.0

Description

Instant Terminal Sharing

Added to portage

2026-10-12

utidylib - 1.1.0
Ebuild name:

dev-python/utidylib-1.1.0

Description

TidyLib Python wrapper

Added to portage

2026-10-12

validators - 0.36.0
Ebuild name:

dev-python/validators-0.36.0

Description

Python Data Validation for Humans

Added to portage

2026-10-12

valkey - 6.2.0
Ebuild name:

dev-python/valkey-6.2.0

Description

Python client for Valkey forked from redis-py

Added to portage

2026-10-12

vanilla-kernel - 6.18.56
Ebuild name:

sys-kernel/vanilla-kernel-6.18.56

Description

Linux kernel built from vanilla upstream sources

Added to portage

2026-10-12

vanilla-kernel - 7.2.10
Ebuild name:

sys-kernel/vanilla-kernel-7.2.10

Description

Linux kernel built from vanilla upstream sources

Added to portage

2026-10-12

virtualenv - 21.14.7
Ebuild name:

dev-python/virtualenv-21.14.7

Description

Virtual Python Environment builder

Added to portage

2026-10-12

zedis - 0.13.0
Ebuild name:

dev-db/zedis-0.13.0

Description

Blazing-fast native Redis GUI built with Rust and GPUI

Added to portage

2026-10-12

rdf newsfeed | rss newsfeed | Atom newsfeed
Copyright 2004-2025 Sascha Nitsch Unternehmensberatung GmbH
- Copyright and legal notices -
Time to create this page: 29.0 ms