from small one page howto to huge articles all in one place

search text in:




Other .linuxhowtos.org sites: www.linuxhowtos.org
toolsntoys.linuxhowtos.org



Last additions:
How to make X listen on port 6000

How to make X listen on port 6000

words:

34

views:

89159

userrating:

average rating: 1.2 (52 votes) (1=very good 6=terrible)


May, 25th 2007:
April, 26th 2007:
Apr, 10th. 2007:
Druckversion . pdf icon
You are here: Portage


Details of sys-devel/gcc:

available versions:

releasesalphaamd64armhppaia64mipsppcppc64ppc macoss390shsparcx86USE-Flagsdependenciesebuild warnings
gcc-9.5.0 -------------none
show
show
gcc-8.5.0-r2 ~++~-~++-~-~+none
show
show
gcc-17.0.9999 -------------none
show
show
gcc-17.0.0_p20261011 -------------none
show
show
gcc-17.0.0_p20261004 -------------none
show
show
gcc-17.0.0_p20260927 -------------none
show
show
gcc-17.0.0_p20260920 -------------none
show
show
gcc-17.0.0_p20260913 -------------none
show
show
gcc-17.0.0_p20260906 -------------none
show
show
gcc-16.3.9999 -------------none
show
show
gcc-16.2.1_p20261010 -------------none
show
show
gcc-16.2.1_p20261003 -------------none
show
show
gcc-16.2.1_p20260926 -------------none
show
show
gcc-16.2.1_p20260912 -------------none
show
show
gcc-16.2.1_p20260905 -------------none
show
show
gcc-16.2.0 -------------none
show
show
gcc-15.3.9999 -------------none
show
show
gcc-15.3.1_p20261009 -------------none
show
show
gcc-15.3.1_p20261002 -------------none
show
show
gcc-15.3.1_p20260925 -------------none
show
show
gcc-15.3.1_p20260918 -------------none
show
show
gcc-15.3.1_p20260911 -------------none
show
show
gcc-15.3.1_p20260904 -------------none
show
show
gcc-15.3.1_p20260717 -------------none
show
show
gcc-15.3.0 -------------none
show
show
gcc-14.5.9999 -------------none
show
show
gcc-14.4.1_p20261008 -------------none
show
show
gcc-14.4.1_p20261001 -------------none
show
show
gcc-14.4.1_p20260924 -------------none
show
show
gcc-14.4.1_p20260917 -------------none
show
show
gcc-14.4.1_p20260903 -------------none
show
show
gcc-14.4.1_p20260716 -------------none
show
show
gcc-14.4.0 -------------none
show
show
gcc-14.3.1_p20260604 -------------none
show
show
gcc-13.5.0 -------------none
show
show
gcc-13.4.1_p20260603 -------------none
show
show
gcc-13.2.0 -------------none
show
show
gcc-12.5.0 -------------none
show
show
gcc-11.5.0 -------------none
show
show
gcc-10.5.0 -------------none
show
show
Legend:
+ stable
~ testing
- not available
some ebuild warning depend on specific use-flags or architectures, all ebuild-warnings are shown.

Known bugs:
bug IDcomponentassigned tostatusdescriptionlast change
365655Unclassifieddev-portageUNCONFIRMEDsys-apps/portage implicit pointer check is broken with gcc-4.52011-05-06 02:51:27
370719Core systemtoolchainUNCONFIRMEDsys-devel/gcc-4.5.2: gcda file not found for -fbranch-probabilities2011-06-11 18:32:45
371322Eclasses and ProfilesadaUNCONFIRMEDdev-lang/gnat-gcc-4.3.2 - work/gcc-4.3.2/libgcc/../gcc/unwind-pe.h:136: error: expected declaration 2012-03-19 19:22:36
371785Prefix SupportprefixUNCONFIRMEDBootstrapping gcc fails on SUSE Enterprise 11 SP02011-06-15 15:13:04
374043ApplicationsgstreamerUNCONFIRMEDmedia-plugins/gst-plugins-ffmpeg-0.10.11-r1 does not compile on x86 with mstackrealign CFLAG and gcc2011-07-10 10:04:50
378995LibrarysoundUNCONFIRMEDmedia-libs/faad2-2.7-r2: lrintf patch for gcc4.5 or greater2011-08-15 01:02:22
383581Core systemtoolchainUNCONFIRMED[Request] sys-devel/gcc-4.x: Re-add support for the D language2012-07-15 05:58:15
383605Core systemalsa-bugsUNCONFIRMEDmedia-libs/alsa-lib-1.0.23 crash when compiled with sys-devel/gcc-4.4.5 / -O32011-09-20 16:11:19
385087GCC PortingtoolchainUNCONFIRMEDsys-devel/gcc-4.4.5: gcj seem to not install needed ca-certificates (/usr/lib/security/cacerts)2012-09-24 06:08:56
385761Applicationsshell-toolsUNCONFIRMEDdev-util/colorgcc: please submit gentoo patches to upstream at github2011-10-10 14:45:07
386647HardenedhardenedUNCONFIRMEDdev-java/jamvm-1.5.4-r1 segfaults with hardened gcc-4.5.3-r1 (any profile), unless -Xnoinlining is s2012-07-11 11:36:26
386661DevelopmentadaUNCONFIRMED[portage-multilib] dev-lang/gnat-gcc: configure error for x85-abi due to gnatboot-4.4-amd64.tar.bz22012-12-25 21:03:35
388073ApplicationssbriesenUNCONFIRMEDmedia-gfx/iscan scan area selection selection problem with >=gcc-4.52012-08-26 02:58:08
388849Ebuildsmedia-videoUNCONFIRMEDmedia-video/dirac-1.0.2 fails with gcc-4.5.32011-12-06 17:32:25
389763JavajavaUNCONFIRMEDdev-java/ecj-gcj-3.5.2-r2 - /usr/libexec/gcc/i686-pc-linux-gnu/4.5.3/ecj1: symbol lookup error: /usr2011-11-08 15:48:12
392727DevelopmentadaUNCONFIRMEDdev-lang/gnat-gcc-4.3.5: fetch failed missing gnatboot-4.3-amd64.tar.bz22012-02-03 18:23:19
395609HardenedhardenedUNCONFIRMEDsys-devel/gcc-4.5.3-r2 is aware but does not honor libssp USE flag, breaking glibc upgrades2012-01-30 01:11:12
398093DevelopmentgraphicsUNCONFIRMEDsys-devel/gcc-4.6.2 with -march=bdver1 creates broken media-libs/jpeg2012-04-27 15:47:47
400701GCC PortingadaUNCONFIRMEDdev-lang/gnat-gcc-4.4.5 cannot find system.ads2012-01-25 15:19:05
403551OtheraltUNCONFIRMEDCompilation of gcc-4.5.3-r1 fails with "configure: error: Link tests are not allowed after GCC_NO_EX2012-02-14 10:57:13
409041Core systemtoolchainUNCONFIRMEDcross-x86_64-linux-uclibc/gcc-4.6.2: fails on gcc-stage1 - work/gcc-4.6.2/libgcc/generic-morestack-t2012-03-20 21:02:01
409119ApplicationscppUNCONFIRMEDdev-libs/STLport-5.2.1 - Fatal error: can't create obj/gcc/so/dll_main.o: No such file or directory2012-03-21 09:41:23
413659DevelopmentadaUNCONFIRMEDdev-lang/gnat-gcc 4.6.2 4.7.0 version bumps2012-09-11 19:00:29
414967Core systemtoolchainUNCONFIRMEDsys-devel/gcc-4.6.3 in dev-lang/gforth-0.7.0 - ./engine.c:460:1: internal compiler error: in simplif2012-06-28 17:14:55
415221Core systemtoolchainUNCONFIRMEDcross-i686-pc-mingw32/gcc-4.5.3-r2 g++ can't link programs with STL2012-06-29 20:29:50
415329ApplicationsswaponUNCONFIRMEDdev-util/kbuild-0.1.9998_pre20110817 - gcc: argument to '-o' is missing2012-12-27 20:53:03
416697Core systemtoolchainUNCONFIRMEDcross-x86_64-pc-linux-gnu/binutils-2.22-r1 - configure:4060: i686-pc-linux-gnu-gcc -O2 -march=pentiu2012-08-15 15:02:56
416757Core systemtoolchainUNCONFIRMEDcross-arm-elf/gcc-4.5.3-r2 - checking machine/endian.h usability... // .../work/gcc-4.5.3/libiberty/2012-06-17 17:06:03
417711ApplicationsgraphicsUNCONFIRMEDmedia-gfx/graphviz-2.26.3-r4 + distcc - iffe: x86_64-pc-linux-gnu-gcc : not a C compiler: should not2012-06-05 19:48:49
418209Core systemtoolchainUNCONFIRMEDcross-armv7m-none-eabi/gcc-4.5.3 stage1 cross-compiler fails2012-11-06 07:23:57
423971Core systemtoolchainUNCONFIRMEDcross-i686-pc-mingw32/gcc-4.6.3: .../build/./gcc/as: line 87: exec: -o: invalid option2012-08-11 18:52:56
425728Core systemtoolchainUNCONFIRMEDsys-libs/libstdc++-v3 sys-devel/gcc:3.3: no version information available in ia64 libstdc++.so2012-08-12 14:58:44
428416Librarymedia-videoUNCONFIRMEDmedia-video/dirac-1.0.2 with sys-devel/gcc-4.7 (graphite) - ?2012-07-30 03:55:51
429294JavajavaUNCONFIRMED=dev-java/gnu-classpath-0.98-r3 uses gcc [gcj] to build but not chcecks gcc for USE=gcj2012-09-26 09:46:31
430474ApplicationsvoipUNCONFIRMEDnet-voip/ekiga-3.2.7 with sys-devel/gcc-4.7 - ../../../../lib/engine/addressbook/source-impl.h:209:32012-12-14 13:07:23
431054Applicationsbase-systemUNCONFIRMEDnet-misc/icecast-2.3.3 USE=yp - libtool linker mangles CFLAGS ( x86_64-pc-linux-gnu-gcc: error: l1-c2012-08-12 20:10:16
431978Coredev-portageUNCONFIRMEDsys-apps/portage: FEATURES=preserve-libs missed dependency (libmpc.so.2) in /usr/libexec/gcc/x86_64-2012-12-25 20:59:53
432300Core systemtoolchainUNCONFIRMEDsys-devel/gcc-4.5.3-r2 fails to crosscompile: gcc-4.5.3/libstdc++-v3/src/atomic.cc:91:62: error: inv2012-08-22 14:43:31
433056Core systemtoolchainUNCONFIRMEDsys-devel/gcc-4.7.1 fails to crosscompile with cross-powerpc64-unknown-linux-gnu/gcc-4.6.3: cc1: err2012-10-03 01:27:13
433647ApplicationssciUNCONFIRMEDsci-libs/netcdf-4.1.3 fails with -l-L/usr/lib/gcc/x86_64-pc...2012-10-08 19:14:17
434180Core systemtoolchainUNCONFIRMEDsys-devel/gcc sandbox violation in /usr/include/DONE (dev-db/oracle-instantclient-basic creates a li2012-12-25 08:33:27
434908Core systemtoolchainUNCONFIRMEDsys-devel/gcc-4.6.3: ICE in .../work/qemu-kvm-1.1.1/target-i386/op_helper.c:3650:1: internal compile2013-01-04 21:00:13
435442ApplicationsprintingUNCONFIRMEDapp-text/pdftk-1.44 - /usr/libexec/gcc/x86_64-pc-linux-gnu/4.7.1/ecj1: symbol lookup error: /usr/lib2012-09-18 19:33:09
435784EbuildsjsbronderUNCONFIRMED=sys-cluster/ganglia-3.3.7 calling gcc/ar/ranlib directly2012-09-22 16:41:49
436636JavatoolchainUNCONFIRMEDsys-devel/gcc-{4.5,4.6,4.7?}: gcj fails to compile java source code on ia64 (hardened) - Exception i2012-12-14 08:15:05
437020Prefix SupportprefixUNCONFIRMEDbootstrap-prefix failed on gcc-4.2.4 in stage 32012-10-03 15:44:28
440308DevelopmenttoolchainUNCONFIRMEDcross-avr/gcc-4.7.2 - libgcc/configure: /var/tmp/portage/cross-avr/gcc-4.7.2/work/build/./gcc/as: li2012-10-30 19:53:50
443140EbuildscppUNCONFIRMEDdev-cpp/gccxml-0.9.0_pre20121114 version bump2012-11-14 21:10:19
444032Ebuildssci-geosciencesUNCONFIRMEDsci-geosciences/grass-6.4.2 does hardcoded GCC calls2012-11-20 14:18:52
444428Core systemppc64UNCONFIRMEDsys-devel/kgcc64: kill off usage for ppc systems2012-11-26 07:49:40
444544EbuildshaskellUNCONFIRMED[haskell overlay] dev-haskell/accelerate-cuda passes CFLAGS into non-gcc compiler2012-11-24 17:29:02
444678FreeBSDbsdUNCONFIRMEDsys-devel/gcc-4.7.2 -- build fails on G/FBSD 9.1 with USE=cxx2012-12-07 11:06:19
444762Core systemtoolchainUNCONFIRMEDsys-devel/gcc-4.6.3: multilib libjava wants 32bit jack (app-emulation/emul-linux-x86-soundlibs)2013-01-02 01:03:40
446866UnspecifiedmozillaUNCONFIRMEDdev-libs/nspr-4.9.2 - checking whether the C compiler (gcc -Os -pipe -march=armv6j -mfpu=vfp -mfloat2013-01-05 13:03:54
446968Applicationsmaintainer-neededUNCONFIRMEDnet-misc/netkit-telnetd-0.17-r10 - Use native gcc instead of CC (cross compile issue)2013-02-16 13:35:19
447708Core systemtoolchainUNCONFIRMEDsys-devel/gcc-4.7.2 fails to crosscompile for mingw64: options.c:952:3: error: ‘HAVE_GAS_ALIGNED_COM2013-02-18 16:35:04
447754Core systemhardened-kernelUNCONFIRMEDsys-kernel/vanilla-sources with sys-devel/gcc-4.6+ creates unbootable kernel images on ia642013-02-21 02:19:12
448124DevelopmenttoolchainUNCONFIRMEDsys-devel-gcc-4.5.3: internal compiler error on sci-biology/ncbi-tools++-9.0.0/work/ncbi_cxx--9_0_0/2012-12-26 17:28:43
448172Core systemtoolchainUNCONFIRMEDsys-devel/gcc-4.1.2 - /usr/lib64/libart_lgpl_2.so: could not read symbols: File in wrong format /// 2012-12-25 15:17:16
448752Core systembase-systemUNCONFIRMEDsys-devel/gettext-0.18.1.1-r3 with USE=cxx - /usr/lib/gcc/x86_64-pc-linux-gnu/4.6.3/../../../../x86_2012-12-27 02:15:45
450176Prefix SupportprefixUNCONFIRMEDbuild of gcc-4.2.4-r01.4 fails2013-01-07 08:24:34
450964Core systemtoolchainUNCONFIRMEDsys-devel/gcc-4.6.3 - make[3]: *** [jc1] Error 12013-02-10 23:17:24
451668ApplicationsproaudioUNCONFIRMEDmedia-sound/lash-0.5.4-r1 with sys-devel/gcc-4.7.2 - lash.c:203:19: error: storage size of ‘max_fds’2013-02-03 22:16:12
451840Developmentphp-bugsUNCONFIRMED=dev-lang/php-5.4.8 - /usr/lib/gcc/x86_64-pc-linux-gnu/4.5.4/../../../../lib64/libldap.so: undefined2013-01-14 12:35:20
453832CoretoolchainUNCONFIRMEDsys-devel/gcc-4.6.3: hangs in pkg_postinst2013-01-31 20:11:38
454200Core systemtoolchainUNCONFIRMEDsys-libs/glibc-2.17 breaks almost all binaries - error while loading shared libraries: libgcc_s.so.12013-02-09 05:39:00
457192HardenedhardenedUNCONFIRMEDnet-misc/quagga-0.99.21 with sys-devel/gcc-4.5.3 sometimes gives PAX: terminating task /usr/sbin/osp2013-02-21 02:32:42
458020Core systemtoolchainUNCONFIRMED[toolchain overlay] sys-libs/glibc-2.6.1 does not compile with up to date gcc and binutils (via cros2013-02-18 04:43:58
458152Ebuildsmaintainer-wantedUNCONFIRMEDdev-db/odb-2.2.0 - C++ Object-Relational Mapping (ORM) implemented as a gcc plugin2013-02-19 22:42:42
458270KDEkdeUNCONFIRMEDmedia-libs/qt-gstreamer-0.10.2: QtGLib requires >=sys-devel/gcc-4.5 as RDEPEND (libstdc++.so.6)2013-02-19 11:59:44
458554Applicationsbug-wranglersUNCONFIRMEDlibarchive-3.0.4-r1 and libarchive-3.1.1 fail compile when using gcc i686-pc-linux-gnu-4.5.4 but not2013-02-21 09:28:12


back



Support us on Content Nation

New Packages

- as rdf newsfeed
- as rss newsfeed
- as Atom newsfeed
2026-10-14
cramjam - 2.14.0
Ebuild name:

dev-python/cramjam-2.14.0

Description

Thin Python bindings to de/compression algorithms in Rust

Added to portage

2026-10-14

firefox - 153.5.0
Ebuild name:

www-client/firefox-153.5.0

Description

Firefox Web Browser

Added to portage

2026-10-14

firefox-bin - 153.5.0
Ebuild name:

www-client/firefox-bin-153.5.0

Description

Firefox Web Browser

Added to portage

2026-10-14

firefox-l10n - 153.5.0
Ebuild name:

www-client/firefox-l10n-153.5.0

Description

Firefox Web Browser's translation files

Added to portage

2026-10-14

incus - 7.5.1
Ebuild name:

app-containers/incus-7.5.1

Description

Modern, secure and powerful system container and virtual machine manager

Added to portage

2026-10-14

python-utils - 4.1.2
Ebuild name:

dev-python/python-utils-4.1.2

Description

Collection of small Python functions & classes

Added to portage

2026-10-14

sphinxcontrib-httpdomain - 2.2.0
Ebuild name:

dev-python/sphinxcontrib-httpdomain-2.2.0

Description

Sphinx domain for documenting HTTP APIs

Added to portage

2026-10-14

starlette - 1.8.0
Ebuild name:

dev-python/starlette-1.8.0

Description

The little ASGI framework that shines

Added to portage

2026-10-14

2026-10-13
aioquic - 1.6.1
Ebuild name:

dev-python/aioquic-1.6.1

Description

An implementation of QUIC and HTTP/3

Added to portage

2026-10-13

ast-serialize - 0.13.0
Ebuild name:

dev-python/ast-serialize-0.13.0

Description

Python bindings for mypy AST serialization

Added to portage

2026-10-13

async-lru - 2.4.0
Ebuild name:

dev-python/async-lru-2.4.0

Description

Simple lru_cache for asyncio

Added to portage

2026-10-13

atpublic - 9.0.0
Ebuild name:

dev-python/atpublic-9.0.0

Description

A decorator to populate __all__ and the module globals

Added to portage

2026-10-13

aws-sam-translator - 1.115.0
Ebuild name:

dev-python/aws-sam-translator-1.115.0

Description

A library that transform SAM templates into AWS CloudFormatio

Added to portage

2026-10-13

awscli - 2.37.13
Ebuild name:

app-admin/awscli-2.37.13

Description

Universal Command Line Environment for AWS

Added to portage

2026-10-13

bas - 2.7
Ebuild name:

dev-lang/bas-2.7

Description

An interpreter for the classic dialect of the programming language BASIC

Added to portage

2026-10-13

bitcoin-core - 32.0_rc4
Ebuild name:

net-p2p/bitcoin-core-32.0_rc4

Description

Reference implementation of the Bitcoin cryptocurrency

Added to portage

2026-10-13

bluetui - 0.8.2
Ebuild name:

net-wireless/bluetui-0.8.2

Description

TUI for managing bluetooth on Linux

Added to portage

2026-10-13

boto3 - 1.43.112
Ebuild name:

dev-python/boto3-1.43.112

Description

The AWS SDK for Python

Added to portage

2026-10-13

botocore - 1.43.112
Ebuild name:

dev-python/botocore-1.43.112

Description

Low-level, data-driven core of boto 3

Added to portage

2026-10-13

bpf-toolchain - 16.2.0_p1
Ebuild name:

sys-devel/bpf-toolchain-16.2.0_p1

Description

All-in-one bpf toolchain for building DTrace and systemd without

Added to portage

2026-10-13

cargo-nextest - 0.9.148
Ebuild name:

dev-util/cargo-nextest-0.9.148

Description

Next-generation test runner for Rust

Added to portage

2026-10-13

closure-compiler-bin - 20261005
Ebuild name:

dev-lang/closure-compiler-bin-20261005

Description

JavaScript optimizing compiler

Added to portage

2026-10-13

cmd2 - 4.3.0
Ebuild name:

dev-python/cmd2-4.3.0

Description

Extra features for standard library's cmd module

Added to portage

2026-10-13

cpp-httplib - 0.60.1
Ebuild name:

dev-cpp/cpp-httplib-0.60.1

Description

C++ HTTP/HTTPS server and client library

Added to portage

2026-10-13

easyeffects - 8.3.0
Ebuild name:

media-sound/easyeffects-8.3.0

Description

Limiter, auto volume and many other plugins for PipeWire applications

Added to portage

2026-10-13

exabgp - 5.0.14
Ebuild name:

net-misc/exabgp-5.0.14

Description

The BGP swiss army knife of networking

Added to portage

2026-10-13

firefox - 158.0
Ebuild name:

www-client/firefox-158.0

Description

Firefox Web Browser

Added to portage

2026-10-13

firefox-l10n - 158.0
Ebuild name:

www-client/firefox-l10n-158.0

Description

Firefox Web Browser's translation files

Added to portage

2026-10-13

flufl-lock - 10.0.0
Ebuild name:

dev-python/flufl-lock-10.0.0

Description

NFS-safe file locking with timeouts for POSIX systems

Added to portage

2026-10-13

freerdp - 3.32.2
Ebuild name:

net-misc/freerdp-3.32.2

Description

Free implementation of the Remote Desktop Protocol

Added to portage

2026-10-13

git-delete-merged-branches - 7.7.0
Ebuild name:

dev-vcs/git-delete-merged-branches-7.7.0

Description

Command-line tool to delete merged Git branches

Added to portage

2026-10-13

gobject-introspection - 1.86.0-r1
Ebuild name:

dev-libs/gobject-introspection-1.86.0-r1

Description

Introspection system for GObject-based libraries

Added to portage

2026-10-13

google-auth - 2.62.0
Ebuild name:

dev-python/google-auth-2.62.0

Description

Google Authentication Library

Added to portage

2026-10-13

haskell-mode - 17.4
Ebuild name:

app-emacs/haskell-mode-17.4

Description

Mode for editing (and running) Haskell programs in Emacs

Added to portage

2026-10-13

ijson - 3.6.0
Ebuild name:

dev-python/ijson-3.6.0

Description

Iterative JSON parser with a Pythonic interface

Added to portage

2026-10-13

installer - 1.1.0
Ebuild name:

dev-python/installer-1.1.0

Description

A library for installing Python wheels

Added to portage

2026-10-13

javacc - 8.1.0
Ebuild name:

dev-java/javacc-8.1.0

Description

Core module of JavaCC

Added to portage

2026-10-13

javacc-java - 8.1.0
Ebuild name:

dev-java/javacc-java-8.1.0

Description

Java code generator module of JavaCC

Added to portage

2026-10-13

jedi - 0.20.1
Ebuild name:

dev-python/jedi-0.20.1

Description

Autocompletion library for Python

Added to portage

2026-10-13

jemalloc - 5.4.0
Ebuild name:

dev-libs/jemalloc-5.4.0

Description

Jemalloc is a general-purpose scalable concurrent allocator

Added to portage

2026-10-13

jj - 0.46.0
Ebuild name:

dev-vcs/jj-0.46.0

Description

Jujutsu - an experimental version control system

Added to portage

2026-10-13

kup - 0.10.0
Ebuild name:

kde-plasma/kup-0.10.0

Description

Backup scheduler for the Plasma desktop

Added to portage

2026-10-13

lsp-plugins - 1.2.35
Ebuild name:

media-libs/lsp-plugins-1.2.35

Description

Linux Studio Plugins

Added to portage

2026-10-13

mycli - 2.29.4
Ebuild name:

dev-db/mycli-2.29.4

Description

CLI for MySQL Database with auto-completion and syntax highlighting

Added to portage

2026-10-13

nodejs - 26.11.1-r1
Ebuild name:

net-libs/nodejs-26.11.1-r1

Description

A JavaScript runtime built on Chrome's V8 JavaScript engine

Added to portage

2026-10-13

opal-utils - 7.1
Ebuild name:

sys-apps/opal-utils-7.1

Description

OPAL firmware utilities

Added to portage

2026-10-13

opentmux - 0.1
Ebuild name:

app-misc/opentmux-0.1

Description

Terminal multiplexer, slop-free fork of app-misc/tmux

Added to portage

2026-10-13

opentmux - 9999
Ebuild name:

app-misc/opentmux-9999

Description

Terminal multiplexer, slop-free fork of app-misc/tmux

Added to portage

2026-10-13

pekwm - 0.4.4
Ebuild name:

x11-wm/pekwm-0.4.4

Description

Lightweight window manager initially based on aewm++

Added to portage

2026-10-13

pkixssh - 20.0.1
Ebuild name:

net-misc/pkixssh-20.0.1

Description

OpenSSH fork with X.509 v3 certificate support

Added to portage

2026-10-13

pre-commit - 4.7.0
Ebuild name:

dev-vcs/pre-commit-4.7.0

Description

A framework for managing and maintaining multi-language Git pre-commit hoo

Added to portage

2026-10-13

pytest-check - 3.0.1
Ebuild name:

dev-python/pytest-check-3.0.1

Description

pytest plugin that allows multiple failures per test

Added to portage

2026-10-13

radicale - 3.8.3
Ebuild name:

www-apps/radicale-3.8.3

Description

A simple CalDAV calendar server

Added to portage

2026-10-13

ruff - 0.17.0
Ebuild name:

dev-util/ruff-0.17.0

Description

An extremely fast Python linter, written in Rust

Added to portage

2026-10-13

simdjson - 5.0.4
Ebuild name:

dev-libs/simdjson-5.0.4

Description

SIMD accelerated C++ JSON library

Added to portage

2026-10-13

tokenizers - 0.23.3
Ebuild name:

sci-ml/tokenizers-0.23.3

Description

Implementation of today's most used tokenizers

Added to portage

2026-10-13

tomcat - 10.1.61
Ebuild name:

www-servers/tomcat-10.1.61

Description

Tomcat Servlet-6.0/JSP-3.1/EL-5.0/WebSocket-2.1/JASPIC-3.0 Container

Added to portage

2026-10-13

tomcat - 11.0.27
Ebuild name:

www-servers/tomcat-11.0.27

Description

Tomcat Servlet-6.1/JSP-4.0/EL-6.0/WebSocket-2.2/JASPIC-3.1 Container

Added to portage

2026-10-13

tomcat - 9.0.123
Ebuild name:

www-servers/tomcat-9.0.123

Description

Tomcat Servlet-4.0/JSP-2.3/EL-3.0/WebSocket-1.1/JASPIC-1.1 Container

Added to portage

2026-10-13

tree-sitter-erlang - 0.21.0
Ebuild name:

dev-libs/tree-sitter-erlang-0.21.0

Description

Erlang programming language grammar for Tree-sitter

Added to portage

2026-10-13

truststore - 0.10.5
Ebuild name:

dev-python/truststore-0.10.5

Description

Verify certificates using native system trust stores

Added to portage

2026-10-13

wsjtx_improved - 3.2.0_p20260908
Ebuild name:

media-radio/wsjtx_improved-3.2.0_p20260908

Description

Weak signal ham radio communication with improvements

Added to portage

2026-10-13

yq - 4.4.5
Ebuild name:

app-misc/yq-4.4.5

Description

Command-line YAML processor - jq wrapper for YAML documents

Added to portage

2026-10-13

rdf newsfeed | rss newsfeed | Atom newsfeed
Copyright 2004-2025 Sascha Nitsch Unternehmensberatung GmbH
- Copyright and legal notices -
Time to create this page: 36.1 ms