from small one page howto to huge articles all in one place
 

search text in:




Other .linuxhowtos.org sites: www.linuxhowtos.org
toolsntoys.linuxhowtos.org



Last additions:
How to make X listen on port 6000

How to make X listen on port 6000

words:

34

views:

59280

userrating:

average rating: 1.5 (4 votes) (1=very good 6=terrible)


May, 25th 2007:
April, 26th 2007:
Apr, 10th. 2007:
Druckversion . pdf icon
You are here: Portage


Details of dev-util/rr:

Description: Record and Replay Framework
Homepage:
https://rr-project.org/

available versions:

releasesalphaamd64armhppaia64mipsppcppc64ppc macoss390shsparcx86USE-Flagsdependenciesebuild warnings
rr-5.5.0 -~----------~multilib
test
show
Test suite fails under FEATURES=usersandbox (bug #632394). Skipping.
show
Legend:
+ stable
~ testing
- not available
some ebuild warning depend on specific use-flags or architectures, all ebuild-warnings are shown.

Known bugs:
bug IDcomponentassigned tostatusdescriptionlast change
420027Enhancement/Feature Requestsdev-portageUNCONFIRMEDSkip current package2012-12-25 21:05:47
452618DevelopmentyamakuzureUNCONFIRMED[seden overlay] dev-util/eclipse-sdk-3.7.1-r10 - Bug fixes regarding incorrectly slotted virtual/jdk2013-01-17 17:45:18
457588ApplicationsxboxUNCONFIRMEDmedia-tv/xbmc-11.0 with a PaX kernel - xbmc.bin: LLVM ERROR: Allocation failed when allocating new m2013-02-15 15:39:36
435750ApplicationsxemacsUNCONFIRMEDapp-editors/xemacs-21.4.22-r2 crashes if syntax highlighting in current buffer is used2012-09-28 09:57:26
449508EbuildsxboxUNCONFIRMEDmedia-tv/xbmc-12.0_rc2 with media-video/libav-0.8.4 - configure: error: You need either libswresampl2013-01-19 19:49:11
450664Applicationsx11UNCONFIRMEDapp-emulation/wine-1.4.1 with >=x11-base/xorg-server-1.11 - mouse behaves erratically2013-01-08 04:22:22
437590Libraryx11UNCONFIRMEDmedia-libs/mesa-9.0_pre20120918: libGL error: failed to load driver: nouveau with a ATI graphic cont2012-10-24 20:57:35
433649Libraryx11UNCONFIRMEDsys-kernel/gentoo-sources-3.5, media-libs/mesa-8.1_rc1_pre20120814: i915: render error detected - In2012-09-16 12:44:13
428650Libraryx11UNCONFIRMEDmedia-libs/mesa-8.1_rc1_pre20120724 - libGL error: failed to authenticate magic 5 // libGL error: fa2012-11-18 08:31:42
428174Libraryx11UNCONFIRMEDmedia-libs/mesa-8.1_rc1_pre20120724 USE=r600-llvm-compiler - R600RegisterInfo.td:4762:27997: error: 2012-12-08 03:34:08
427302Applicationsx11UNCONFIRMEDmedia-fonts/font-alias-1.0.3 : Aliases referring to xyz-iso8859-1 when font packages install xyz-iso2012-07-24 13:58:10
423909Libraryx11UNCONFIRMEDx11-libs/xcb-util-image-0.3.9 - .../work/xcb-util-image-0.3.9/image/xcb_image.c:754:1: error: contro2012-06-28 02:58:05
421363Applicationsx11UNCONFIRMEDx11-apps/xinput_calibrator-0.7.5[-gtk] installs incorrect desktop entry2012-06-19 11:43:59
403301Applicationsx11UNCONFIRMEDx11-apps/intel-gpu-tools-1.1 - work/intel-gpu-tools-1.1/tests/testdisplay.c:760:38: error: storage s2012-02-14 18:04:33
401779Developmentx11UNCONFIRMEDx11-base/xorg-server-1.11.4 - XIO: fatal IO error 11 (Resource temporarily unavailable) on X server2012-02-01 17:35:48
381057Ebuildsx11UNCONFIRMEDkexec + x11-drivers/xf86-video-ati + sys-kernel/gentoo-sources-3.* + RadeonHD results in corrupted d2011-09-11 02:03:40
377395Libraryx11UNCONFIRMED[drm:radeon_crtc_page_flip] *ERROR* failed to reserve new rbo buffer before flip2011-08-03 08:59:16
370001EbuildswrobelUNCONFIRMED[kolab overlay] ERROR: net-mail/kolab-resource-handlers-2.1 failed (depend phase): * php-lib.ecla2011-12-31 17:37:47
451174DevelopmentwltUNCONFIRMEDdev-db/firebird-2.1.3.18185.0 - Unable to complete network request to host "localhost". Error readin2013-01-10 12:51:53
453208ApplicationswiredUNCONFIRMEDwww-client/uzbl-9999 - src/uzbl-core.h:16:25: fatal error: glib/gstdio.h: No such file or directory2013-01-21 19:18:42
454572Applicationsweb-appsUNCONFIRMEDwww-apps/phpsysinfo-3.1.0: .htaccess file syntax error for apache-2.4.32013-01-30 05:35:22
444368Applicationsweb-appsUNCONFIRMEDwww-apps/lxr fails with current dev-db/mysql. Bump version to 1.0.0?2012-11-23 16:04:59
443598Ebuildsweb-appsUNCONFIRMEDwww-apps/egroupware - Allow it to be build with PHP 5.4, it currently depends on php:5.3 through sql2013-02-16 21:35:19
395717Ebuildsweb-appsUNCONFIRMED[webapps-experimental overlay] www-apps/cforum-3.4.11 - /usr/include/bits/fcntl2.h:51:24: error: cal2011-12-28 16:56:06
458254ApplicationsvoyageurUNCONFIRMEDapp-cdr/cdrtools-3.01_alpha12 with sys-devel/clang-3.2 - sha2.c:1006:2: error: call to 'SHA384Pad' i2013-02-21 02:51:12
439676UnspecifiedvoyageurUNCONFIRMEDapp-i18n/ibus-qt-1.3.1 with clang 3.1 - qibusserializable.h:94:59: error: non-const lvalue reference2012-10-26 16:33:42
427830Core systemvoyageurUNCONFIRMEDsys-devel/clang-3.1-r4 - clang: error: unable to execute command: Illegal instruction (in .../work/l2012-07-25 14:59:26
400547DevelopmentvoyageurUNCONFIRMEDdev-libs/STLport-5.2.1 does not compile using clang++ due to error in stlport/stl/_locale.h2012-01-25 13:51:23
416827EbuildsvoyageurUNCONFIRMEDdev-libs/glib - CFLAGS="-fplugin=/usr/lib64/llvm/dragonegg.so" - gbitlock.c:210:3: sorry, unimplemen2012-09-28 13:05:51
388325EbuildsvoyageurUNCONFIRMEDsys-devel/llvm-2.9-r2 shared lib linking error2012-05-12 10:54:41
428850EbuildsvoipUNCONFIRMEDnet-libs/opal-9999 - .../work/opal-9999/src/h323/h323.cxx:3827:5: error: 'Fax' is not a member of 'O2012-10-07 14:58:53
392379ApplicationsvmwareUNCONFIRMEDapp-emulation/vmware-modules-238.5: vmmon-only/linux/hostif.c:2749:4: error: implicit declaration of2012-03-26 11:36:37
439280LibraryvadimkUNCONFIRMEDapp-emulation/vmware-modules-264.4 - missing return carriage in printk in VNetUserIfSetUplinkState()2012-10-23 10:12:15
454564ApplicationsultrabugUNCONFIRMEDapp-admin/rsyslog-7.2.5 - In file included from dnscache.c:30: /usr/include/bits/sched.h:132:20: err2013-02-09 15:08:04
420675ApplicationstuponeUNCONFIRMEDapp-misc/geneweb-5.02 - File "srcfile.ml", line 195, characters 4-56: Error: Unbound constructor Std2013-02-21 12:35:28
398089ApplicationstristanUNCONFIRMEDx11-misc/revelation-0.4.11-r2 USE=applet - configure:13842: error: failed to find module gnomeapplet2012-01-10 00:03:01
372375ApplicationstoveUNCONFIRMEDapp-shells/zsh-4.3.11-r1 error: "compaudit:107: unknown group"2012-12-22 09:22:46
454492Toolstools-portageUNCONFIRMEDapp-portage/gentoolkit-0.3.0.7 - eclean-dist: UnboundLocalError: local variable 'cleaner' referenced2013-01-29 17:40:16
443744Toolstools-portageUNCONFIRMEDapp-portage/gentoolkit -- euse displays a lot of error messages on Gentoo/FreeBSD2012-11-19 09:11:08
395947Third-Party Toolstools-portageUNCONFIRMEDincorrect revdep-rebuild order for libx264.so.1192011-12-27 00:13:59
373823Toolstools-portageUNCONFIRMEDapp-portage/gentoolkit-0.3.0.4: `euse -i` dumps errors about missing repo_name files2012-12-25 01:55:28
454200Core systemtoolchainUNCONFIRMEDsys-libs/glibc-2.17 breaks almost all binaries - error while loading shared libraries: libgcc_s.so.12013-02-09 05:39:00
450964Core systemtoolchainUNCONFIRMEDsys-devel/gcc-4.6.3 - make[3]: *** [jc1] Error 12013-02-10 23:17:24
450714Core systemtoolchainUNCONFIRMEDsys-libs/glibc-2.16.0: /usr/include/bits/stdlib-ldbl.h:35:1: error: 'qecvt' undeclared here (not in 2013-01-20 01:23:38
448124DevelopmenttoolchainUNCONFIRMEDsys-devel-gcc-4.5.3: internal compiler error on sci-biology/ncbi-tools++-9.0.0/work/ncbi_cxx--9_0_0/2012-12-26 17:28:43
447708Core systemtoolchainUNCONFIRMEDsys-devel/gcc-4.7.2 fails to crosscompile for mingw64: options.c:952:3: error: ‘HAVE_GAS_ALIGNED_COM2013-02-18 16:35:04
445132Core systemtoolchainUNCONFIRMEDsys-devel/gdb-7.5: build fails w/-ftracer on amd64: linux-x86-low.c:2939: Error: symbol 'start_i386_2012-11-29 19:36:23
438996EbuildstoolchainUNCONFIRMEDsys-devel/binutils-2.23.51.0.x: gold/powerpc.cc:3255:1: error: prototype for 'typename elfcpp::Elf_t2012-12-29 21:25:21
433778Core systemtoolchainUNCONFIRMEDsys-devel/prelink-20120628: prelink: gelf_getphdr.c:120: gelf_getphdr: Unexpected error: Resource te2012-12-25 07:40:36
433056Core systemtoolchainUNCONFIRMEDsys-devel/gcc-4.7.1 fails to crosscompile with cross-powerpc64-unknown-linux-gnu/gcc-4.6.3: cc1: err2012-10-03 01:27:13
432300Core systemtoolchainUNCONFIRMEDsys-devel/gcc-4.5.3-r2 fails to crosscompile: gcc-4.5.3/libstdc++-v3/src/atomic.cc:91:62: error: inv2012-08-22 14:43:31
428220ApplicationstoolchainUNCONFIRMEDwww-client/firefox-10.0.5 - ld: BFD (GNU Binutils) 2.21.1 internal error, aborting at /var/tmp/porta2012-07-27 17:14:46
427178Core systemtoolchainUNCONFIRMEDsys-libs/glibc-2.14.1-r3 - grsec: Invalid alignment/Bus error occurred at 00000301ad4cb768 in /lib642012-11-02 18:28:59
414967Core systemtoolchainUNCONFIRMEDsys-devel/gcc-4.6.3 in dev-lang/gforth-0.7.0 - ./engine.c:460:1: internal compiler error: in simplif2012-06-28 17:14:55
373295UnspecifiedtoolchainUNCONFIRMEDsys-libs/glibc-2.12.2: building glibc interrupted in OpenVZ container, also tried rebuilding system2011-12-22 22:40:58
370087Core systemtoolchainUNCONFIRMEDsys-libs/glibc-2.12.2: MAKEOPTS=-s: ld hits internal error at bfd/elf32-i386.c:2946:elf_i386_relocat2012-04-13 23:36:33
435338ApplicationstexUNCONFIRMEDdev-tex/chktex-1.7.0 - .../work/chktex-1.7.0/FindErrs.c:320: warning: implicit declaration of functi2012-09-18 13:41:50
455282LibrarytitanofoldUNCONFIRMEDdev-libs/libpqxx-4.0.1 with python 3.x - TypeError: 'str' does not support the buffer interface2013-02-19 08:19:43
452910Core systemsystemdUNCONFIRMEDsys-apps/systemd-196[python] needs dev-python/pygobject:3 - ImportError: No module named gi.reposito2013-01-20 17:07:04
438464UnspecifiedsysadminUNCONFIRMEDnet-analyzer/nagios-3.3.1: apache-2.4.3 fails to start with Syntax error on line 6 of /etc/apache2/2012-12-14 16:11:32
455072ServerswegenerUNCONFIRMEDnet-dns/pdns-3.1 with USE="sqlite3" - checking for SQLITE3... configure: error: +Could not find sqli2013-02-02 17:34:19
417639DevelopmentswegenerUNCONFIRMEDdev-util/systemtap-1.7: error: gettext infrastructure mismatch: using a Makefile.in.in from gettext 2012-12-15 13:34:09
455162DevelopmentssuominenUNCONFIRMEDdev-util/catfish-0.4.0.2 needs dev-python/pygobject:3 in RDEPEND - Error: The required module gi.rep2013-02-04 02:33:15
443600ApplicationssoundUNCONFIRMEDmedia-libs/libsndfile-1.0.25 - Fails test with SyntaxError: invalid syntax in binheader_writef_check2012-11-17 18:45:12
431066UnspecifiedsoundUNCONFIRMEDmedia-libs/libvisual - error: 'sigill_handler_sse' undeclared (first use in this function)2012-11-05 15:00:00
417429ApplicationssoundUNCONFIRMEDmedia-sound/jack-3.1.1 - src_install(): SyntaxError: ('invalid syntax', ('/usr/lib64/python2.7/site-2013-01-27 12:28:16
403627ApplicationssoundUNCONFIRMEDmedia-sound/herrie-2.2 doesn't honor LINGUAS for locale files2012-02-23 21:38:44
447064ApplicationssgmlUNCONFIRMEDapp-text/build-docbook-catalog - file:///etc/xml/docbook:1: parser error : Document is empty2012-12-13 16:31:25
408859Applicationsshell-toolsUNCONFIRMEDapp-misc/byobu-5.16: byobu-config option Help broken, IOError: No such file '/usr/share/doc/byobu/he2013-02-06 16:13:39
451626Applicationssci-mathematicsUNCONFIRMED[science overlay] sci-mathematics/scilab-5.4.0 - buildDoc: Error while building documentation: Could2013-02-12 03:35:49
435906Applicationssci-mathematicsUNCONFIRMEDsci-mathematics/octave-3.6.2-r1 - .../work/octave-3.6.2/src/.libs/octave: error while loading shared2013-02-04 21:38:37
441760Ebuildssci-geosciencesUNCONFIRMEDsci-geosciences/gpsd-3.7 - NameError: name 'gps_regress' is not defined: File "/var/tmp/portage/sc2012-11-07 02:15:55
456404Applicationssci-geosciencesUNCONFIRMEDsci-geosciences/gpsbabel-1.4.4 - shape.c:23:29: fatal error: libshp/shapefil.h: No such file or dire2013-02-12 14:56:18
421417Ebuildssci-electronicsUNCONFIRMEDsci-electronics/kicad-99999999 - .../work/kicad-99999999/include/common.h:50:9: error: #error "You m2012-07-07 20:05:00
450322Applicationssci-biologyUNCONFIRMEDsci-biology/mira-3.4.0.2 - libtool: Version mismatch error. This is libtool 2.4, but the definition2013-02-17 09:09:47
418625Applicationssci-biologyUNCONFIRMEDsci-biology/gatk-1.5: error: name clash: sum(Collection) and sum(Collection) have t2013-02-17 08:28:02
368473Applicationssci-biologyUNCONFIRMEDsci-biology/hmmer-3.0 fails to build with "mpi.c:27:23: error: impl_dummy.: No such file or director2011-06-21 09:31:43
436100LibrarysciUNCONFIRMEDsci-libs/scipy 0.9.0-r1 with media-libs/qhull-2012.1-r1 - scipy/spatial/qhull.c:206:25: fatal error:2013-02-03 13:03:23
444104ApplicationssciUNCONFIRMEDsci-libs/scipy-0.11.0 - numpy.distutils.system_info.BlasNotFoundError2012-12-06 15:49:39
448110DevelopmentsciUNCONFIRMEDdev-python/rpy-2.2.6-r1 fails test testInterruptR - AssertionError: True is not false2013-01-23 17:03:53
435812ApplicationssciUNCONFIRMED[science overlay] sci-libs/umfpack-5.5.2 - configure: error: Cannot find blas libraries2012-09-22 17:01:25
424461EbuildssciUNCONFIRMED[science overlay] app-portage/g-octave-9999 fails running with ImportError: cannot import name Confi2012-07-02 10:57:20
405873ApplicationssciUNCONFIRMEDscience [overlay] sci-libs/lapackpp-2.5.4: configure: error: Blas/Lapack was not found.2012-02-27 02:46:24
454634DevelopmentrubyUNCONFIRMEDdev-lang/ruby-1.8.7_p371 - callback.func:1:7: error: expected identifier or '(' before 'long'2013-01-30 23:00:08
431200ApplicationsrubyUNCONFIRMEDdev-lang/rubinius-1.2.4.20110705 - m/builtin/unpack.cpp:284:5: error: narrowing conversion of ‘214742013-02-12 09:50:38
411805DevelopmentrubyUNCONFIRMEDdev-lang/ruby-1.9.3_p125 - openssl_missing.h:71:6: error: conflicting types for ‘HMAC_CTX_copy’2012-04-14 21:28:46
438708ApplicationsroxUNCONFIRMED2012-10-17 14:29:58
451394Applicationsrobbat2UNCONFIRMEDsci-mathematics/nusmv-2.5.2 USE=minisat - SolverTypes.h:126:56: error: cast from 'void*' to 'int' lo2013-01-12 16:25:09
451452Core systemrobbat2UNCONFIRMEDsys-fs/lvm2-2.02.97-r1 - Errors on LV create/delete operations in systemd-196 environment.2013-02-07 01:16:09
452124Core systemrobbat2UNCONFIRMEDsys-process/audit-2.2.2 with sys-devel/automake-1.13.1 - configure.ac:34: error: 'AM_CONFIG_HEADER':2013-01-15 17:29:39
448470Core systemrobbat2UNCONFIRMEDsys-process/audit-2.2.2 incorrectly suggests removal of /lib/libauparse.so.02013-02-03 19:08:30
448354Core systemrobbat2UNCONFIRMEDsys-fs/lvm2-2.02.97-r1 fails to crosscompile: configure: error: thin_check not found in path2013-01-19 16:12:30
446828Applicationsrobbat2UNCONFIRMEDnet-analyzer/sslsniff-0.8-r1 - conftest.cpp:21:26: fatal error: boost/asio.hpp: No such file or dire2012-12-11 22:11:50
429450Core systemrobbat2UNCONFIRMEDsys-apps/hwinfo-19.1 - hwinfo[NNNNN]: segfault at NNN ip NNNNNNNNNNNNNNNN sp NNNNNNNNNNNNNNNN error 2013-02-19 20:31:17
407627Applicationsrobbat2UNCONFIRMEDsys-power/pmtools-20110323 turbostat.c:857:2: error: PIC register clobbered by ‘ebx’ in ‘asm’2012-10-07 09:44:42
402925Ebuildsrobbat2UNCONFIRMEDdev-libs/yaz-3.0.50 with dev-libs/libgpg-error-1.10-r1[-static-libs] - libtool: grep: /usr/lib/libgp2012-02-10 18:05:02
402645Developmentrobbat2UNCONFIRMEDapp-portage/g-cpan-0.16.4 fails to install Spreadsheet::XLSX due to "[in]correct package syntax"2012-02-13 21:18:27
449352Gamesrich0UNCONFIRMEDgames-rpg/eternal-lands Assertion `self' failed (runtime error)2013-01-03 00:24:17
366509Applicationsrobbat2UNCONFIRMEDdev-db/libdbi-drivers-0.8.3: uses incorrect query for listing tables on PostgreSQL database2011-05-12 18:58:07
454652StagesreleaseUNCONFIRMEDcurrent stage3-amd64-nomultilib has an immediate block between sys-apps/module-init-tools and sys-ap2013-01-30 14:46:25
442320InstallCDreleaseUNCONFIRMEDinstall-cd (sparc) - errors at boot2012-12-16 05:42:05
429646GamesreavertmUNCONFIRMEDdev-games/openscenegraph-3.0.1 with sys-devel/clang-3.1 - error: cannot initialize a parameter of ty2012-08-04 00:29:11
434236DevelopmentrafaelmartinsUNCONFIRMEDdev-lua/luafilesystem-1.5.0 with dev-lang/lua-5.2.1: src/lfs.c:779:30: error: array type has incompl2013-02-03 13:08:19
435266EbuildsrafaelmartinsUNCONFIRMEDdev-vcs/mercurial-server-1.2 refresh-auth fails with a syntax error2012-09-17 11:51:10
373891EbuildsramerethUNCONFIRMEDnet-misc/stunnel build fails: #error OpenSSL library compiled without thread support2012-12-25 04:27:10
458278DevelopmentqtUNCONFIRMEDdev-util/eric-5.2.7 - RuntimeError: the sip module implements API v9.0 to v9.1 but the PyKDE4.kdeui 2013-02-21 12:24:07
448178LibraryqtUNCONFIRMED[qt overlay] x11-libs/qt-webkit-5.0.0: Project ERROR: Unknown module(s) in QT: opengl2013-01-09 08:46:26
448830LibraryqtUNCONFIRMEDx11-libs/qt-openvg-4.8.4 - qpaintengine_vg.cpp:3212:5: error: narrowing conversion of ‘d->QVGPaintEn2013-02-17 11:26:14
448910Applicationsqmail-bugsUNCONFIRMEDmail-mta/netqmail-1.06 - Force python version to 2.x. - pkg_postinst - SyntaxError: invalid token "02012-12-28 13:08:59
405899Applicationsqmail-bugsUNCONFIRMEDnet-mail/queue-repair - /usr/bin/queue-repair.py: AttributeError: 'dict_keys' object has no attribut2012-02-27 01:35:46
454176DevelopmentpythonUNCONFIRMEDdev-lang/python - LONG_BIT error cross-building from 64-bit to 32-bit2013-01-26 18:17:25
371637DevmanualqaUNCONFIRMEDarrow syntax (->) is missing in SRC_URI documentation2011-12-20 19:42:23
445081ApplicationspythonUNCONFIRMEDnet-zope/zope-interface-3.8.0 - src_test(): TypeError: metaclass conflict: the metaclass of a derive2013-02-02 10:01:54
431058Eclasses and ProfilespythonUNCONFIRMEDdev-util/gdbus-codegen-2.32.4 - /usr/portage/eclass/python-distutils-ng.eclass: line 206: syntax err2012-08-12 16:45:06
431388ApplicationspythonUNCONFIRMEDdev-python/ipython-0.13 -AttributeError: 'StoreMagics' object has no attribute 'db'2012-08-14 15:08:54
433175ApplicationspythonUNCONFIRMEDdev-lang/python-2.7.3-r2: Exception AttributeError: AttributeError("'_DummyThread' object has no att2012-09-03 18:23:18
431788EbuildspythonUNCONFIRMEDdev-python/ipython-0.13 does not correctly calculate USE dependencies2012-08-18 22:14:28
427244DevelopmentpythonUNCONFIRMEDdev-python/networkx 1.7 - Syntax errors / warnings in Python modules for CPython 3.2: File "/usr/lib2013-01-22 11:57:15
402659DevelopmentpythonUNCONFIRMEDdev-python/pydb-1.26-r1 - ImportError: No module named fns2012-04-24 16:19:54
377925DevelopmentpythonUNCONFIRMEDdev-python/docutils-0.[78]: TypeError: can't use a bytes pattern on a string-like object2011-10-07 21:22:24
366571DevelopmentpythonUNCONFIRMEDapp-admin/eselect-python: override python version from environment2011-07-29 06:41:23
451668ApplicationsproaudioUNCONFIRMEDmedia-sound/lash-0.5.4-r1 with sys-devel/gcc-4.7.2 - lash.c:203:19: error: storage size of ‘max_fds’2013-02-03 22:16:12
435270LibraryproaudioUNCONFIRMEDmedia-libs/aubio-0.3.2-r1 - SyntaxError: ('invalid syntax', ('/usr/lib64/python2.7/site-packages/aub2012-09-17 11:44:31
413623ApplicationsproaudioUNCONFIRMEDmedia-sound/terminatorx 3.82 and 3.84 - tX_midiin.cc:452:2: error: cannot convert ‘gzFile_s**’ to ‘g2013-01-06 04:23:20
414447LibraryproaudioUNCONFIRMEDmedia-libs/lv2core-3.0 (with python 3) - ./waf: SyntaxError: invalid syntax2012-12-08 20:52:16
396211ApplicationsproaudioUNCONFIRMEDmedia-sound/ardour crashes - /usr/share/themes/Clearlooks/gtk-2.0/gtkrc:76: error: unexpected identi2012-10-06 14:26:04
455238LibraryprintingUNCONFIRMEDmedia-libs/vigra-1.7.1-r1 failed (compile phase): ImportError: No module named nose2013-02-05 01:00:18
440886PrintingprintingUNCONFIRMEDnet-print/cups-bjnp-1.1 - In file included from bjnp-io.c:22:0: bjnp-protocol.h:100:5: error: redefi2013-02-11 11:01:36
435442ApplicationsprintingUNCONFIRMEDapp-text/pdftk-1.44 - /usr/libexec/gcc/x86_64-pc-linux-gnu/4.7.1/ecj1: symbol lookup error: /usr/lib2012-09-18 19:33:09
414593PrintingprintingUNCONFIRMEDapp-text/ghostscript-gpl 9.05-r1 - ld: error in ./sobin/libgs.so(.eh_frame); no .eh_frame_hdr table 2012-12-19 23:42:44
399741PrintingprintingUNCONFIRMEDmedia-libs/plotutils-2.6 - g_miscmi.c:26:58: fatal error: xmi.h: No such file or directory2013-02-12 05:34:31
457770ApplicationsprefixUNCONFIRMEDdev-lang/R not linking to correct (Prefix) gfortran library2013-02-18 19:16:23
452180Prefix SupportprefixUNCONFIRMEDx11-libs/libdrm-2.4.40 - .../work/libdrm-2.4.40/intel/intel_bufmgr_gem.c:2480:11: error: 'O_CLOEXEC'2013-01-15 16:42:21
455512Prefix SupportprefixUNCONFIRMEDsys-libs.readline has an incorrect install_name which trigger install failure because of QA2013-02-05 01:02:35
447556Mac OSXprefixUNCONFIRMEDdev-python/virtualenv-1.8.4 emerge failed with error virtualenv-3.3 already exists2013-01-19 18:48:58
418333Prefix SupportprefixUNCONFIRMEDnet-proxy/nylon-1.21: configure: error: libevent not found2012-10-09 21:20:43
412773Prefix SupportprefixUNCONFIRMEDapp-editors/emacs-vcs: Includes incorrect libpng header file2012-04-22 13:12:19
400843Prefix SupportprefixUNCONFIRMEDdev-python/pygtk-2.24.0-r2 fails to build on OS 10.7 with numerous errors2012-07-13 10:10:03
384581Mac OSXprefixUNCONFIRMEDapp-editors/emacs-23.3-r2: emerge failed with error unexec: my_endbss_static is not in section __bss2011-10-31 03:04:33
442406Toolsportage-utilsUNCONFIRMEDapp-portage/portage-utils-0.10: 'qlop -c' should show current package order number2012-11-09 17:24:59
456354Applicationspolynomial-cUNCONFIRMEDapp-emulation/virtualbox-4.2.6-r1 fails to build. kmk_builtin_mv shows options help. kmk error 642013-02-11 17:25:35
376435Prefix SupportprefixUNCONFIRMEDnet-libs/libpcap-1.1.1-r1 - ./pcap-usb-linux.c:228: error: storage size of 'ctrl' isn't known2011-12-19 02:04:51
413339ApplicationsppcUNCONFIRMEDsys-apps/powerpc-utils should use mirror://debian/ in SRC_URI2012-04-25 22:15:00
447356Unspecifiedpolynomial-cUNCONFIRMEDapp-emulation/virtualbox-modules-4.2.4 with kernel 3.7 - modprobe: FATAL: Error inserting vboxdrv (/2013-02-14 10:04:16
444464Applicationspolynomial-cUNCONFIRMEDapp-emulation/virtualbox-4.1.22 - .../work/VirtualBox-4.1.22/src/VBox/Runtime/common/err/errmsg.sed 2012-12-23 18:15:49
431144Applicationspolynomial-cUNCONFIRMEDnet-irc/xchat-2.8.8-r2 - saved configuration is corrupted on read or write2012-08-15 12:32:17
456928Applicationsphp-bugsUNCONFIRMEDdev-lang/php-5.4.8[imap] - ./conftest: symbol lookup error: /usr/lib64/libc-client.so.1: undefined s2013-02-13 19:05:07
435390Applicationsphp-bugsUNCONFIRMEDdev-lang/php-5.4.7 - .../work/sapis-build/cli/ext/dba/dba_cdb.c:59:2: error: unknown type name 'uint2012-09-18 13:59:57
395399UnspecifiedperlUNCONFIRMEDapp-portage/perl-info: can't print out error message if PORTDIR is not set2011-12-20 20:21:36
458470ServerpatrickUNCONFIRMEDwww-servers/apache-2.4.3 - Syntax error on line 156 of /etc/apache2/httpd.conf: Invalid command 'Use2013-02-20 15:13:48
445120LibrarypatrickUNCONFIRMEDsys-libs/tdb-1.2.10 - Compilatin phase failed - [Errno 2] No such file or directory: '/var/tmp/porta2012-12-08 15:46:16
444218ApplicationspatrickUNCONFIRMEDwww-servers/apache-2.4.3 - init script doesn't handle failed start correctly2013-02-16 13:19:08
438758ServerpatrickUNCONFIRMEDwww-servers/apache-2.4 - Syntax error on line 60 of /etc/apache2/modules.d/40_mod_ssl.conf: Invalid 2013-02-16 13:32:50
410451ApplicationspatrickUNCONFIRMEDwww-servers/apache-2.4.1-r1 APACHE2_MPMS="itk" - configure: error: MPM itk is not supported on this 2013-02-16 13:20:37
409303ApplicationspatrickUNCONFIRMEDdev-lang/nqp-2012.02 - In file included from dyncall_thunk.c:27:0: dyncall_thunk.h:59:1: error: func2012-03-22 14:55:21
406187LibrarypatrickUNCONFIRMEDsys-libs/talloc-2.0.7 - [Errno 2] No such file or directory: '/var/tmp/portage/sys-libs/talloc-2.0.72012-03-29 20:03:40
396179ApplicationspatrickUNCONFIRMEDdev-lang/nqp-2011.10 - /usr/bin/parrot: symbol lookup error: dynext/nqp_group.so: undefined symbol: 2011-12-27 21:15:43
458320ApplicationsottxorUNCONFIRMEDgoogle-talkplugin-3.13.2.0 does not work correctly2013-02-20 10:16:03
458074OpenRCopenrcUNCONFIRMEDsys-apps/openrc-0.11.8 doesn't parse correctly options contained two words abreast self2013-02-18 13:35:38
427998OpenRCopenrcUNCONFIRMEDsys-apps/openrc: The root script does not work correctly if root or any filesystems it remounts are 2012-10-18 17:42:12
410719ApplicationsnxUNCONFIRMEDnet-misc/nxclient - nxclient: symbol lookup error: /usr/lib/libfontconfig.so.1: undefined symbol: FT2012-04-04 02:19:00
452484ApplicationsnikoliUNCONFIRMED=media-video/mplayer2-2.0_p20120828 ABI=x32 - cpudetect.c:206: Error: invalid instruction suffix for2013-01-29 12:55:58
429372EbuildsnirbheekUNCONFIRMEDdev-python/pypy-1.9-r1 FEATURES=sandbox - Fatal error during initialization: out of memory2012-08-02 11:53:03
424365EbuildsnirbheekUNCONFIRMEDdev-python/pypy-1.9-r1: AssertionError: must come from an argument to the function, got <-88;esp>2012-07-03 14:41:31
376201ApplicationsnirbheekUNCONFIRMEDx11-themes/murrine-themes-0.98.0: NOX theme shows "Murrine configuration option 'gradients' is no lo2011-08-27 23:06:28
450674ApplicationsnetmonUNCONFIRMEDnet-analyzer/rrdtool needs a group for rrdcached2013-01-07 12:07:36
439652EbuildsnetmonUNCONFIRMEDnet-analyzer/rrdtool rrdcached init script should drop need net2012-10-26 16:27:07
386621ApplicationsnetmonUNCONFIRMEDnet-analyzer/metasploit SLOT correction request2012-03-26 03:21:46
405765ApplicationsnetmonUNCONFIRMEDnet-analyzer/rrdtool-1.4.5-r2 - main.c:(.text+0x26c): undefined reference to `rrd_xport'2012-08-26 06:23:55
383055EbuildsnetmonUNCONFIRMEDnet-analyzer/rrdtool[ruby] - fails to compile2011-09-16 22:56:02
437970Servernet-proxyUNCONFIRMEDnet-proxy/http-replicator-3.0-r3 - ERROR: HttpClient 1 caught an exception in __getattr__: HttpClien2012-10-11 13:53:15
446184Applicationsnet-p2pUNCONFIRMEDnet-libs/libtorrent-0.13.2: fails to cross compile2012-12-06 05:02:50
446186Applicationsnet-p2pUNCONFIRMEDnet-p2p/rtorrent-0.9.2: bad configure check prevents cross-compilation2012-12-06 05:03:19
449818Applicationsnet-p2pUNCONFIRMEDnet-p2p/deluge-1.3.5 with >=net-libs/rb_libtorrent-0.16 - metadata for torrents added using a magnet2013-01-03 12:09:55
444700Applicationsnet-p2pUNCONFIRMEDnet-p2p/rtorrent-0.9.2 could not start initscript2012-12-29 14:14:37
426912Librarynet-p2pUNCONFIRMEDnet-p2p/deluge unicode casting problems with net-libs/rb_torrent 0.16.x2013-01-26 06:22:29
401681Applicationsnet-p2pUNCONFIRMEDnet-misc/curl-7.24.0 with net-p2p/rtorrent-* leads to 100% CPU load.2013-01-01 14:36:36
406685Ebuildsnet-p2pUNCONFIRMEDapp-arch/torrentzip-0.9 version bump request2012-12-30 07:20:56
394885Applicationsnet-p2pUNCONFIRMEDnet-p2p/rtorrent-0.8.9 fails to link because of missing lpthread for LIBS2011-12-16 02:48:12
399115Ebuildsnet-p2pUNCONFIRMEDnet-p2p/rtorrent-0.8.9 - .../work/rtorrent-0.8.9/src/core/download.h:76:84: error: ‘class core::Down2012-04-08 10:10:28
378413Applicationsnet-newsUNCONFIRMED[patch] net-news/yarssr-0.2.2-r1: URL Handler fails to launch correct URL in web browser2011-08-11 15:04:02
403459Applicationsnet-mailUNCONFIRMEDnet-mail/perdition-1.18 - options.h:42:14: error: conflicting types for ‘gdbm_version’2012-12-04 18:16:40
400609Unspecifiednet-mailUNCONFIRMEDnet-mail/perdition-1.18 - fails to build with errors because of a multi line macro in net-libs/vanes2012-12-04 18:16:40
447034Applicationsnet-imUNCONFIRMEDnet-im/mcabber-0.10.2 - Doesn't build without USE+="crypt otr" - configure.ac: error: possibly undef2013-02-02 00:21:02
439550Applicationsnet-imUNCONFIRMEDx11-plugins/pidgin-otr-3.2.1 - configure: error: libotr 3.2.0 or newer is required.2012-10-25 15:42:02
458024Applicationsnet-fsUNCONFIRMEDnet-nds/rpcbind with sys-libs/uclibc - security.c:23:26: fatal error: rpcsvc/mount.h: No such file o2013-02-20 11:38:41
381279Servernet-imUNCONFIRMEDnet-im/jabberd2-2.2.4: error: XML parse error (not well-formed (invalid token)) in c2s log for some 2012-10-20 06:45:03
414451Ebuildsnet-fsUNCONFIRMEDnet-fs/netatalk-2.2.2 USE=kerberos with app-crypt/heimdal - uams_gss.c:201:37: error: 'gss_nt_servic2012-05-03 16:05:11
413173Applicationsnet-fsUNCONFIRMEDnet-fs/nfs-utils - /etc/init.d/nfs and /etc/init.d/nfsmount calculate their dependencies incorrectly2012-05-18 05:15:48
449950Applicationsnet-dialupUNCONFIRMED=net-dialup/pptpd-1.3.4-r1 incorrect restart: no matching processes found2013-01-17 06:58:53
382055Servermysql-bugsUNCONFIRMEDmod-auth-mysql-4.3.9: The module crashes when the web service is under heavy concurrent load2012-11-27 20:00:04
442322Ebuildsmysql-bugsUNCONFIRMEDdev-db/myodbc-5.1.6 - Build fails against dev-db/mysql-5.5.28 - error: too many arguments to functio2013-02-09 20:29:48
456904ApplicationsmozillaUNCONFIRMED[mozilla overlay] dev-lang/spidermonkey-1.8.8 - ./dist/include/js/HashTable.h:898:9: error: size of 2013-02-12 16:50:39
451504ApplicationsmozillaUNCONFIRMEDwww-client/firefox-18.0/www-client/seamonkey-2.15 failed (install phase) [to emerge]; incorrect pag2013-02-07 15:47:44
439244UnspecifiedmozillaUNCONFIRMEDwww-client/firefox-16.0.1 - .../work/mozilla-release/memory/jemalloc/src/src/jemalloc.c:1736:1: erro2013-01-14 08:53:52
427048ApplicationsmozillaUNCONFIRMEDwww-client/firefox-14.0.1 fails to build with ABI x32 - /usr/include/bits/sysctl.h:19:3: error: #err2013-01-16 13:49:43
415705EbuildsmozillaUNCONFIRMEDdev-libs/nspr-4.9: native-nsinstall: cannot access nspr-config (error installations by cross compila2013-01-05 13:03:46
453204Librarymobile-phoneUNCONFIRMEDdev-libs/libvformat-1.13-r2: fix some API documentation errors2013-01-21 12:38:15
435674Applicationsmobile-phoneUNCONFIRMEDapp-mobilephone/gnome-phone-manager-0.68: phonemgr.c:47:2: error: too many arguments to function 'bl2012-12-18 08:29:47
453338LibrarymlUNCONFIRMEDdev-ml/lablgl-1.04 - File "togl.mli", line 4, characters 14-29: Error: Unbound module Widget2013-02-01 06:27:17
452032Server Problemmirror-adminUNCONFIRMEDrsync.samerica.gentoo.org mirror: Input/Output error2013-01-14 14:05:17
455090New Servermirror-adminUNCONFIRMEDdistfiles source mirror2013-02-02 06:40:17
446304DevelopmentmlUNCONFIRMEDdev-lang/ocaml-4.00.1 +ocamlopt fails w/ *** [camlp4opt] Error 2552012-12-07 11:36:00
442818DevelopmentmlUNCONFIRMEDdev-lang/smlnj-110.75 - bin/sml: Fatal error -- bogus fault not in ML: sig = 11, code = 0x5356c35d, 2012-11-12 22:21:25
456352New Servermirror-adminUNCONFIRMEDnew full mirror (Europe - Czech Republic - Prague)2013-02-09 21:13:53
457122New Servermirror-adminUNCONFIRMEDNew (full+rsync) mirror in Czech Republic2013-02-13 16:30:52
447120Server Problemmirror-adminUNCONFIRMEDrsync://mirrors.eu.kernel.org/gentoo-portage/ out of sync2012-12-13 15:39:56
445634Feature Requestmirror-adminUNCONFIRMEDmirrorservice.org mirror: update URLs2012-12-02 15:44:23
444310New Servermirror-adminUNCONFIRMEDNew Full mirror has been configured.2012-11-27 17:40:36
443958Server Problemmirror-adminUNCONFIRMEDrsync.nl.gentoo.org / 195.241.77.98 (tiscali) often reports "@ERROR: max connections (15) reached --2012-11-19 21:19:27
435162New Servermirror-adminUNCONFIRMED[full+rsync] New mirror: University of Nebraska at Omaha, College of IS&T (US)2012-09-15 20:30:25
437924Feature Requestmirror-adminUNCONFIRMEDThe list of rsync mirrors should have correct path or notify user of path2012-10-11 02:16:35
394771Server Problemmirror-adminUNCONFIRMEDChanges to Gentoo Mirror of Star Studio, UESTC2012-07-02 08:20:51
435142New Servermirror-adminUNCONFIRMEDNew mirror ftp.plusline.de2012-09-15 18:11:35
405533EbuildsmgornyUNCONFIRMEDFix mirror usage in SRC_URI for multiple ebuilds2012-04-24 11:03:23
454568Librarymedia-videoUNCONFIRMEDmedia-libs/mlt-0.8.8 - luma.c:92:11: erreur interne du compilateur: dans build2_stat, à tree.c:38032013-02-01 10:14:17
452482Applicationsmedia-videoUNCONFIRMEDmedia-video/libav-0.8.5 ABI=x32 - libavutil/x86/cpu.c:52: Error: invalid instruction suffix for `pus2013-02-03 00:43:50
449238Applicationsmedia-videoUNCONFIRMEDmedia-video/gpac-0.5.0 should use --extra-cflags in configure instead of overriding OPTFLAGS2012-12-31 15:11:00
433375Applicationsmedia-videoUNCONFIRMEDmedia-video/cinelerra ignores LDFLAGS, causing multilib compile failure2012-11-20 12:23:36
427004Applicationsmedia-videoUNCONFIRMEDmedia-video/ffmpeg-0.10.3 ABI=x32 - libavfilter/libmpcodecs/vf_ilpack.c:116: Error: operand type mis2012-09-25 03:49:30
426248Librarymedia-videoUNCONFIRMEDmedia-libs/libvpx-1.1.0 builds with incorrectly -m64 on x322012-09-25 05:38:06
414911Applicationsmedia-videoUNCONFIRMEDErrors while reading video-dvd with label contains special characters2012-05-20 15:31:07
406735Applicationsmedia-videoUNCONFIRMEDmedia-video/vlc-2.0.0 - erratic audio volume behaviour under Gnome32012-09-19 13:09:42
412457Librarymedia-videoUNCONFIRMEDmedia-video/gpac-0.4.5-r4 - ld: wxOsmo4.o: in function wxCreateApp():wxOsmo4.cpp(.text+0x1c): error:2012-04-18 15:19:39
386947Librarymedia-videoUNCONFIRMEDmedia-libs/libdv-1.0.0-r2 - enc_input.c:1021:26: error: array type has incomplete element type2011-11-12 17:03:32
385109Applicationsmedia-videoUNCONFIRMEDmedia-video/vlc-1.1.11 segfault error2012-09-19 13:08:57
370275Applicationsmedia-videoUNCONFIRMEDmedia-video/libav-0.7_pre20110327 error: selected processor does not support ARM mode2011-10-26 17:48:22
367699Ebuildsmedia-videoUNCONFIRMEDmedia-video/winki - winki: [..] ImportError: No module named gnome (missing RDEPEND?)2011-05-17 23:55:09
403389Applicationsmedia-tvUNCONFIRMEDmedia-tv/tvtime-1.0.2_p20110131-r3 configure error - configure: error: asound needed2012-07-09 14:32:00
369987Ebuildsmedia-tvUNCONFIRMEDapp-misc/lirc-0.9.0 emerge error econf failed2012-07-17 20:43:17
433708ApplicationsmattmUNCONFIRMEDnet-analyzer/zabbix-2.0.2-r1: Makefiles are erroneously installed in /usr/share/zabbix2012-09-03 17:12:18
446974Ebuildsmaintainer-wantedUNCONFIRMEDdev-libs/libpreludedb, app-admin/prelude-manager, net-analyzer/prewikka resurrection request2012-12-27 21:31:08
424830Ebuildsmaintainer-wantedUNCONFIRMEDnet-p2p/couchpotatoserver - an automatic NZB and torrent downloader2012-10-07 03:34:59
409077Ebuildsmaintainer-wantedUNCONFIRMEDwww-apps/gerrit - web based code review and project management for Git based projects2012-03-21 15:35:16
405847Ebuildsmaintainer-wantedUNCONFIRMEDmail-client/ner-9999 - Notmuch based email client (currently read-only)2012-02-27 01:05:27
396543Ebuildsmaintainer-wantedUNCONFIRMEDEbuild for Cherrytree - A hierarchical note taking application2013-01-30 17:37:55
381563Librarymaintainer-wantedUNCONFIRMEDSISL - "The SINTEF Spline Library", a comprehensive NURBS library for the modeling and interrogation2011-10-07 01:01:21
455414Librarymaintainer-neededUNCONFIRMEDdev-libs/libmix-2.05-r6 with clang-3.2 - aes/saferp.c:22:8: error: redefinition of 'expf' as differe2013-02-05 12:13:40
451360Librarymaintainer-neededUNCONFIRMEDsci-libs/opencascade-6.5 with tcl-8.6.0-r1: src/Draw/Draw_Window.cxx:1047:37: error: 'Tcl_Interp' ha2013-02-05 07:49:56
447352Unspecifiedmaintainer-neededUNCONFIRMEDapp-laptop/tp_smapi-0.41 with kernel 3.7 - modprobe: FATAL: Error inserting tp_smapi (/lib/modules/32013-01-02 20:30:53
432296Developmentmaintainer-neededUNCONFIRMEDdev-libs/apr-1.4.5 fails to crosscompile: configure: error: cannot run test program while cross comp2013-01-03 18:43:02
434240Developmentmaintainer-neededUNCONFIRMEDdev-util/bam-0.4.0 with dev-lang/lua-5.2.1: src/context.c:34:18: error: ‘LUA_GLOBALSINDEX’ undeclare2012-09-16 10:46:57
410343Ebuildsmaintainer-neededUNCONFIRMEDnet-wireless/broadcom-sta - modprobe wl: ERROR: could not insert 'wl': No such file or directory2013-02-03 13:03:43
379475Applicationsmaintainer-neededUNCONFIRMEDwww-apache/mod_dnssd - Avahi: "invalid host name" error, always uses "localhost" no matter what2013-01-01 20:35:50
385401ApplicationslxnayUNCONFIRMEDapp-admin/packagekit-base-0.6.18 compile error on using python3 as default2012-05-12 22:10:25
395109Unspecifiedlu_zeroUNCONFIRMEDmedia-video/lives-1.4.6 "Capture External Window" fails to render video; errors in console2011-12-19 12:16:42
450528Serverldap-bugsUNCONFIRMEDnet-nds/openldap-2.4.30: configure: error: crossing compiling: use --with-yielding_select=yes|no|man2013-01-07 11:32:59
438692Core systemldap-bugsUNCONFIRMEDsys-auth/nss_ldap-265-r1 with sys-libs/glibc-2.16.0 - /bin/login: symbol lookup error: /lib64/libnss2013-01-23 18:05:21
454868ApplicationslackUNCONFIRMEDx11-wm/fluxbox-? with updated media-libs/glew-1.9.0 - `fbrun` yields error while loading shared libr2013-02-04 17:23:15
445110Eclasses and Profileskernel-miscUNCONFIRMEDkernel-2.eclass v1.277 - Default DESCRIPTION incorrectly built.2012-11-28 23:37:02
402967Applicationskernel-miscUNCONFIRMEDsys-fs/fuse-2.8.7 - ld.gold: error: symbol fuse_new has undefined version2012-12-25 21:39:12
425316Applicationskernel-miscUNCONFIRMEDapp-misc/fdutils-5.5-r2 - fdmount.c:25:27: fatal error: linux/ext2_fs.h: No such file or directory2012-12-12 05:51:37
456388KDEkdeUNCONFIRMEDkde-misc/krename-4.0.9: fatal error: freetype/config/ftheader.h: No such file or directory2013-02-19 06:44:46
449296KDEkdeUNCONFIRMEDnet-im/ktp-call-ui-0.5.1: gsttaglist.h:152:28: error: conflicting declaration ‘typedef struct _GstTa2013-01-18 10:50:15
450386DevelopmentkdeUNCONFIRMEDdev-util/cmake: FindBLAS patch doesn't correctly use pkg-config results and may fail2013-01-08 12:36:44
433070KDEkdeUNCONFIRMEDapp-editors/kile-2.1.2-r1 - index.docbook:124: parser error : Entity 'ged.vertaald' not defined2013-02-17 22:53:14
430938KDEkdeUNCONFIRMEDkde-base/plasma-workspace-4.8.5 fails with parallel build: fatal error: ui_killrunner_config.h: No s2012-10-24 16:55:05
451056DevelopmentjsbronderUNCONFIRMEDsys-cluster/mpich2-1.2.1_p1-r1 fails to crosscompile: configure: error: Unable to determine Fortran 2013-01-09 15:17:48
434242DevelopmentjohnnyUNCONFIRMEDdev-vcs/monotone-1.0-r3 with dev-lang/lua-5.2.1: src/lua.hh:41:23: error: ‘LUA_GLOBALSINDEX’ was not2013-01-29 06:21:50
454118ApplicationsjlecUNCONFIRMED[science overlay] sci-chemistry/mgltools-pmv-1.5.6_rc2 - runPmv: TclError: cannot use geometry manag2013-01-30 09:02:43
405089ApplicationsjlecUNCONFIRMEDapp-arch/p7zip-9.13 - ../../../Windows/Control/Controls.cpp:492:53: error: invalid conversion from '2012-05-30 19:43:20
435732ApplicationsjerUNCONFIRMEDx11-terms/rxvt-unicode-9.15 - glibc detected *** urxvtd: malloc(): smallbin double linked list corru2013-01-05 22:08:43
424201ApplicationsjdhoreUNCONFIRMEDmedia-video/miro-5.0.1 - .../work/miro-5.0.1/linux/miro-segmenter.c:236:45: error: ‘URL_WRONLY’ unde2012-07-11 03:26:33
457520ServerjavaUNCONFIRMEDinit script for www-servers/tomcat-7.0.32 drops STDOUT and STDERR2013-02-14 15:45:51
456932JavajavaUNCONFIRMEDERROR: dev-java/netbeans-javafx-7.2 failed (compile phase)2013-02-13 20:19:37
453804JavajavaUNCONFIRMEDCreate ebuilds for jdk 8 (early access release), a current Java 8 partial implementation2013-01-24 12:02:05
449442JavajavaUNCONFIRMED[java-overlay] dev-java/gnu-classpath-0.99: ERROR: Package ecj-gcj-* was not found!2012-12-31 12:37:35
438834JavajavaUNCONFIRMEDdev-java/icedtea-6.1.11.4 fails to build with java.lang.OutOfMemoryError2012-10-18 18:57:31
436012JavajavaUNCONFIRMEDdev-java/ant-core-1.8.4-r1 can't override system properties for ant2012-09-23 18:13:25
427932JavajavaUNCONFIRMED[java-overlay] dev-java/j3d-core-1.5.1: compile phase fails with image resolution errors2012-07-24 19:35:50
421677JavajavaUNCONFIRMEDdev-java/ant-commons-net-1.8.4 - *** Semantic Error: The abstract method "int compareTo(java.lang.Ob2012-06-19 02:39:45
399471JavajavaUNCONFIRMEDdev-java/ibm-jre-bin-1.6.0.9_p2-r1: error while loading shared libraries: libstdc++.so.5: cannot op2012-01-27 02:05:35
389763JavajavaUNCONFIRMEDdev-java/ecj-gcj-3.5.2-r2 - /usr/libexec/gcc/i686-pc-linux-gnu/4.5.3/ecj1: symbol lookup error: /usr2011-11-08 15:48:12
376823JavajavaUNCONFIRMEDdev-java/icedtea-6.1.10.3: I have problems when open Jdownloader program. A fatal error has been det2011-12-08 10:40:09
456136Libraryidl0rUNCONFIRMEDnet-dns/bind-tools with dev-libs/openssl-1.0.1c - nslookup: error: [...] /usr/lib64/engines/libgost.2013-02-11 12:12:54
447102Applicationsidl0rUNCONFIRMEDnet-analyzer/nagstamon-0.9.9 throws glib.GError: Couldn't recognize the image file format for file '2012-12-13 14:34:59
403473Applicationsidl0rUNCONFIRMEDmedia-plugins/vdr-xineliboutput-1.0.5-r1 - xine_post_audiochannel.c:97:7: error: ‘post_audio_port_t’2012-09-27 15:47:31
431984Core systemia64UNCONFIRMEDsys-boot/efibootmgr - arch must match kernel arch to work correctly2012-08-22 00:02:20
454354Applicationsidella4UNCONFIRMEDapp-emulation/xen-tools-4.2.1 - Fails to compile with KeyError: '.text.asm.out/../src/smp.c.68'2013-02-01 21:20:22
456770Libraryhd_brummyUNCONFIRMEDmedia-libs/FusionSound-1.1.1-r1 - core_sound.c:328:6: error: too few arguments to function 'fusion_o2013-02-11 14:57:06
439982ApplicationshwoarangUNCONFIRMEDgnome-extra/nautilus-dropbox-1.4.0 - /usr/bin/rst2man.py dropbox.txt > dropbox.1 /// TypeError: 'str2012-11-04 10:56:31
446934Eclasses and ProfileshattyaUNCONFIRMEDsubversion.eclass v1.83 drops local checkout if svn client fails (on transport errors)2012-12-12 01:48:29
407571Core systemhardened-kernelUNCONFIRMEDsys-apps/util-linux-2.20.1-r1 - authpriv.err: Mar 9 20:20:43 agetty[26171]: /dev/tty1: cannot get c2012-10-11 16:08:47
450776HardenedhardenedUNCONFIRMEDapp-emulation/wine-1.5.21 - configure: checking for -lGL... ./conftest: error while loading shared l2013-02-11 21:23:57
452828HardenedhardenedUNCONFIRMEDsys-apps/util-linux-2.21.2 - dmesg: *** glibc detected *** dmesg: double free or corruption (!prev):2013-01-18 16:31:50
417175EbuildshardenedUNCONFIRMEDapp-admin/bastille-3.0.9: homepage is not correct2012-05-22 21:45:41
428682HardenedhardenedUNCONFIRMEDSystem.map has an incorrect kernel version reported when grsec enabled2012-08-03 15:29:25
434722UnspecifiedhannoUNCONFIRMEDnet-mail/mailman-2.1.14 uses python_mod_cleanup() incorrectly2012-09-11 15:14:21
430870ApplicationshannoUNCONFIRMEDnet-analyzer/openvas-administrator - .../work/openvas-administrator-1.1.1/src/admin.c:877:3: error: 2012-08-12 14:12:23
428724Core systemhannoUNCONFIRMEDsys-auth/pam_mount-2.13: man: invalid option -- 'l', ERROR: ld.so: object 'libsandbox.so' from LD_PR2012-07-31 00:10:12
373847ApplicationshannoUNCONFIRMEDmedia-gfx/gimp-2.6.11-r1: crash on startup with error GLib-WARNING ignoring no-arg, optional-arg or 2011-10-22 18:15:20
366757ApplicationshannoUNCONFIRMED=media-libs/gegl-0.1.6 - ff-load.c:79: error: duplicate case value2011-05-11 08:40:52
427768ApplicationsgstreamerUNCONFIRMEDmedia-plugins/gst-plugins-ffmpeg-0.10.13-r2 - gstffmpegutils.c:42:40: error: parameter 1 ('smp_fmt')2012-07-24 15:31:30
396583ApplicationsgstreamerUNCONFIRMEDmedia-plugins/gst-plugins-ffmpeg-0.10.13-r1 - libavcodec/x86/h264_deblock_10bit.asm:421: error: inva2012-02-29 20:47:12
402763EbuildsgstreamerUNCONFIRMEDmedia-plugins/gst-plugins-ffmpeg-0.10.13-r1 - libavcodec/arm/dsputil_vfp.S:45: Error: selected proce2012-02-09 01:08:01
440212ServergrobianUNCONFIRMEDmail-mta/exim - R=localuser T=local_delivery defer (27): File too large: error while writing to /var2012-10-30 16:23:42
456896LibrarygraphicsUNCONFIRMEDmedia-libs/lensfun-0.2.5-r2 - Fatal error: can't create out/posix.x86_64/release/libs/lensfun/mod-co2013-02-12 08:34:39
440960ApplicationsgraphicsUNCONFIRMEDmedia-gfx/wings crashes at startup with incorrect version of erl_driver.h2012-11-02 17:02:33
436120ApplicationsgraphicsUNCONFIRMEDmedia-gfx/inkscape-0.48.3.1 configure: error: Package requirements were not met (cblas.pc)2012-10-06 20:58:27
437446ApplicationsgraphicsUNCONFIRMEDmedia-gfx/nip2-7.26.4 - parser.h:57:12: error: conflicting types for ‘yyleng’ lex.c:275:11: note: pr2013-02-16 13:23:10
438436ApplicationsgraphicsUNCONFIRMEDmedia-gfx/enblend-4.0 USE=doc - !pdfTeX error: pdfetex (file ./smooth-edge.pdf): reading image file 2012-10-15 11:31:41
440104ApplicationsgraphicsUNCONFIRMEDmedia-libs/lensfun-0.2.6 installs corrupted pkgconfig file2013-01-10 07:44:34
410651gpackages - http://packages.gentoo.org/gpackagesUNCONFIRMED500 Error, not a valid package atom2012-12-30 17:46:20
450262LibrarygnustepUNCONFIRMEDgnustep-base-1.24.0-r1 - Assembler messages: {standard input}:1430: Error: symbol `_OBJC_CLASS_GCObj2013-01-05 17:44:50
455134Applicationsgnome-officeUNCONFIRMEDapp=office/gnucash with dev-db/libdbi - "The library "libdbi" installed on your system doesn't corre2013-02-12 19:39:30
448874Applicationsgnome-officeUNCONFIRMEDapp-office/glabels-3.0.1: /usr/include/evolution-data-server-3.6/libebook/e-contact.h:10:2: error: #2013-02-16 20:05:55
457624GNOMEgnomeUNCONFIRMEDgnome-extra/gnome-system-monitor-3.6.1 has incorrect dependency on dev-cpp/glibmm2013-02-14 21:52:35
458068GNOMEgnomeUNCONFIRMEDx11-themes/gnome-themes-standard: narrow scrollbars might violate accessibility regulation2013-02-19 06:38:31
449656GNOMEgnomeUNCONFIRMEDgnome-base/gnome-session-3.6.2: No .xsession-errors2013-01-12 10:19:26
454956GNOMEgnomeUNCONFIRMEDgnome-base/orbit-2.14.19-r1 with sys-devel/automake-1.13.1 - test/everything/Makefile.am:81: error: 2013-02-01 06:41:21
389813GNOMEgnomeUNCONFIRMEDgnome-base/nautilus-3.2.1 fails to mount volumes correctly2012-10-28 10:29:55
403281GNOMEgnomeUNCONFIRMEDmail-client/evolution-3.2.3: crash if I search the messages in 'Current Account'2012-02-17 18:56:33
420771GNOMEgnomeUNCONFIRMEDgnome-base/gvfs-1.12.3 (and apps using it, e.g. Nautilus) corrupt files on copy. Caused by prelink?2012-07-24 08:26:50
421107GNOMEgnomeUNCONFIRMEDmedia-libs/cogl-1.10.2[gles2] error with GLchar (tegra2 headers of EGL & GLES1/2)2012-06-14 15:04:50
429680[RU]gentoo-doc-ruUNCONFIRMEDLinks on GLEPs on Russian page triggers 404 error2012-08-11 20:46:28
435482GamesgamesUNCONFIRMEDgames-fps/rtcw-1.41b - error on game launch - ui/menddef.h not found2012-12-16 14:37:33
417561GamesgamesUNCONFIRMEDgames-rpg/monsterrpg2: new ebuild2012-10-19 04:48:30
387061GamesgamesUNCONFIRMEDVersion bump games-roguelike/tome-4.0.0b32 and correct HOMEPAGE in ebuild2013-01-07 17:31:33
368413GamesgamesUNCONFIRMED(new package) for the games-fps/enemy-territory-cqb2012-04-30 19:23:59
373073Eclasses and ProfilesgamesUNCONFIRMEDcdrom.eclass: logic error in cdrom_get_cds path check2012-01-24 02:52:25
385741Applicationsfreedesktop-bugsUNCONFIRMEDsys-power/pm-utils-1.4.1-r2: delay upon starting xsession resulting in harddrive error2011-10-14 00:25:12
377281ApplicationsforensicsUNCONFIRMEDapp-forensics/aide-0.15.1 will not run correctly when built statically.2013-02-03 13:02:19
427266Applicationsford_prefectUNCONFIRMEDmedia-sound/pulseaudio - When playing Flash plugin based video in browsers, .xsession-errors fills u2012-12-15 13:05:18
457010ApplicationsfloppymUNCONFIRMEDnet-misc/flexget-1.0.3344: BUG: Unhandled error in plugin --series: Only '='/'!=' operators can be u2013-02-17 18:32:40
442814ApplicationsfloppymUNCONFIRMEDnet-misc/freerdp-1.1.0_pre20121004-r1 CMake Error at cunit/CMakeLists.txt:28 (add_executable): Canno2012-11-13 07:00:04
438850Core systemfloppymUNCONFIRMEDsys-boot/grub-2.00-r1 - .../work/grub-2.00/grub-core/efiemu/i386/coredetect.c:38: Error: invalid ins2013-02-01 09:31:19
423817DevelopmentflameeyesUNCONFIRMEDdev-util/dwarves-1.9: ostra-cg cannot find python module ostra: ImportError: No module named ostra2012-06-27 18:54:10
449720Core systemferringbUNCONFIRMEDsys-apps/pkgcore-0.8.6: SyntaxError during compilation of Python modules for Python 3.22013-01-02 10:12:25
453540ApplicationsevermindUNCONFIRMED[pro-audio overlay] media-sound/jack-audio-connection-kit-1.9.9.5: TypeError: 'list' object is not c2013-02-09 17:14:49
410065ServererasUNCONFIRMEDnet-mail/dovecot-2.1.3 fails at parallel make: fatal error: ../../../src/plugins/quota/rquota.h: No 2012-07-12 15:51:16
407099Project-specific documentationembeddedUNCONFIRMEDIncorrect mount options and binfmt_misc mask for "Compiling with qemu-user chroot" secion2012-03-06 17:22:43
432588EbuildselvanorUNCONFIRMEDnet-voip/sflphone-1.0.1-r1 with net-libs/pjsip-1.8.10 (too old): sipaccount.cpp:612:17: error: ‘pjsi2012-08-24 13:48:14
445328DevelopmentdotnetUNCONFIRMEDdev-dotnet/glib-sharp-2.12.10 - libtool: Version mismatch error. This is libtool 2.4.2, but the libt2012-11-30 12:34:52
443604LibrarydotnetUNCONFIRMEDdev-dotnet/libgdiplus-2.10 - ../src/.libs/libgdiplus.so: error: undefined reference to 'atan' /// (m2012-11-19 10:30:17
435168EbuildsdotnetUNCONFIRMEDdev-lang/mono-2.10.9-r2 merge fails with configure error2012-10-04 18:38:09
410981ToolsdolsenUNCONFIRMEDapp-portage/etc-proposals with dev-lang/python-2.7[-berkdb] - raise error, "db type could not be det2012-04-09 20:36:29
456020Other documentsdocs-teamUNCONFIRMEDdon't suggest CORRECT_ALL option in zsh guide2013-02-07 14:25:52
432824Other documentsdocs-teamUNCONFIRMEDLVM2 Documentation should explain "lvcreate --target RAID1" vs "--mirrors"2012-08-26 11:19:31
443498LibrarydilfridgeUNCONFIRMEDmedia-libs/opencv - python/src2/cv2.cpp:1: /usr/include/python2.7/pyport.h:849:2: ??????: #error "LO2013-02-04 22:23:56
448316Ebuildsdev-zeroUNCONFIRMEDapp-emulation/spice: error BadMatch request X_SetInputFocus2012-12-25 16:38:18
447630Unspecifieddev-zeroUNCONFIRMED=net-misc/openvswitch-1.6.1-r2 - /etc/init.d/ovs-controller: ERROR: ovs-controller needs service(s) 2013-02-12 08:26:14
437624Developmentdev-zeroUNCONFIRMED=dev-php/libvirt-php-0.4.6: too few arguments to function ‘set_error’2012-11-08 01:34:50
452852Applicationsdev-toolsUNCONFIRMEDdev-util/insight-6.8.1 with >=dev-tcltk/itcl-4.0.0 - Error: can't find package Itcl 3.32013-02-03 11:53:40
455302Coredev-portageUNCONFIRMEDdispatch-conf broken: OSError: [Errno 21] Is a directory2013-02-03 17:22:38
403697Coredev-portageUNCONFIRMEDsys-apps/portage-2.1.10.46: TypeError: an integer is required2012-02-18 05:35:08
389735Core - Dependenciesdev-portageUNCONFIRMEDsys-apps/portage-2.2.0_alpha72 fails to do --deep correctly2011-11-08 16:17:05
382827Coredev-portageUNCONFIRMEDsys-apps/portage-2.1.10.11 crashes with confusing error when out of memory: TypeError: an integer is2011-09-14 13:56:03
367479Enhancement/Feature Requestsdev-portageUNCONFIRMEDemerge fetch function should be mirror-selective depending on ebuild location2012-12-07 05:07:03
365029Enhancement/Feature Requestsdev-portageUNCONFIRMEDemerge-webrsync incorrect/incomplete proxy error codes handling2011-05-10 11:19:57
389533Applicationsdesktop-wmUNCONFIRMEDx11-wm/icewm-1.3.7 - src_test(): iceview.cc:480:38: error: no matching function for call to ‘TextVie2012-07-05 11:48:34
436448Applicationsdesktop-miscUNCONFIRMEDx11-misc/parcellite-1.0.2_rc5 generates too many interrupts (as seen in powertop)2012-10-08 19:44:07
411077Applicationsdesktop-dockUNCONFIRMEDx11-plugins/wmauda-0.8 - wmauda.c:126:11: error: expected '=', ',', ';', 'asm' or '__attribute__' be2012-11-07 21:33:21
409119ApplicationscppUNCONFIRMEDdev-libs/STLport-5.2.1 - Fatal error: can't create obj/gcc/so/dll_main.o: No such file or directory2012-03-21 09:41:23
458404LibrarycppUNCONFIRMEDdev-libs/boost-1.52.0-r5 - error: Duplicate name of actual target: libboost_system.so.1.2013-02-21 02:56:16
404423Unspecifiedcommon-lispUNCONFIRMEDdev-lisp/ecls-12.2.1 fails to run tests - An error occurred during initialization: Module error: Don2013-02-02 10:15:50
436218EbuildsclusterUNCONFIRMEDnet-misc/pssh with dev-lang/python-3.2 - pssh --help: ImportError: No module named version2013-01-04 06:31:50
437090ServerclusterUNCONFIRMEDsys-cluster/keepalived-1.2.7-r1 "ip number count" errors2012-10-03 18:20:57
414793Core systemclusterUNCONFIRMEDsys-cluster/maui-3.3.1-r2 - ERROR: cannot setpgrp, errno: 1 (Operation not permitted)2012-08-06 03:49:46
450024Core systemchutzpahUNCONFIRMEDsys-fs/ntfs3g-2012.1.15-r2: incorrectly built by ld.gold linker2013-01-05 17:10:32
438986EbuildschutzpahUNCONFIRMEDapp-admin/salt-0.10.0 - error: file '.../work/impl_python3_2/salt-0.10.0/scripts/salt-master' does n2012-10-21 14:26:16
398151ApplicationschutzpahUNCONFIRMEDnet-mail/courier-imap-4.5.0 error in man page mkpop3dcert2012-01-08 16:37:08
390261EbuildschutzpahUNCONFIRMEDwww-plugins/nspluginwrapper-1.4.4-r1 - /usr/include/dirent.h:42:19: error: conflicting types for 'in2012-08-11 07:17:55
458174DevelopmentchromiumUNCONFIRMED=dev-lang/v8-3.15.11.15 does not build on RaspberryPi2013-02-20 16:19:23
406583ApplicationschithanhUNCONFIRMEDwww-plugins/lightspark-0.5.4.1-r1 build fails - error regarding some ffmpeg stuff (?)2012-03-03 01:49:39
451316ApplicationscedkUNCONFIRMEDnet-firewall/conntrack-tools-0.9.14 - parse.c:230:34: error: ‘NULL’ undeclared (first use in this fu2013-01-11 16:17:24
446644EbuildscardoeUNCONFIRMEDmedia-tv/ivtv-firmware-20080701 should probably not be mirror-restricted2012-12-10 12:04:48
455636ApplicationscardoeUNCONFIRMEDapp-emulation/libvirt-1.0.2 USE=-libvirtd - node_device/node_device_udev.c:1608:37: error: unknown t2013-02-05 21:55:17
428746ApplicationscardoeUNCONFIRMEDnet-misc/netcf-0.1.9 - drv_initscripts.c:1083:15: error: ‘NETCF_TRANSACTION’ undeclared (first use i2012-08-01 04:17:19
383895Ebuildsc1pherUNCONFIRMEDapp-admin/gentoo-rsync-mirror file permission problem2012-07-04 17:48:16
374949BugzillabugzillaUNCONFIRMEDSubmitting bugs with attachments without method to determine content type causes error but still cre2011-10-30 23:16:37
458386ApplicationsbugsUNCONFIRMEDapp-admin/collectd-5.2.0 - Assert error in VSM_n_Arg(), [...]/work/varnish-3.0.3/lib/libvarnishapi/v2013-02-20 14:29:22
458578Applicationsbug-wranglersUNCONFIRMEDapp-misc/geneweb-5.02: Fatal error: OCaml and preprocessor have incompatible versions2013-02-21 12:27:58
454228HardenedbluenessUNCONFIRMEDsys-kernel/hardened-sources-3.2.37-r2 fails to build for ia64: mm/mmap.c:1689:4: error: too few argu2013-02-21 02:26:58
393039FreeBSDbsdUNCONFIRMEDapp-misc/screen on Gentoo/FBSD9 - os.h:275:20: error: utmp.h: No such file or directory2012-12-04 00:53:30
444918FreeBSDbsdUNCONFIRMEDapp-arch/libarchive-3.0.4-r1 -- getvfsbyname failed error occurs, doesn't work in x86 chroot on amd62013-01-15 12:22:54
421017FreeBSDbsdUNCONFIRMEDnet-nds/openldap-2.4.31 links with /lib/libcom_err.so.22012-06-13 18:25:22
447826Core systembluenessUNCONFIRMEDsys-kernel/hardened-sources-2.6.32-r143 fails to compile for ia64: include/linux/random.h:91:19: err2013-01-18 23:15:20
443020ApplicationsbluenessUNCONFIRMEDnet-misc/tor-0.2.4.5_alpha USE=bufferevents [err] channel_closed(): Bug: src/or/channel.c:1315: chan2012-12-12 03:45:35
432206ApplicationsbluenessUNCONFIRMEDnet-misc/arm with dev-lang/python:3.2 - SyntaxError: invalid syntax in print "TorCtl successfully in2013-01-15 13:00:59
387341ApplicationsbilllUNCONFIRMEDmedia-video/ogmrip-0.13.6 - ogmdvd-disc.h:71:1: error: expected '=', ',', ';', 'asm' or '__attribute2011-10-27 17:36:11
403455ApplicationsbilllUNCONFIRMEDmedia-video/ogmrip-0.13.7 - configure.in:132: error: possibly undefined macro: AM_GCONF_SOURCE_22012-02-15 17:31:54
453500ApplicationsbircophUNCONFIRMEDapp-doc/root-docs-5.34.03 - Error: Function Open(filename,"RECREATE") is not defined in current scop2013-02-19 19:12:58
374505ApplicationsbluenessUNCONFIRMEDdev-util/gperf-3.0.4: compile error collect2: ld returned 1 exit status2012-02-04 01:23:02
455990Applicationsbase-systemUNCONFIRMEDapp-shells/bash=4.2_p37 - segfault when script aborted - *** glibc detected *** double free or corru2013-02-08 23:10:35
431054Applicationsbase-systemUNCONFIRMEDnet-misc/icecast-2.3.3 USE=yp - libtool linker mangles CFLAGS ( x86_64-pc-linux-gnu-gcc: error: l1-c2012-08-12 20:10:16
426358Core systembase-systemUNCONFIRMEDsys-block/partimage server crashes with pthread error when client attempts to download image2012-07-18 00:00:36
427340Core systembase-systemUNCONFIRMEDsys-boot/grub-static-0.97-r10 incorrectly detects /boot as read-only and fails2012-07-26 19:22:30
418287Core systembase-systemUNCONFIRMEDsys-boot/grub-0.97-r11 - Failed Running autoconf ! - configure.ac:59: error: possibly undefined macr2012-10-09 04:21:54
424343Core systembase-systemUNCONFIRMEDsys-boot/grub-0.97: Cannot install boot loader to /dev/xvda. /dev/xvda does not have a correspondin2013-02-04 03:52:44
413621Core systembase-systemUNCONFIRMEDsys-apps/coreutils-8.15 - src_test(): errors setting up rm/deep-2 and du/long-from-unreadable2012-11-20 03:30:47
408139Core systembase-systemUNCONFIRMEDsys-fs/mdadm-3.2.1 sends ioctl 1261 (BLKFLSBUF) to partition when displaying array details2012-11-11 22:39:56
395537Core systembase-systemUNCONFIRMEDsys-process/procps doesn't prints cgroups correctly (systemd releated)2012-01-24 20:57:29
378683Applicationsbase-systemUNCONFIRMEDapp-admin/sysklogd-1.4.2 - klogd uses incorrect facility2011-08-13 14:33:29
439894Applicationsapp-dictsUNCONFIRMEDapp-text/stardict - configure.ac:310: error: possibly undefined macro: AM_GCONF_SOURCE_22012-10-27 18:48:47
409947Unspecifiedapp-backupUNCONFIRMEDapp-backup/rdiff-backup-1.3.3 - "Security Violation" warning then "Fatal Error"2012-03-30 06:29:16
429564ApplicationsangelosUNCONFIRMEDgnome-extra/docky-2.1.4 compile error with mono 2.11.12012-09-11 06:58:49
403551OtheraltUNCONFIRMEDCompilation of gcc-4.5.3-r1 fails with "configure: error: Link tests are not allowed after GCC_NO_EX2012-02-14 10:57:13
452734OtheraltUNCONFIRMEDwww-client/firefox-18.0-r1 fails to build (prefix) - fatal error: jemalloc.h: No such file or direct2013-01-29 19:41:01
417191Ebuildsamd64UNCONFIRMEDapp-emulation/emul-linux-x86-gtklibs-20120520 needs pax marking - gtk-query-immodules-2.0-32: error 2012-12-12 16:42:02
454596ApplicationsalexxyUNCONFIRMEDwww-apps/rutorrent-3.4-r1 - ebuild fault: file '/usr/share/webapps/rutorrent/3.4-r1/htdocs/share/set2013-01-29 23:02:40
445550ApplicationsalexxyUNCONFIRMEDwww-apps/rutorrent-3.4-r1: outputs garbage to Apache error.log if PHP is running in strict mode2012-12-02 06:13:37
402493ApplicationsadaUNCONFIRMEDdev-ada/adasockets-1.8.4.7 - gnatmake: "listener.adb" compilation error2012-02-07 17:45:08
386661DevelopmentadaUNCONFIRMED[portage-multilib] dev-lang/gnat-gcc: configure error for x85-abi due to gnatboot-4.4-amd64.tar.bz22012-12-25 21:03:35
449716ApplicationsaballierUNCONFIRMEDnet-nntp/hellanzb.0.13-r8 - hellanzb.py: ImportError: cannot import name _NO_FILENO2013-01-02 10:57:50
371322Eclasses and ProfilesadaUNCONFIRMEDdev-lang/gnat-gcc-4.3.2 - work/gcc-4.3.2/libgcc/../gcc/unwind-pe.h:136: error: expected declaration 2012-03-19 19:22:36
283819VulnerabilitiessecurityUNCONFIRMEDnet-p2p/bittorrent: Web interface DoS (CVE-2008-7166)2011-09-15 07:37:49
456292OthertenUNCONFIRMEDLiveDVD 20121221: Kernel cannot detect BIOS RAID array2013-02-10 06:48:14
431774LibraryaballierUNCONFIRMEDdev-ml/lwt-2.4.0 USE=doc - File "src/text/lwt_text.mli", line 48, characters 41-51: Error: Unbound m2012-08-18 15:06:00
398399ApplicationsvimUNCONFIRMEDapp-editors/vim-7.3.393 - if_perl.c:1102:1: error: static declaration of 'XS_VIM_Msg' follows non-st2012-09-29 14:38:20
298753EbuildsnetmonUNCONFIRMEDnet-analyzer/rrdtool - src_configure() hangs at: configure:19935: checking if msync with MS_ASYNC up2011-06-01 15:21:23
209617OpenRCopenrcUNCONFIRMEDsys-apps/openrc-0.8.2-r1: user should be able to interrupt service start/stop pressing Ctrl+C2013-02-18 09:41:51
373039EbuildslackUNCONFIRMEDx11-plugins/gkrellmss — gkrellmss.h:23:30: fatal error: gkrellm2/gkrellm.h: No such file or director2011-07-03 16:43:54
457104KernelsecurityUNCONFIRMEDDriver of cypress corrupts file-system and partition table of external hard drives with M6116 SATA B2013-02-14 15:53:16


back



Support us on Content Nation

New Packages

- as rdf newsfeed
- as rss newsfeed
- as Atom newsfeed
2021-12-03
App-XML-DocBook-Builder - 0.100.300-r1
Ebuild name:

app-text/App-XML-DocBook-Builder-0.100.300-r1

Description

A Perl-based tool to Render DocBook/XML

Added to portage

2021-12-03

awscli - 1.22.19
Ebuild name:

app-admin/awscli-1.22.19

Description

Universal Command Line Environment for AWS

Added to portage

2021-12-03

bcc - 0.23.0-r3
Ebuild name:

dev-util/bcc-0.23.0-r3

Description

Tools for BPF-based Linux IO analysis, networking, monitoring, and more

Added to portage

2021-12-03

botan - 2.18.2-r1
Ebuild name:

dev-libs/botan-2.18.2-r1

Description

C++ crypto library

Added to portage

2021-12-03

boto3 - 1.20.19
Ebuild name:

dev-python/boto3-1.20.19

Description

The AWS SDK for Python

Added to portage

2021-12-03

botocore - 1.23.19
Ebuild name:

dev-python/botocore-1.23.19

Description

Low-level, data-driven core of boto 3

Added to portage

2021-12-03

calibre - 5.33.0
Ebuild name:

app-text/calibre-5.33.0

Description

Ebook management application

Added to portage

2021-12-03

drbd-utils - 9.19.1
Ebuild name:

sys-cluster/drbd-utils-9.19.1

Description

mirror/replicate block-devices across a network-connection

Added to portage

2021-12-03

fortune-mod - 3.6.1
Ebuild name:

games-misc/fortune-mod-3.6.1

Description

The notorious fortune program

Added to portage

2021-12-03

google-api-python-client - 2.32.0
Ebuild name:

dev-python/google-api-python-client-2.32.0

Description

Google API Client for Python

Added to portage

2021-12-03

gsl - 2.7.1-r1
Ebuild name:

sci-libs/gsl-2.7.1-r1

Description

The GNU Scientific Library

Added to portage

2021-12-03

hypothesis - 6.29.3
Ebuild name:

dev-python/hypothesis-6.29.3

Description

A library for property based testing

Added to portage

2021-12-03

ipython - 7.30.1
Ebuild name:

dev-python/ipython-7.30.1

Description

Advanced interactive shell for Python

Added to portage

2021-12-03

iwdevtools - 0.8.1
Ebuild name:

app-portage/iwdevtools-0.8.1

Description

Small tools to aid with Gentoo development, primarily intended for QA

Added to portage

2021-12-03

lapack - 3.10
Ebuild name:

virtual/lapack-3.10

Description

Virtual for Linear Algebra Package FORTRAN 77 (LAPACK) implementation

Added to portage

2021-12-03

ldns - 1.7.1-r6
Ebuild name:

net-libs/ldns-1.7.1-r6

Description

a library with the aim to simplify DNS programming in C

Added to portage

2021-12-03

ldns - 1.8.0-r2
Ebuild name:

net-libs/ldns-1.8.0-r2

Description

a library with the aim to simplify DNS programming in C

Added to portage

2021-12-03

libarchive-c - 3.2-r1
Ebuild name:

dev-python/libarchive-c-3.2-r1

Description

A Python interface to libarchive

Added to portage

2021-12-03

libp11 - 0.4.11-r2
Ebuild name:

dev-libs/libp11-0.4.11-r2

Description

Abstraction layer to simplify PKCS11 API

Added to portage

2021-12-03

libunwind - 1.6.2
Ebuild name:

sys-libs/libunwind-1.6.2

Description

Portable and efficient API to determine the call-chain of a program

Added to portage

2021-12-03

microsoft-edge - 96.0.1054.41
Ebuild name:

www-client/microsoft-edge-96.0.1054.41

Description

The web browser from Microsoft

Added to portage

2021-12-03

microsoft-edge-beta - 97.0.1072.21
Ebuild name:

www-client/microsoft-edge-beta-97.0.1072.21

Description

The web browser from Microsoft

Added to portage

2021-12-03

microsoft-edge-dev - 98.0.1089.1
Ebuild name:

www-client/microsoft-edge-dev-98.0.1089.1

Description

The web browser from Microsoft

Added to portage

2021-12-03

mlt - 7.2.0-r1
Ebuild name:

media-libs/mlt-7.2.0-r1

Description

Open source multimedia framework for television broadcasting

Added to portage

2021-12-03

myspell-tr - 1.2
Ebuild name:

app-dicts/myspell-tr-1.2

Description

Turkish dictionaries for myspell/hunspell

Added to portage

2021-12-03

myspell-uk - 1.6.5
Ebuild name:

app-dicts/myspell-uk-1.6.5

Description

Ukrainian dictionaries for myspell/hunspell

Added to portage

2021-12-03

myspell-uk - 5.3.1
Ebuild name:

app-dicts/myspell-uk-5.3.1

Description

Ukrainian dictionaries for myspell/hunspell

Added to portage

2021-12-03

myspell-zu - 20100126
Ebuild name:

app-dicts/myspell-zu-20100126

Description

Zulu dictionaries for myspell/hunspell

Added to portage

2021-12-03

nfacct - 1.0.2-r1
Ebuild name:

net-firewall/nfacct-1.0.2-r1

Description

Command line tool to create/retrieve/delete accounting objects in NetF

Added to portage

2021-12-03

nginx-unit - 1.26.1
Ebuild name:

www-servers/nginx-unit-1.26.1

Description

Dynamic web and application server

Added to portage

2021-12-03

nuitka - 0.6.18
Ebuild name:

dev-python/nuitka-0.6.18

Description

Python to native compiler

Added to portage

2021-12-03

openssh - 8.7_p1-r3
Ebuild name:

net-misc/openssh-8.7_p1-r3

Description

Port of OpenBSD's free SSH release

Added to portage

2021-12-03

openssh - 8.8_p1-r3
Ebuild name:

net-misc/openssh-8.8_p1-r3

Description

Port of OpenBSD's free SSH release

Added to portage

2021-12-03

opera - 82.0.4227.23
Ebuild name:

www-client/opera-82.0.4227.23

Description

A fast and secure web browser

Added to portage

2021-12-03

opera-developer - 83.0.4246.0
Ebuild name:

www-client/opera-developer-83.0.4246.0

Description

A fast and secure web browser

Added to portage

2021-12-03

pam_wrapper - 1.1.4
Ebuild name:

sys-libs/pam_wrapper-1.1.4

Description

A tool to test PAM applications and PAM modules

Added to portage

2021-12-03

pkcs11-helper - 1.27.0-r1
Ebuild name:

dev-libs/pkcs11-helper-1.27.0-r1

Description

PKCS11 helper library

Added to portage

2021-12-03

pprint - 20211129
Ebuild name:

dev-ml/pprint-20211129

Description

A pretty-printing combinator library and rendering engine

Added to portage

2021-12-03

ppx_deriving_yojson - 3.6.1
Ebuild name:

dev-ml/ppx_deriving_yojson-3.6.1

Description

JSON codec generator for OCaml

Added to portage

2021-12-03

pydot - 1.4.2-r1
Ebuild name:

dev-python/pydot-1.4.2-r1

Description

Python interface to Graphviz's Dot language

Added to portage

2021-12-03

pytest-django - 4.5.1
Ebuild name:

dev-python/pytest-django-4.5.1

Description

A Django plugin for py.test

Added to portage

2021-12-03

qt-creator - 6.0.0
Ebuild name:

dev-qt/qt-creator-6.0.0

Description

Lightweight IDE for C++/QML development centering around Qt

Added to portage

2021-12-03

qtnetwork - 5.15.2-r13
Ebuild name:

dev-qt/qtnetwork-5.15.2-r13

Description

Network abstraction library for the Qt5 framework

Added to portage

2021-12-03

rich - 10.15.2
Ebuild name:

dev-python/rich-10.15.2

Description

Python library for renrering rich text, tables, etc. to the terminal

Added to portage

2021-12-03

signal-desktop-bin - 5.25.0
Ebuild name:

net-im/signal-desktop-bin-5.25.0

Description

Allows you to send and receive messages of Signal Messenger on you

Added to portage

2021-12-03

sip - 6.5.0
Ebuild name:

dev-python/sip-6.5.0

Description

Python bindings generator for C/C++ libraries

Added to portage

2021-12-03

snapd - 2.53.4
Ebuild name:

app-emulation/snapd-2.53.4

Description

Service and tools for management of snap packages

Added to portage

2021-12-03

softhsm - 2.6.1-r2
Ebuild name:

dev-libs/softhsm-2.6.1-r2

Description

A software PKCS11 implementation

Added to portage

2021-12-03

xorg-server - 21.1.1-r2
Ebuild name:

x11-base/xorg-server-21.1.1-r2

Description

X.Org X servers

Added to portage

2021-12-03

yq - 2.13.0
Ebuild name:

app-misc/yq-2.13.0

Description

Command-line YAML processor - jq wrapper for YAML documents

Added to portage

2021-12-03

2021-12-02
ansible-lint - 5.3.0
Ebuild name:

app-admin/ansible-lint-5.3.0

Description

Checks ansible playbooks for practices and behaviour that can be impro

Added to portage

2021-12-02

awscli - 1.22.18
Ebuild name:

app-admin/awscli-1.22.18

Description

Universal Command Line Environment for AWS

Added to portage

2021-12-02

b4 - 0.8.0
Ebuild name:

net-mail/b4-0.8.0

Description

Utility for fetching patchsets from public-inbox

Added to portage

2021-12-02

beets - 1.6.0
Ebuild name:

media-sound/beets-1.6.0

Description

Media library management system for obsessive-compulsive music geeks

Added to portage

2021-12-02

blis - 0.8.1
Ebuild name:

sci-libs/blis-0.8.1

Description

BLAS-like Library Instantiation Software Framework

Added to portage

2021-12-02

bluez - 5.62-r3
Ebuild name:

net-wireless/bluez-5.62-r3

Description

Bluetooth Tools and System Daemons for Linux

Added to portage

2021-12-02

boto3 - 1.20.18
Ebuild name:

dev-python/boto3-1.20.18

Description

The AWS SDK for Python

Added to portage

2021-12-02

botocore - 1.23.18
Ebuild name:

dev-python/botocore-1.23.18

Description

Low-level, data-driven core of boto 3

Added to portage

2021-12-02

bpftrace - 0.14.0-r4
Ebuild name:

dev-util/bpftrace-0.14.0-r4

Description

High-level tracing language for eBPF

Added to portage

2021-12-02

cdogs-sdl - 1.2.0
Ebuild name:

games-arcade/cdogs-sdl-1.2.0

Description

Classic overhead run-and-gun game

Added to portage

2021-12-02

chrome-binary-plugins - 97.0.4692.36_beta
Ebuild name:

www-plugins/chrome-binary-plugins-97.0.4692.36_beta

Description

Binary plugins from Google Chrome for use in Ch

Added to portage

2021-12-02

chrome-binary-plugins - 98.0.4736.0_alpha
Ebuild name:

www-plugins/chrome-binary-plugins-98.0.4736.0_alpha

Description

Binary plugins from Google Chrome for use in Ch

Added to portage

2021-12-02

chromium - 98.0.4736.0
Ebuild name:

www-client/chromium-98.0.4736.0

Description

Open-source version of Google Chrome web browser

Added to portage

2021-12-02

cppman - 0.5.3
Ebuild name:

app-doc/cppman-0.5.3

Description

C++ man pages for Linux, with source from cplusplus.com and cppreference.com

Added to portage

2021-12-02

criu - 3.15-r3
Ebuild name:

sys-process/criu-3.15-r3

Description

utility to checkpoint/restore a process tree

Added to portage

2021-12-02

criu - 3.16.1
Ebuild name:

sys-process/criu-3.16.1

Description

utility to checkpoint/restore a process tree

Added to portage

2021-12-02

discord-bin - 0.0.16-r4
Ebuild name:

net-im/discord-bin-0.0.16-r4

Description

All-in-one voice and text chat for gamers

Added to portage

2021-12-02

fwupd - 1.7.2
Ebuild name:

sys-apps/fwupd-1.7.2

Description

Aims to make updating firmware on Linux automatic, safe and reliable

Added to portage

2021-12-02

gazebo - 11.3.0-r3
Ebuild name:

sci-electronics/gazebo-11.3.0-r3

Description

A 3D multiple robot simulator with dynamics

Added to portage

2021-12-02

gazebo - 11.5.1-r3
Ebuild name:

sci-electronics/gazebo-11.5.1-r3

Description

A 3D multiple robot simulator with dynamics

Added to portage

2021-12-02

gazebo - 11.7.0-r2
Ebuild name:

sci-electronics/gazebo-11.7.0-r2

Description

A 3D multiple robot simulator with dynamics

Added to portage

2021-12-02

golly - 4.1-r1
Ebuild name:

app-misc/golly-4.1-r1

Description

simulator for Conway's Game of Life and other cellular automata

Added to portage

2021-12-02

google-chrome-beta - 97.0.4692.36
Ebuild name:

www-client/google-chrome-beta-97.0.4692.36

Description

The web browser from Google

Added to portage

2021-12-02

google-chrome-unstable - 98.0.4736.0
Ebuild name:

www-client/google-chrome-unstable-98.0.4736.0

Description

The web browser from Google

Added to portage

2021-12-02

hydrus - 463
Ebuild name:

media-gfx/hydrus-463

Description

A booru-like media organizer for the desktop

Added to portage

2021-12-02

hypothesis - 6.29.1
Ebuild name:

dev-python/hypothesis-6.29.1

Description

A library for property based testing

Added to portage

2021-12-02

icewm - 2.9.1
Ebuild name:

x11-wm/icewm-2.9.1

Description

Ice Window Manager with Themes

Added to portage

2021-12-02

idea-community - 2021.3.213.5744.223
Ebuild name:

dev-util/idea-community-2021.3.213.5744.223

Description

A complete toolset for web, mobile and enterprise devel

Added to portage

2021-12-02

jellyfin-media-player - 1.6.1
Ebuild name:

media-video/jellyfin-media-player-1.6.1

Description

Jellyfin Desktop Client based on Plex Media Player

Added to portage

2021-12-02

jellyfin-web-jmp-bin - 10.7.6
Ebuild name:

media-video/jellyfin-web-jmp-bin-10.7.6

Description

Modified Jellyfin Web Client for use inside Jellyfin Media

Added to portage

2021-12-02

jenkins-bin - 2.319.1
Ebuild name:

dev-util/jenkins-bin-2.319.1

Description

Extensible continuous integration server

Added to portage

2021-12-02

jenkins-bin - 2.323
Ebuild name:

dev-util/jenkins-bin-2.323

Description

Extensible continuous integration server

Added to portage

2021-12-02

kawa - 3.1.1
Ebuild name:

dev-scheme/kawa-3.1.1

Description

Java-based Scheme system & Language Framework

Added to portage

2021-12-02

libbpf - 0.6.0
Ebuild name:

dev-libs/libbpf-0.6.0

Description

Stand-alone build of libbpf from the Linux kernel

Added to portage

2021-12-02

libva-intel-media-driver - 21.4.2
Ebuild name:

x11-libs/libva-intel-media-driver-21.4.2

Description

Intel Media Driver for VAAPI (iHD)

Added to portage

2021-12-02

linux-headers - 5.15-r1
Ebuild name:

sys-kernel/linux-headers-5.15-r1

Description

Added to portage

2021-12-02

lxc - 4.0.11_p1-r1
Ebuild name:

app-emulation/lxc-4.0.11_p1-r1

Description

A userspace interface for the Linux kernel containment features

Added to portage

2021-12-02

markdown2 - 2.4.2
Ebuild name:

dev-python/markdown2-2.4.2

Description

Python Markdown language reimplementation

Added to portage

2021-12-02

mesa - 21.3.1
Ebuild name:

media-libs/mesa-21.3.1

Description

OpenGL-like graphic library for Linux

Added to portage

2021-12-02

meteo - 0.9.9.1
Ebuild name:

x11-misc/meteo-0.9.9.1

Description

Forecast application using OpenWeatherMap API

Added to portage

2021-12-02

mips-sources - 4.14.256
Ebuild name:

sys-kernel/mips-sources-4.14.256

Description

Linux-Mips GIT sources for MIPS-based machines, dated 20180128

Added to portage

2021-12-02

mips-sources - 4.19.219
Ebuild name:

sys-kernel/mips-sources-4.19.219

Description

Kernel.org sources for MIPS-based machines

Added to portage

2021-12-02

mips-sources - 5.4.163
Ebuild name:

sys-kernel/mips-sources-5.4.163

Description

Kernel.org sources for MIPS-based machines

Added to portage

2021-12-02

myspell-uk - 5.3.1
Ebuild name:

app-dicts/myspell-uk-5.3.1

Description

Ukrainian dictionaries for myspell/hunspell

Added to portage

2021-12-02

nest_asyncio - 1.5.2
Ebuild name:

dev-python/nest_asyncio-1.5.2

Description

Patch asyncio to allow nested event loops

Added to portage

2021-12-02

nest_asyncio - 1.5.4
Ebuild name:

dev-python/nest_asyncio-1.5.4

Description

Patch asyncio to allow nested event loops

Added to portage

2021-12-02

numexpr - 2.8.0
Ebuild name:

dev-python/numexpr-2.8.0

Description

Fast numerical array expression evaluator for Python and NumPy

Added to portage

2021-12-02

osl - 1.11.16.0-r2
Ebuild name:

media-libs/osl-1.11.16.0-r2

Description

Advanced shading language for production GI renderers

Added to portage

2021-12-02

patatt - 0.4.9
Ebuild name:

dev-python/patatt-0.4.9

Description

A simple library to add cryptographic attestation to patches sent via email

Added to portage

2021-12-02

petsc - 3.16.0
Ebuild name:

sci-mathematics/petsc-3.16.0

Description

Portable, Extensible Toolkit for Scientific Computation

Added to portage

2021-12-02

pkginfo - 1.8.2
Ebuild name:

dev-python/pkginfo-1.8.2

Description

Provides an API for querying the distutils metadata written in a PKG-INFO

Added to portage

2021-12-02

pytest-django - 4.5.0
Ebuild name:

dev-python/pytest-django-4.5.0

Description

A Django plugin for py.test

Added to portage

2021-12-02

python-lsp-black - 1.0.1
Ebuild name:

dev-python/python-lsp-black-1.0.1

Description

Black plugin for the Python LSP Server

Added to portage

2021-12-02

rp-pppoe - 3.15-r1
Ebuild name:

net-dialup/rp-pppoe-3.15-r1

Description

A user-mode PPPoE client and server suite for Linux

Added to portage

2021-12-02

rpi-eeprom - 12.5_p1-r1
Ebuild name:

dev-embedded/rpi-eeprom-12.5_p1-r1

Description

Updater for Raspberry Pi 4 bootloader and the VL805 USB controll

Added to portage

2021-12-02

skypeforlinux - 8.78.0.161-r2
Ebuild name:

net-im/skypeforlinux-8.78.0.161-r2

Description

Instant messaging client, with support for audio and video

Added to portage

2021-12-02

smlnj - 110.99.2
Ebuild name:

dev-lang/smlnj-110.99.2

Description

Standard ML of New Jersey compiler and libraries

Added to portage

2021-12-02

spqr - 2.0.9-r2
Ebuild name:

sci-libs/spqr-2.0.9-r2

Description

Multithreaded multifrontal sparse QR factorization library

Added to portage

2021-12-02

strace - 5.15
Ebuild name:

dev-util/strace-5.15

Description

A useful diagnostic, instructional, and debugging tool

Added to portage

2021-12-02

strawberry - 1.0.0-r2
Ebuild name:

media-sound/strawberry-1.0.0-r2

Description

Modern music player and library organizer based on Clementine and Q

Added to portage

2021-12-02

tinyscheme - 1.41-r1
Ebuild name:

dev-scheme/tinyscheme-1.41-r1

Description

Lightweight scheme interpreter

Added to portage

2021-12-02

tinyscheme - 1.42
Ebuild name:

dev-scheme/tinyscheme-1.42

Description

Lightweight scheme interpreter

Added to portage

2021-12-02

tomli-w - 1.0.0
Ebuild name:

dev-python/tomli-w-1.0.0

Description

A lil' TOML writer

Added to portage

2021-12-02

twine - 3.7.0
Ebuild name:

dev-python/twine-3.7.0

Description

Collection of utilities for publishing packages on PyPI

Added to portage

2021-12-02

viking - 1.10
Ebuild name:

sci-geosciences/viking-1.10

Description

GPS data editor and analyzer

Added to portage

2021-12-02

vtk - 8.2.0-r6
Ebuild name:

sci-libs/vtk-8.2.0-r6

Description

The Visualization Toolkit

Added to portage

2021-12-02

vtk - 9.0.3-r3
Ebuild name:

sci-libs/vtk-9.0.3-r3

Description

The Visualization Toolkit

Added to portage

2021-12-02

wireplumber - 0.4.5-r1
Ebuild name:

media-video/wireplumber-0.4.5-r1

Description

Replacement for pipewire-media-session

Added to portage

2021-12-02

xorg-sgml-doctools - 1.11
Ebuild name:

x11-base/xorg-sgml-doctools-1.11

Description

SGML entities and XML/CSS stylesheets used in X.Org docs

Added to portage

2021-12-02

ytree - 2.04
Ebuild name:

app-misc/ytree-2.04

Description

A curses-based file manager

Added to portage

2021-12-02

zabbix - 4.0.36
Ebuild name:

net-analyzer/zabbix-4.0.36

Description

ZABBIX is software for monitoring of your applications, network and serv

Added to portage

2021-12-02

zabbix - 5.0.18
Ebuild name:

net-analyzer/zabbix-5.0.18

Description

ZABBIX is software for monitoring of your applications, network and serv

Added to portage

2021-12-02

zabbix - 5.4.8
Ebuild name:

net-analyzer/zabbix-5.4.8

Description

ZABBIX is software for monitoring of your applications, network and serve

Added to portage

2021-12-02

zoom - 5.8.6.739
Ebuild name:

net-im/zoom-5.8.6.739

Description

Video conferencing and web conferencing service

Added to portage

2021-12-02

rdf newsfeed | rss newsfeed | Atom newsfeed
- Powered by LeopardCMS - Running on Gentoo -
Copyright 2004-2020 Sascha Nitsch Unternehmensberatung GmbH
Valid XHTML1.1 : Valid CSS : buttonmaker
- Level Triple-A Conformance to Web Content Accessibility Guidelines 1.0 -
- Copyright and legal notices -
Time to create this page: 18.1 ms