from small one page howto to huge articles all in one place

search text in:




Other .linuxhowtos.org sites: www.linuxhowtos.org
toolsntoys.linuxhowtos.org



Last additions:
How to make X listen on port 6000

How to make X listen on port 6000

words:

34

views:

89077

userrating:

average rating: 1.2 (52 votes) (1=very good 6=terrible)


May, 25th 2007:
April, 26th 2007:
Apr, 10th. 2007:
Druckversion . pdf icon
You are here: Portage


Details of dev-perl/Error:

Description: Error/exception handling in an OO-ish way

available versions:

releasesalphaamd64armhppaia64mipsppcppc64ppc macoss390shsparcx86USE-Flagsdependenciesebuild warnings
Error-0.170.300-r1 ~++~-~++-~-~+none
show
show
Legend:
+ stable
~ testing
- not available
some ebuild warning depend on specific use-flags or architectures, all ebuild-warnings are shown.

Known bugs:
bug IDcomponentassigned tostatusdescriptionlast change
365029Enhancement/Feature Requestsdev-portageUNCONFIRMEDemerge-webrsync incorrect/incomplete proxy error codes handling2011-05-10 11:19:57
366757ApplicationshannoUNCONFIRMED=media-libs/gegl-0.1.6 - ff-load.c:79: error: duplicate case value2011-05-11 08:40:52
367699Ebuildsmedia-videoUNCONFIRMEDmedia-video/winki - winki: [..] ImportError: No module named gnome (missing RDEPEND?)2011-05-17 23:55:09
368473Applicationssci-biologyUNCONFIRMEDsci-biology/hmmer-3.0 fails to build with "mpi.c:27:23: error: impl_dummy.: No such file or director2011-06-21 09:31:43
369987Ebuildsmedia-tvUNCONFIRMEDapp-misc/lirc-0.9.0 emerge error econf failed2012-07-17 20:43:17
370001EbuildswrobelUNCONFIRMED[kolab overlay] ERROR: net-mail/kolab-resource-handlers-2.1 failed (depend phase): * php-lib.ecla2011-12-31 17:37:47
370087Core systemtoolchainUNCONFIRMEDsys-libs/glibc-2.12.2: MAKEOPTS=-s: ld hits internal error at bfd/elf32-i386.c:2946:elf_i386_relocat2012-04-13 23:36:33
370275Applicationsmedia-videoUNCONFIRMEDmedia-video/libav-0.7_pre20110327 error: selected processor does not support ARM mode2011-10-26 17:48:22
371322Eclasses and ProfilesadaUNCONFIRMEDdev-lang/gnat-gcc-4.3.2 - work/gcc-4.3.2/libgcc/../gcc/unwind-pe.h:136: error: expected declaration 2012-03-19 19:22:36
372375ApplicationstoveUNCONFIRMEDapp-shells/zsh-4.3.11-r1 error: "compaudit:107: unknown group"2012-12-22 09:22:46
373039EbuildslackUNCONFIRMEDx11-plugins/gkrellmss — gkrellmss.h:23:30: fatal error: gkrellm2/gkrellm.h: No such file or director2011-07-03 16:43:54
373073Eclasses and ProfilesgamesUNCONFIRMEDcdrom.eclass: logic error in cdrom_get_cds path check2012-01-24 02:52:25
373823Toolstools-portageUNCONFIRMEDapp-portage/gentoolkit-0.3.0.4: `euse -i` dumps errors about missing repo_name files2012-12-25 01:55:28
373847ApplicationshannoUNCONFIRMEDmedia-gfx/gimp-2.6.11-r1: crash on startup with error GLib-WARNING ignoring no-arg, optional-arg or 2011-10-22 18:15:20
373891EbuildsramerethUNCONFIRMEDnet-misc/stunnel build fails: #error OpenSSL library compiled without thread support2012-12-25 04:27:10
374505ApplicationsbluenessUNCONFIRMEDdev-util/gperf-3.0.4: compile error collect2: ld returned 1 exit status2012-02-04 01:23:02
374949BugzillabugzillaUNCONFIRMEDSubmitting bugs with attachments without method to determine content type causes error but still cre2011-10-30 23:16:37
376435Prefix SupportprefixUNCONFIRMEDnet-libs/libpcap-1.1.1-r1 - ./pcap-usb-linux.c:228: error: storage size of 'ctrl' isn't known2011-12-19 02:04:51
376823JavajavaUNCONFIRMEDdev-java/icedtea-6.1.10.3: I have problems when open Jdownloader program. A fatal error has been det2011-12-08 10:40:09
377395Libraryx11UNCONFIRMED[drm:radeon_crtc_page_flip] *ERROR* failed to reserve new rbo buffer before flip2011-08-03 08:59:16
377925DevelopmentpythonUNCONFIRMEDdev-python/docutils-0.[78]: TypeError: can't use a bytes pattern on a string-like object2011-10-07 21:22:24
379475Applicationsmaintainer-neededUNCONFIRMEDwww-apache/mod_dnssd - Avahi: "invalid host name" error, always uses "localhost" no matter what2013-01-01 20:35:50
381279Servernet-imUNCONFIRMEDnet-im/jabberd2-2.2.4: error: XML parse error (not well-formed (invalid token)) in c2s log for some 2012-10-20 06:45:03
382827Coredev-portageUNCONFIRMEDsys-apps/portage-2.1.10.11 crashes with confusing error when out of memory: TypeError: an integer is2011-09-14 13:56:03
384581Mac OSXprefixUNCONFIRMEDapp-editors/emacs-23.3-r2: emerge failed with error unexec: my_endbss_static is not in section __bss2011-10-31 03:04:33
385109Applicationsmedia-videoUNCONFIRMEDmedia-video/vlc-1.1.11 segfault error2012-09-19 13:08:57
385401ApplicationslxnayUNCONFIRMEDapp-admin/packagekit-base-0.6.18 compile error on using python3 as default2012-05-12 22:10:25
385741Applicationsfreedesktop-bugsUNCONFIRMEDsys-power/pm-utils-1.4.1-r2: delay upon starting xsession resulting in harddrive error2011-10-14 00:25:12
386661DevelopmentadaUNCONFIRMED[portage-multilib] dev-lang/gnat-gcc: configure error for x85-abi due to gnatboot-4.4-amd64.tar.bz22012-12-25 21:03:35
386947Librarymedia-videoUNCONFIRMEDmedia-libs/libdv-1.0.0-r2 - enc_input.c:1021:26: error: array type has incomplete element type2011-11-12 17:03:32
387341ApplicationsbilllUNCONFIRMEDmedia-video/ogmrip-0.13.6 - ogmdvd-disc.h:71:1: error: expected '=', ',', ';', 'asm' or '__attribute2011-10-27 17:36:11
388325EbuildsvoyageurUNCONFIRMEDsys-devel/llvm-2.9-r2 shared lib linking error2012-05-12 10:54:41
389533Applicationsdesktop-wmUNCONFIRMEDx11-wm/icewm-1.3.7 - src_test(): iceview.cc:480:38: error: no matching function for call to ‘TextVie2012-07-05 11:48:34
389763JavajavaUNCONFIRMEDdev-java/ecj-gcj-3.5.2-r2 - /usr/libexec/gcc/i686-pc-linux-gnu/4.5.3/ecj1: symbol lookup error: /usr2011-11-08 15:48:12
390261EbuildschutzpahUNCONFIRMEDwww-plugins/nspluginwrapper-1.4.4-r1 - /usr/include/dirent.h:42:19: error: conflicting types for 'in2012-08-11 07:17:55
392379ApplicationsvmwareUNCONFIRMEDapp-emulation/vmware-modules-238.5: vmmon-only/linux/hostif.c:2749:4: error: implicit declaration of2012-03-26 11:36:37
393039FreeBSDbsdUNCONFIRMEDapp-misc/screen on Gentoo/FBSD9 - os.h:275:20: error: utmp.h: No such file or directory2012-12-04 00:53:30
395109Unspecifiedlu_zeroUNCONFIRMEDmedia-video/lives-1.4.6 "Capture External Window" fails to render video; errors in console2011-12-19 12:16:42
395399UnspecifiedperlUNCONFIRMEDapp-portage/perl-info: can't print out error message if PORTDIR is not set2011-12-20 20:21:36
395717Ebuildsweb-appsUNCONFIRMED[webapps-experimental overlay] www-apps/cforum-3.4.11 - /usr/include/bits/fcntl2.h:51:24: error: cal2011-12-28 16:56:06
396179ApplicationspatrickUNCONFIRMEDdev-lang/nqp-2011.10 - /usr/bin/parrot: symbol lookup error: dynext/nqp_group.so: undefined symbol: 2011-12-27 21:15:43
396211ApplicationsproaudioUNCONFIRMEDmedia-sound/ardour crashes - /usr/share/themes/Clearlooks/gtk-2.0/gtkrc:76: error: unexpected identi2012-10-06 14:26:04
396583ApplicationsgstreamerUNCONFIRMEDmedia-plugins/gst-plugins-ffmpeg-0.10.13-r1 - libavcodec/x86/h264_deblock_10bit.asm:421: error: inva2012-02-29 20:47:12
398089ApplicationstristanUNCONFIRMEDx11-misc/revelation-0.4.11-r2 USE=applet - configure:13842: error: failed to find module gnomeapplet2012-01-10 00:03:01
398151ApplicationschutzpahUNCONFIRMEDnet-mail/courier-imap-4.5.0 error in man page mkpop3dcert2012-01-08 16:37:08
398399ApplicationsvimUNCONFIRMEDapp-editors/vim-7.3.393 - if_perl.c:1102:1: error: static declaration of 'XS_VIM_Msg' follows non-st2012-09-29 14:38:20
399115Ebuildsnet-p2pUNCONFIRMEDnet-p2p/rtorrent-0.8.9 - .../work/rtorrent-0.8.9/src/core/download.h:76:84: error: ‘class core::Down2012-04-08 10:10:28
399471JavajavaUNCONFIRMEDdev-java/ibm-jre-bin-1.6.0.9_p2-r1: error while loading shared libraries: libstdc++.so.5: cannot op2012-01-27 02:05:35
399741PrintingprintingUNCONFIRMEDmedia-libs/plotutils-2.6 - g_miscmi.c:26:58: fatal error: xmi.h: No such file or directory2013-02-12 05:34:31
400547DevelopmentvoyageurUNCONFIRMEDdev-libs/STLport-5.2.1 does not compile using clang++ due to error in stlport/stl/_locale.h2012-01-25 13:51:23
400609Unspecifiednet-mailUNCONFIRMEDnet-mail/perdition-1.18 - fails to build with errors because of a multi line macro in net-libs/vanes2012-12-04 18:16:40
400843Prefix SupportprefixUNCONFIRMEDdev-python/pygtk-2.24.0-r2 fails to build on OS 10.7 with numerous errors2012-07-13 10:10:03
401779Developmentx11UNCONFIRMEDx11-base/xorg-server-1.11.4 - XIO: fatal IO error 11 (Resource temporarily unavailable) on X server2012-02-01 17:35:48
402493ApplicationsadaUNCONFIRMEDdev-ada/adasockets-1.8.4.7 - gnatmake: "listener.adb" compilation error2012-02-07 17:45:08
402659DevelopmentpythonUNCONFIRMEDdev-python/pydb-1.26-r1 - ImportError: No module named fns2012-04-24 16:19:54
402763EbuildsgstreamerUNCONFIRMEDmedia-plugins/gst-plugins-ffmpeg-0.10.13-r1 - libavcodec/arm/dsputil_vfp.S:45: Error: selected proce2012-02-09 01:08:01
402925Ebuildsrobbat2UNCONFIRMEDdev-libs/yaz-3.0.50 with dev-libs/libgpg-error-1.10-r1[-static-libs] - libtool: grep: /usr/lib/libgp2012-02-10 18:05:02
402967Applicationskernel-miscUNCONFIRMEDsys-fs/fuse-2.8.7 - ld.gold: error: symbol fuse_new has undefined version2012-12-25 21:39:12
403301Applicationsx11UNCONFIRMEDx11-apps/intel-gpu-tools-1.1 - work/intel-gpu-tools-1.1/tests/testdisplay.c:760:38: error: storage s2012-02-14 18:04:33
403389Applicationsmedia-tvUNCONFIRMEDmedia-tv/tvtime-1.0.2_p20110131-r3 configure error - configure: error: asound needed2012-07-09 14:32:00
403455ApplicationsbilllUNCONFIRMEDmedia-video/ogmrip-0.13.7 - configure.in:132: error: possibly undefined macro: AM_GCONF_SOURCE_22012-02-15 17:31:54
403459Applicationsnet-mailUNCONFIRMEDnet-mail/perdition-1.18 - options.h:42:14: error: conflicting types for ‘gdbm_version’2012-12-04 18:16:40
403473Applicationsidl0rUNCONFIRMEDmedia-plugins/vdr-xineliboutput-1.0.5-r1 - xine_post_audiochannel.c:97:7: error: ‘post_audio_port_t’2012-09-27 15:47:31
403551OtheraltUNCONFIRMEDCompilation of gcc-4.5.3-r1 fails with "configure: error: Link tests are not allowed after GCC_NO_EX2012-02-14 10:57:13
403697Coredev-portageUNCONFIRMEDsys-apps/portage-2.1.10.46: TypeError: an integer is required2012-02-18 05:35:08
404423Unspecifiedcommon-lispUNCONFIRMEDdev-lisp/ecls-12.2.1 fails to run tests - An error occurred during initialization: Module error: Don2013-02-02 10:15:50
405089ApplicationsjlecUNCONFIRMEDapp-arch/p7zip-9.13 - ../../../Windows/Control/Controls.cpp:492:53: error: invalid conversion from '2012-05-30 19:43:20
405873ApplicationssciUNCONFIRMEDscience [overlay] sci-libs/lapackpp-2.5.4: configure: error: Blas/Lapack was not found.2012-02-27 02:46:24
405899Applicationsqmail-bugsUNCONFIRMEDnet-mail/queue-repair - /usr/bin/queue-repair.py: AttributeError: 'dict_keys' object has no attribut2012-02-27 01:35:46
406583ApplicationschithanhUNCONFIRMEDwww-plugins/lightspark-0.5.4.1-r1 build fails - error regarding some ffmpeg stuff (?)2012-03-03 01:49:39
407627Applicationsrobbat2UNCONFIRMEDsys-power/pmtools-20110323 turbostat.c:857:2: error: PIC register clobbered by ‘ebx’ in ‘asm’2012-10-07 09:44:42
408859Applicationsshell-toolsUNCONFIRMEDapp-misc/byobu-5.16: byobu-config option Help broken, IOError: No such file '/usr/share/doc/byobu/he2013-02-06 16:13:39
409119ApplicationscppUNCONFIRMEDdev-libs/STLport-5.2.1 - Fatal error: can't create obj/gcc/so/dll_main.o: No such file or directory2012-03-21 09:41:23
409303ApplicationspatrickUNCONFIRMEDdev-lang/nqp-2012.02 - In file included from dyncall_thunk.c:27:0: dyncall_thunk.h:59:1: error: func2012-03-22 14:55:21
409947Unspecifiedapp-backupUNCONFIRMEDapp-backup/rdiff-backup-1.3.3 - "Security Violation" warning then "Fatal Error"2012-03-30 06:29:16
410065ServererasUNCONFIRMEDnet-mail/dovecot-2.1.3 fails at parallel make: fatal error: ../../../src/plugins/quota/rquota.h: No 2012-07-12 15:51:16
410343Ebuildsmaintainer-neededUNCONFIRMEDnet-wireless/broadcom-sta - modprobe wl: ERROR: could not insert 'wl': No such file or directory2013-02-03 13:03:43
410451ApplicationspatrickUNCONFIRMEDwww-servers/apache-2.4.1-r1 APACHE2_MPMS="itk" - configure: error: MPM itk is not supported on this 2013-02-16 13:20:37
410651gpackages - http://packages.gentoo.org/gpackagesUNCONFIRMED500 Error, not a valid package atom2012-12-30 17:46:20
410719ApplicationsnxUNCONFIRMEDnet-misc/nxclient - nxclient: symbol lookup error: /usr/lib/libfontconfig.so.1: undefined symbol: FT2012-04-04 02:19:00
410981ToolsdolsenUNCONFIRMEDapp-portage/etc-proposals with dev-lang/python-2.7[-berkdb] - raise error, "db type could not be det2012-04-09 20:36:29
411077Applicationsdesktop-dockUNCONFIRMEDx11-plugins/wmauda-0.8 - wmauda.c:126:11: error: expected '=', ',', ';', 'asm' or '__attribute__' be2012-11-07 21:33:21
411805DevelopmentrubyUNCONFIRMEDdev-lang/ruby-1.9.3_p125 - openssl_missing.h:71:6: error: conflicting types for ‘HMAC_CTX_copy’2012-04-14 21:28:46
412457Librarymedia-videoUNCONFIRMEDmedia-video/gpac-0.4.5-r4 - ld: wxOsmo4.o: in function wxCreateApp():wxOsmo4.cpp(.text+0x1c): error:2012-04-18 15:19:39
413621Core systembase-systemUNCONFIRMEDsys-apps/coreutils-8.15 - src_test(): errors setting up rm/deep-2 and du/long-from-unreadable2012-11-20 03:30:47
413623ApplicationsproaudioUNCONFIRMEDmedia-sound/terminatorx 3.82 and 3.84 - tX_midiin.cc:452:2: error: cannot convert ‘gzFile_s**’ to ‘g2013-01-06 04:23:20
414447LibraryproaudioUNCONFIRMEDmedia-libs/lv2core-3.0 (with python 3) - ./waf: SyntaxError: invalid syntax2012-12-08 20:52:16
414451Ebuildsnet-fsUNCONFIRMEDnet-fs/netatalk-2.2.2 USE=kerberos with app-crypt/heimdal - uams_gss.c:201:37: error: 'gss_nt_servic2012-05-03 16:05:11
414593PrintingprintingUNCONFIRMEDapp-text/ghostscript-gpl 9.05-r1 - ld: error in ./sobin/libgs.so(.eh_frame); no .eh_frame_hdr table 2012-12-19 23:42:44
414793Core systemclusterUNCONFIRMEDsys-cluster/maui-3.3.1-r2 - ERROR: cannot setpgrp, errno: 1 (Operation not permitted)2012-08-06 03:49:46
414911Applicationsmedia-videoUNCONFIRMEDErrors while reading video-dvd with label contains special characters2012-05-20 15:31:07
414967Core systemtoolchainUNCONFIRMEDsys-devel/gcc-4.6.3 in dev-lang/gforth-0.7.0 - ./engine.c:460:1: internal compiler error: in simplif2012-06-28 17:14:55
415705EbuildsmozillaUNCONFIRMEDdev-libs/nspr-4.9: native-nsinstall: cannot access nspr-config (error installations by cross compila2013-01-05 13:03:46
417191Ebuildsamd64UNCONFIRMEDapp-emulation/emul-linux-x86-gtklibs-20120520 needs pax marking - gtk-query-immodules-2.0-32: error 2012-12-12 16:42:02
417429ApplicationssoundUNCONFIRMEDmedia-sound/jack-3.1.1 - src_install(): SyntaxError: ('invalid syntax', ('/usr/lib64/python2.7/site-2013-01-27 12:28:16
417639DevelopmentswegenerUNCONFIRMEDdev-util/systemtap-1.7: error: gettext infrastructure mismatch: using a Makefile.in.in from gettext 2012-12-15 13:34:09
418287Core systembase-systemUNCONFIRMEDsys-boot/grub-0.97-r11 - Failed Running autoconf ! - configure.ac:59: error: possibly undefined macr2012-10-09 04:21:54
418333Prefix SupportprefixUNCONFIRMEDnet-proxy/nylon-1.21: configure: error: libevent not found2012-10-09 21:20:43
418625Applicationssci-biologyUNCONFIRMEDsci-biology/gatk-1.5: error: name clash: sum(Collection) and sum(Collection) have t2013-02-17 08:28:02
420675ApplicationstuponeUNCONFIRMEDapp-misc/geneweb-5.02 - File "srcfile.ml", line 195, characters 4-56: Error: Unbound constructor Std2013-02-21 12:35:28
421107GNOMEgnomeUNCONFIRMEDmedia-libs/cogl-1.10.2[gles2] error with GLchar (tegra2 headers of EGL & GLES1/2)2012-06-14 15:04:50
421417Ebuildssci-electronicsUNCONFIRMEDsci-electronics/kicad-99999999 - .../work/kicad-99999999/include/common.h:50:9: error: #error "You m2012-07-07 20:05:00
421677JavajavaUNCONFIRMEDdev-java/ant-commons-net-1.8.4 - *** Semantic Error: The abstract method "int compareTo(java.lang.Ob2012-06-19 02:39:45
423817DevelopmentflameeyesUNCONFIRMEDdev-util/dwarves-1.9: ostra-cg cannot find python module ostra: ImportError: No module named ostra2012-06-27 18:54:10
423909Libraryx11UNCONFIRMEDx11-libs/xcb-util-image-0.3.9 - .../work/xcb-util-image-0.3.9/image/xcb_image.c:754:1: error: contro2012-06-28 02:58:05
424201ApplicationsjdhoreUNCONFIRMEDmedia-video/miro-5.0.1 - .../work/miro-5.0.1/linux/miro-segmenter.c:236:45: error: ‘URL_WRONLY’ unde2012-07-11 03:26:33
424365EbuildsnirbheekUNCONFIRMEDdev-python/pypy-1.9-r1: AssertionError: must come from an argument to the function, got <-88;esp>2012-07-03 14:41:31
424461EbuildssciUNCONFIRMED[science overlay] app-portage/g-octave-9999 fails running with ImportError: cannot import name Confi2012-07-02 10:57:20
425316Applicationskernel-miscUNCONFIRMEDapp-misc/fdutils-5.5-r2 - fdmount.c:25:27: fatal error: linux/ext2_fs.h: No such file or directory2012-12-12 05:51:37
426358Core systembase-systemUNCONFIRMEDsys-block/partimage server crashes with pthread error when client attempts to download image2012-07-18 00:00:36
427004Applicationsmedia-videoUNCONFIRMEDmedia-video/ffmpeg-0.10.3 ABI=x32 - libavfilter/libmpcodecs/vf_ilpack.c:116: Error: operand type mis2012-09-25 03:49:30
427048ApplicationsmozillaUNCONFIRMEDwww-client/firefox-14.0.1 fails to build with ABI x32 - /usr/include/bits/sysctl.h:19:3: error: #err2013-01-16 13:49:43
427178Core systemtoolchainUNCONFIRMEDsys-libs/glibc-2.14.1-r3 - grsec: Invalid alignment/Bus error occurred at 00000301ad4cb768 in /lib642012-11-02 18:28:59
427244DevelopmentpythonUNCONFIRMEDdev-python/networkx 1.7 - Syntax errors / warnings in Python modules for CPython 3.2: File "/usr/lib2013-01-22 11:57:15
427266Applicationsford_prefectUNCONFIRMEDmedia-sound/pulseaudio - When playing Flash plugin based video in browsers, .xsession-errors fills u2012-12-15 13:05:18
427768ApplicationsgstreamerUNCONFIRMEDmedia-plugins/gst-plugins-ffmpeg-0.10.13-r2 - gstffmpegutils.c:42:40: error: parameter 1 ('smp_fmt')2012-07-24 15:31:30
427830Core systemvoyageurUNCONFIRMEDsys-devel/clang-3.1-r4 - clang: error: unable to execute command: Illegal instruction (in .../work/l2012-07-25 14:59:26
427932JavajavaUNCONFIRMED[java-overlay] dev-java/j3d-core-1.5.1: compile phase fails with image resolution errors2012-07-24 19:35:50
428174Libraryx11UNCONFIRMEDmedia-libs/mesa-8.1_rc1_pre20120724 USE=r600-llvm-compiler - R600RegisterInfo.td:4762:27997: error: 2012-12-08 03:34:08
428220ApplicationstoolchainUNCONFIRMEDwww-client/firefox-10.0.5 - ld: BFD (GNU Binutils) 2.21.1 internal error, aborting at /var/tmp/porta2012-07-27 17:14:46
428650Libraryx11UNCONFIRMEDmedia-libs/mesa-8.1_rc1_pre20120724 - libGL error: failed to authenticate magic 5 // libGL error: fa2012-11-18 08:31:42
428724Core systemhannoUNCONFIRMEDsys-auth/pam_mount-2.13: man: invalid option -- 'l', ERROR: ld.so: object 'libsandbox.so' from LD_PR2012-07-31 00:10:12
428746ApplicationscardoeUNCONFIRMEDnet-misc/netcf-0.1.9 - drv_initscripts.c:1083:15: error: ‘NETCF_TRANSACTION’ undeclared (first use i2012-08-01 04:17:19
428850EbuildsvoipUNCONFIRMEDnet-libs/opal-9999 - .../work/opal-9999/src/h323/h323.cxx:3827:5: error: 'Fax' is not a member of 'O2012-10-07 14:58:53
429372EbuildsnirbheekUNCONFIRMEDdev-python/pypy-1.9-r1 FEATURES=sandbox - Fatal error during initialization: out of memory2012-08-02 11:53:03
429450Core systemrobbat2UNCONFIRMEDsys-apps/hwinfo-19.1 - hwinfo[NNNNN]: segfault at NNN ip NNNNNNNNNNNNNNNN sp NNNNNNNNNNNNNNNN error 2013-02-19 20:31:17
429564ApplicationsangelosUNCONFIRMEDgnome-extra/docky-2.1.4 compile error with mono 2.11.12012-09-11 06:58:49
429646GamesreavertmUNCONFIRMEDdev-games/openscenegraph-3.0.1 with sys-devel/clang-3.1 - error: cannot initialize a parameter of ty2012-08-04 00:29:11
429680[RU]gentoo-doc-ruUNCONFIRMEDLinks on GLEPs on Russian page triggers 404 error2012-08-11 20:46:28
430870ApplicationshannoUNCONFIRMEDnet-analyzer/openvas-administrator - .../work/openvas-administrator-1.1.1/src/admin.c:877:3: error: 2012-08-12 14:12:23
430938KDEkdeUNCONFIRMEDkde-base/plasma-workspace-4.8.5 fails with parallel build: fatal error: ui_killrunner_config.h: No s2012-10-24 16:55:05
431054Applicationsbase-systemUNCONFIRMEDnet-misc/icecast-2.3.3 USE=yp - libtool linker mangles CFLAGS ( x86_64-pc-linux-gnu-gcc: error: l1-c2012-08-12 20:10:16
431066UnspecifiedsoundUNCONFIRMEDmedia-libs/libvisual - error: 'sigill_handler_sse' undeclared (first use in this function)2012-11-05 15:00:00
431200ApplicationsrubyUNCONFIRMEDdev-lang/rubinius-1.2.4.20110705 - m/builtin/unpack.cpp:284:5: error: narrowing conversion of ‘214742013-02-12 09:50:38
431388ApplicationspythonUNCONFIRMEDdev-python/ipython-0.13 -AttributeError: 'StoreMagics' object has no attribute 'db'2012-08-14 15:08:54
431774LibraryaballierUNCONFIRMEDdev-ml/lwt-2.4.0 USE=doc - File "src/text/lwt_text.mli", line 48, characters 41-51: Error: Unbound m2012-08-18 15:06:00
432206ApplicationsbluenessUNCONFIRMEDnet-misc/arm with dev-lang/python:3.2 - SyntaxError: invalid syntax in print "TorCtl successfully in2013-01-15 13:00:59
432296Developmentmaintainer-neededUNCONFIRMEDdev-libs/apr-1.4.5 fails to crosscompile: configure: error: cannot run test program while cross comp2013-01-03 18:43:02
432300Core systemtoolchainUNCONFIRMEDsys-devel/gcc-4.5.3-r2 fails to crosscompile: gcc-4.5.3/libstdc++-v3/src/atomic.cc:91:62: error: inv2012-08-22 14:43:31
432588EbuildselvanorUNCONFIRMEDnet-voip/sflphone-1.0.1-r1 with net-libs/pjsip-1.8.10 (too old): sipaccount.cpp:612:17: error: ‘pjsi2012-08-24 13:48:14
433070KDEkdeUNCONFIRMEDapp-editors/kile-2.1.2-r1 - index.docbook:124: parser error : Entity 'ged.vertaald' not defined2013-02-17 22:53:14
433175ApplicationspythonUNCONFIRMEDdev-lang/python-2.7.3-r2: Exception AttributeError: AttributeError("'_DummyThread' object has no att2012-09-03 18:23:18
433649Libraryx11UNCONFIRMEDsys-kernel/gentoo-sources-3.5, media-libs/mesa-8.1_rc1_pre20120814: i915: render error detected - In2012-09-16 12:44:13
433778Core systemtoolchainUNCONFIRMEDsys-devel/prelink-20120628: prelink: gelf_getphdr.c:120: gelf_getphdr: Unexpected error: Resource te2012-12-25 07:40:36
434236DevelopmentrafaelmartinsUNCONFIRMEDdev-lua/luafilesystem-1.5.0 with dev-lang/lua-5.2.1: src/lfs.c:779:30: error: array type has incompl2013-02-03 13:08:19
434240Developmentmaintainer-neededUNCONFIRMEDdev-util/bam-0.4.0 with dev-lang/lua-5.2.1: src/context.c:34:18: error: ‘LUA_GLOBALSINDEX’ undeclare2012-09-16 10:46:57
434242DevelopmentjohnnyUNCONFIRMEDdev-vcs/monotone-1.0-r3 with dev-lang/lua-5.2.1: src/lua.hh:41:23: error: ‘LUA_GLOBALSINDEX’ was not2013-01-29 06:21:50
435168EbuildsdotnetUNCONFIRMEDdev-lang/mono-2.10.9-r2 merge fails with configure error2012-10-04 18:38:09
435266EbuildsrafaelmartinsUNCONFIRMEDdev-vcs/mercurial-server-1.2 refresh-auth fails with a syntax error2012-09-17 11:51:10
435270LibraryproaudioUNCONFIRMEDmedia-libs/aubio-0.3.2-r1 - SyntaxError: ('invalid syntax', ('/usr/lib64/python2.7/site-packages/aub2012-09-17 11:44:31
435390Applicationsphp-bugsUNCONFIRMEDdev-lang/php-5.4.7 - .../work/sapis-build/cli/ext/dba/dba_cdb.c:59:2: error: unknown type name 'uint2012-09-18 13:59:57
435442ApplicationsprintingUNCONFIRMEDapp-text/pdftk-1.44 - /usr/libexec/gcc/x86_64-pc-linux-gnu/4.7.1/ecj1: symbol lookup error: /usr/lib2012-09-18 19:33:09
435482GamesgamesUNCONFIRMEDgames-fps/rtcw-1.41b - error on game launch - ui/menddef.h not found2012-12-16 14:37:33
435674Applicationsmobile-phoneUNCONFIRMEDapp-mobilephone/gnome-phone-manager-0.68: phonemgr.c:47:2: error: too many arguments to function 'bl2012-12-18 08:29:47
435812ApplicationssciUNCONFIRMED[science overlay] sci-libs/umfpack-5.5.2 - configure: error: Cannot find blas libraries2012-09-22 17:01:25
435906Applicationssci-mathematicsUNCONFIRMEDsci-mathematics/octave-3.6.2-r1 - .../work/octave-3.6.2/src/.libs/octave: error while loading shared2013-02-04 21:38:37
436100LibrarysciUNCONFIRMEDsci-libs/scipy 0.9.0-r1 with media-libs/qhull-2012.1-r1 - scipy/spatial/qhull.c:206:25: fatal error:2013-02-03 13:03:23
436120ApplicationsgraphicsUNCONFIRMEDmedia-gfx/inkscape-0.48.3.1 configure: error: Package requirements were not met (cblas.pc)2012-10-06 20:58:27
436218EbuildsclusterUNCONFIRMEDnet-misc/pssh with dev-lang/python-3.2 - pssh --help: ImportError: No module named version2013-01-04 06:31:50
437090ServerclusterUNCONFIRMEDsys-cluster/keepalived-1.2.7-r1 "ip number count" errors2012-10-03 18:20:57
437446ApplicationsgraphicsUNCONFIRMEDmedia-gfx/nip2-7.26.4 - parser.h:57:12: error: conflicting types for ‘yyleng’ lex.c:275:11: note: pr2013-02-16 13:23:10
437590Libraryx11UNCONFIRMEDmedia-libs/mesa-9.0_pre20120918: libGL error: failed to load driver: nouveau with a ATI graphic cont2012-10-24 20:57:35
437624Developmentdev-zeroUNCONFIRMED=dev-php/libvirt-php-0.4.6: too few arguments to function ‘set_error’2012-11-08 01:34:50
437970Servernet-proxyUNCONFIRMEDnet-proxy/http-replicator-3.0-r3 - ERROR: HttpClient 1 caught an exception in __getattr__: HttpClien2012-10-11 13:53:15
438436ApplicationsgraphicsUNCONFIRMEDmedia-gfx/enblend-4.0 USE=doc - !pdfTeX error: pdfetex (file ./smooth-edge.pdf): reading image file 2012-10-15 11:31:41
438464UnspecifiedsysadminUNCONFIRMEDnet-analyzer/nagios-3.3.1: apache-2.4.3 fails to start with Syntax error on line 6 of /etc/apache2/2012-12-14 16:11:32
438692Core systemldap-bugsUNCONFIRMEDsys-auth/nss_ldap-265-r1 with sys-libs/glibc-2.16.0 - /bin/login: symbol lookup error: /lib64/libnss2013-01-23 18:05:21
438708ApplicationsroxUNCONFIRMED2012-10-17 14:29:58
438758ServerpatrickUNCONFIRMEDwww-servers/apache-2.4 - Syntax error on line 60 of /etc/apache2/modules.d/40_mod_ssl.conf: Invalid 2013-02-16 13:32:50
438834JavajavaUNCONFIRMEDdev-java/icedtea-6.1.11.4 fails to build with java.lang.OutOfMemoryError2012-10-18 18:57:31
438850Core systemfloppymUNCONFIRMEDsys-boot/grub-2.00-r1 - .../work/grub-2.00/grub-core/efiemu/i386/coredetect.c:38: Error: invalid ins2013-02-01 09:31:19
438986EbuildschutzpahUNCONFIRMEDapp-admin/salt-0.10.0 - error: file '.../work/impl_python3_2/salt-0.10.0/scripts/salt-master' does n2012-10-21 14:26:16
438996EbuildstoolchainUNCONFIRMEDsys-devel/binutils-2.23.51.0.x: gold/powerpc.cc:3255:1: error: prototype for 'typename elfcpp::Elf_t2012-12-29 21:25:21
439550Applicationsnet-imUNCONFIRMEDx11-plugins/pidgin-otr-3.2.1 - configure: error: libotr 3.2.0 or newer is required.2012-10-25 15:42:02
439676UnspecifiedvoyageurUNCONFIRMEDapp-i18n/ibus-qt-1.3.1 with clang 3.1 - qibusserializable.h:94:59: error: non-const lvalue reference2012-10-26 16:33:42
439894Applicationsapp-dictsUNCONFIRMEDapp-text/stardict - configure.ac:310: error: possibly undefined macro: AM_GCONF_SOURCE_22012-10-27 18:48:47
439982ApplicationshwoarangUNCONFIRMEDgnome-extra/nautilus-dropbox-1.4.0 - /usr/bin/rst2man.py dropbox.txt > dropbox.1 /// TypeError: 'str2012-11-04 10:56:31
440212ServergrobianUNCONFIRMEDmail-mta/exim - R=localuser T=local_delivery defer (27): File too large: error while writing to /var2012-10-30 16:23:42
440886PrintingprintingUNCONFIRMEDnet-print/cups-bjnp-1.1 - In file included from bjnp-io.c:22:0: bjnp-protocol.h:100:5: error: redefi2013-02-11 11:01:36
441760Ebuildssci-geosciencesUNCONFIRMEDsci-geosciences/gpsd-3.7 - NameError: name 'gps_regress' is not defined: File "/var/tmp/portage/sc2012-11-07 02:15:55
442320InstallCDreleaseUNCONFIRMEDinstall-cd (sparc) - errors at boot2012-12-16 05:42:05
442322Ebuildsmysql-bugsUNCONFIRMEDdev-db/myodbc-5.1.6 - Build fails against dev-db/mysql-5.5.28 - error: too many arguments to functio2013-02-09 20:29:48
442814ApplicationsfloppymUNCONFIRMEDnet-misc/freerdp-1.1.0_pre20121004-r1 CMake Error at cunit/CMakeLists.txt:28 (add_executable): Canno2012-11-13 07:00:04
442818DevelopmentmlUNCONFIRMEDdev-lang/smlnj-110.75 - bin/sml: Fatal error -- bogus fault not in ML: sig = 11, code = 0x5356c35d, 2012-11-12 22:21:25
443498LibrarydilfridgeUNCONFIRMEDmedia-libs/opencv - python/src2/cv2.cpp:1: /usr/include/python2.7/pyport.h:849:2: ??????: #error "LO2013-02-04 22:23:56
443600ApplicationssoundUNCONFIRMEDmedia-libs/libsndfile-1.0.25 - Fails test with SyntaxError: invalid syntax in binheader_writef_check2012-11-17 18:45:12
443604LibrarydotnetUNCONFIRMEDdev-dotnet/libgdiplus-2.10 - ../src/.libs/libgdiplus.so: error: undefined reference to 'atan' /// (m2012-11-19 10:30:17
443744Toolstools-portageUNCONFIRMEDapp-portage/gentoolkit -- euse displays a lot of error messages on Gentoo/FreeBSD2012-11-19 09:11:08
443958Server Problemmirror-adminUNCONFIRMEDrsync.nl.gentoo.org / 195.241.77.98 (tiscali) often reports "@ERROR: max connections (15) reached --2012-11-19 21:19:27
444104ApplicationssciUNCONFIRMEDsci-libs/scipy-0.11.0 - numpy.distutils.system_info.BlasNotFoundError2012-12-06 15:49:39
444918FreeBSDbsdUNCONFIRMEDapp-arch/libarchive-3.0.4-r1 -- getvfsbyname failed error occurs, doesn't work in x86 chroot on amd62013-01-15 12:22:54
445081ApplicationspythonUNCONFIRMEDnet-zope/zope-interface-3.8.0 - src_test(): TypeError: metaclass conflict: the metaclass of a derive2013-02-02 10:01:54
445132Core systemtoolchainUNCONFIRMEDsys-devel/gdb-7.5: build fails w/-ftracer on amd64: linux-x86-low.c:2939: Error: symbol 'start_i386_2012-11-29 19:36:23
445328DevelopmentdotnetUNCONFIRMEDdev-dotnet/glib-sharp-2.12.10 - libtool: Version mismatch error. This is libtool 2.4.2, but the libt2012-11-30 12:34:52
445550ApplicationsalexxyUNCONFIRMEDwww-apps/rutorrent-3.4-r1: outputs garbage to Apache error.log if PHP is running in strict mode2012-12-02 06:13:37
446304DevelopmentmlUNCONFIRMEDdev-lang/ocaml-4.00.1 +ocamlopt fails w/ *** [camlp4opt] Error 2552012-12-07 11:36:00
446828Applicationsrobbat2UNCONFIRMEDnet-analyzer/sslsniff-0.8-r1 - conftest.cpp:21:26: fatal error: boost/asio.hpp: No such file or dire2012-12-11 22:11:50
446934Eclasses and ProfileshattyaUNCONFIRMEDsubversion.eclass v1.83 drops local checkout if svn client fails (on transport errors)2012-12-12 01:48:29
447034Applicationsnet-imUNCONFIRMEDnet-im/mcabber-0.10.2 - Doesn't build without USE+="crypt otr" - configure.ac: error: possibly undef2013-02-02 00:21:02
447064ApplicationssgmlUNCONFIRMEDapp-text/build-docbook-catalog - file:///etc/xml/docbook:1: parser error : Document is empty2012-12-13 16:31:25
447102Applicationsidl0rUNCONFIRMEDnet-analyzer/nagstamon-0.9.9 throws glib.GError: Couldn't recognize the image file format for file '2012-12-13 14:34:59
447352Unspecifiedmaintainer-neededUNCONFIRMEDapp-laptop/tp_smapi-0.41 with kernel 3.7 - modprobe: FATAL: Error inserting tp_smapi (/lib/modules/32013-01-02 20:30:53
447356Unspecifiedpolynomial-cUNCONFIRMEDapp-emulation/virtualbox-modules-4.2.4 with kernel 3.7 - modprobe: FATAL: Error inserting vboxdrv (/2013-02-14 10:04:16
447556Mac OSXprefixUNCONFIRMEDdev-python/virtualenv-1.8.4 emerge failed with error virtualenv-3.3 already exists2013-01-19 18:48:58
447630Unspecifieddev-zeroUNCONFIRMED=net-misc/openvswitch-1.6.1-r2 - /etc/init.d/ovs-controller: ERROR: ovs-controller needs service(s) 2013-02-12 08:26:14
447708Core systemtoolchainUNCONFIRMEDsys-devel/gcc-4.7.2 fails to crosscompile for mingw64: options.c:952:3: error: ‘HAVE_GAS_ALIGNED_COM2013-02-18 16:35:04
448110DevelopmentsciUNCONFIRMEDdev-python/rpy-2.2.6-r1 fails test testInterruptR - AssertionError: True is not false2013-01-23 17:03:53
448124DevelopmenttoolchainUNCONFIRMEDsys-devel-gcc-4.5.3: internal compiler error on sci-biology/ncbi-tools++-9.0.0/work/ncbi_cxx--9_0_0/2012-12-26 17:28:43
448178LibraryqtUNCONFIRMED[qt overlay] x11-libs/qt-webkit-5.0.0: Project ERROR: Unknown module(s) in QT: opengl2013-01-09 08:46:26
448316Ebuildsdev-zeroUNCONFIRMEDapp-emulation/spice: error BadMatch request X_SetInputFocus2012-12-25 16:38:18
448354Core systemrobbat2UNCONFIRMEDsys-fs/lvm2-2.02.97-r1 fails to crosscompile: configure: error: thin_check not found in path2013-01-19 16:12:30
448830LibraryqtUNCONFIRMEDx11-libs/qt-openvg-4.8.4 - qpaintengine_vg.cpp:3212:5: error: narrowing conversion of ‘d->QVGPaintEn2013-02-17 11:26:14
448874Applicationsgnome-officeUNCONFIRMEDapp-office/glabels-3.0.1: /usr/include/evolution-data-server-3.6/libebook/e-contact.h:10:2: error: #2013-02-16 20:05:55
448910Applicationsqmail-bugsUNCONFIRMEDmail-mta/netqmail-1.06 - Force python version to 2.x. - pkg_postinst - SyntaxError: invalid token "02012-12-28 13:08:59
449296KDEkdeUNCONFIRMEDnet-im/ktp-call-ui-0.5.1: gsttaglist.h:152:28: error: conflicting declaration ‘typedef struct _GstTa2013-01-18 10:50:15
449352Gamesrich0UNCONFIRMEDgames-rpg/eternal-lands Assertion `self' failed (runtime error)2013-01-03 00:24:17
449442JavajavaUNCONFIRMED[java-overlay] dev-java/gnu-classpath-0.99: ERROR: Package ecj-gcj-* was not found!2012-12-31 12:37:35
449508EbuildsxboxUNCONFIRMEDmedia-tv/xbmc-12.0_rc2 with media-video/libav-0.8.4 - configure: error: You need either libswresampl2013-01-19 19:49:11
449656GNOMEgnomeUNCONFIRMEDgnome-base/gnome-session-3.6.2: No .xsession-errors2013-01-12 10:19:26
449716ApplicationsaballierUNCONFIRMEDnet-nntp/hellanzb.0.13-r8 - hellanzb.py: ImportError: cannot import name _NO_FILENO2013-01-02 10:57:50
449720Core systemferringbUNCONFIRMEDsys-apps/pkgcore-0.8.6: SyntaxError during compilation of Python modules for Python 3.22013-01-02 10:12:25
450262LibrarygnustepUNCONFIRMEDgnustep-base-1.24.0-r1 - Assembler messages: {standard input}:1430: Error: symbol `_OBJC_CLASS_GCObj2013-01-05 17:44:50
450322Applicationssci-biologyUNCONFIRMEDsci-biology/mira-3.4.0.2 - libtool: Version mismatch error. This is libtool 2.4, but the definition2013-02-17 09:09:47
450528Serverldap-bugsUNCONFIRMEDnet-nds/openldap-2.4.30: configure: error: crossing compiling: use --with-yielding_select=yes|no|man2013-01-07 11:32:59
450714Core systemtoolchainUNCONFIRMEDsys-libs/glibc-2.16.0: /usr/include/bits/stdlib-ldbl.h:35:1: error: 'qecvt' undeclared here (not in 2013-01-20 01:23:38
450776HardenedhardenedUNCONFIRMEDapp-emulation/wine-1.5.21 - configure: checking for -lGL... ./conftest: error while loading shared l2013-02-11 21:23:57
450964Core systemtoolchainUNCONFIRMEDsys-devel/gcc-4.6.3 - make[3]: *** [jc1] Error 12013-02-10 23:17:24
451056DevelopmentjsbronderUNCONFIRMEDsys-cluster/mpich2-1.2.1_p1-r1 fails to crosscompile: configure: error: Unable to determine Fortran 2013-01-09 15:17:48
451174DevelopmentwltUNCONFIRMEDdev-db/firebird-2.1.3.18185.0 - Unable to complete network request to host "localhost". Error readin2013-01-10 12:51:53
451316ApplicationscedkUNCONFIRMEDnet-firewall/conntrack-tools-0.9.14 - parse.c:230:34: error: ‘NULL’ undeclared (first use in this fu2013-01-11 16:17:24
451360Librarymaintainer-neededUNCONFIRMEDsci-libs/opencascade-6.5 with tcl-8.6.0-r1: src/Draw/Draw_Window.cxx:1047:37: error: 'Tcl_Interp' ha2013-02-05 07:49:56
451394Applicationsrobbat2UNCONFIRMEDsci-mathematics/nusmv-2.5.2 USE=minisat - SolverTypes.h:126:56: error: cast from 'void*' to 'int' lo2013-01-12 16:25:09
451452Core systemrobbat2UNCONFIRMEDsys-fs/lvm2-2.02.97-r1 - Errors on LV create/delete operations in systemd-196 environment.2013-02-07 01:16:09
451626Applicationssci-mathematicsUNCONFIRMED[science overlay] sci-mathematics/scilab-5.4.0 - buildDoc: Error while building documentation: Could2013-02-12 03:35:49
451668ApplicationsproaudioUNCONFIRMEDmedia-sound/lash-0.5.4-r1 with sys-devel/gcc-4.7.2 - lash.c:203:19: error: storage size of ‘max_fds’2013-02-03 22:16:12
452032Server Problemmirror-adminUNCONFIRMEDrsync.samerica.gentoo.org mirror: Input/Output error2013-01-14 14:05:17
452124Core systemrobbat2UNCONFIRMEDsys-process/audit-2.2.2 with sys-devel/automake-1.13.1 - configure.ac:34: error: 'AM_CONFIG_HEADER':2013-01-15 17:29:39
452180Prefix SupportprefixUNCONFIRMEDx11-libs/libdrm-2.4.40 - .../work/libdrm-2.4.40/intel/intel_bufmgr_gem.c:2480:11: error: 'O_CLOEXEC'2013-01-15 16:42:21
452482Applicationsmedia-videoUNCONFIRMEDmedia-video/libav-0.8.5 ABI=x32 - libavutil/x86/cpu.c:52: Error: invalid instruction suffix for `pus2013-02-03 00:43:50
452484ApplicationsnikoliUNCONFIRMED=media-video/mplayer2-2.0_p20120828 ABI=x32 - cpudetect.c:206: Error: invalid instruction suffix for2013-01-29 12:55:58
452734OtheraltUNCONFIRMEDwww-client/firefox-18.0-r1 fails to build (prefix) - fatal error: jemalloc.h: No such file or direct2013-01-29 19:41:01
452852Applicationsdev-toolsUNCONFIRMEDdev-util/insight-6.8.1 with >=dev-tcltk/itcl-4.0.0 - Error: can't find package Itcl 3.32013-02-03 11:53:40
452910Core systemsystemdUNCONFIRMEDsys-apps/systemd-196[python] needs dev-python/pygobject:3 - ImportError: No module named gi.reposito2013-01-20 17:07:04
453204Librarymobile-phoneUNCONFIRMEDdev-libs/libvformat-1.13-r2: fix some API documentation errors2013-01-21 12:38:15
453208ApplicationswiredUNCONFIRMEDwww-client/uzbl-9999 - src/uzbl-core.h:16:25: fatal error: glib/gstdio.h: No such file or directory2013-01-21 19:18:42
453338LibrarymlUNCONFIRMEDdev-ml/lablgl-1.04 - File "togl.mli", line 4, characters 14-29: Error: Unbound module Widget2013-02-01 06:27:17
453500ApplicationsbircophUNCONFIRMEDapp-doc/root-docs-5.34.03 - Error: Function Open(filename,"RECREATE") is not defined in current scop2013-02-19 19:12:58
453540ApplicationsevermindUNCONFIRMED[pro-audio overlay] media-sound/jack-audio-connection-kit-1.9.9.5: TypeError: 'list' object is not c2013-02-09 17:14:49
454118ApplicationsjlecUNCONFIRMED[science overlay] sci-chemistry/mgltools-pmv-1.5.6_rc2 - runPmv: TclError: cannot use geometry manag2013-01-30 09:02:43
454176DevelopmentpythonUNCONFIRMEDdev-lang/python - LONG_BIT error cross-building from 64-bit to 32-bit2013-01-26 18:17:25
454200Core systemtoolchainUNCONFIRMEDsys-libs/glibc-2.17 breaks almost all binaries - error while loading shared libraries: libgcc_s.so.12013-02-09 05:39:00
454228HardenedbluenessUNCONFIRMEDsys-kernel/hardened-sources-3.2.37-r2 fails to build for ia64: mm/mmap.c:1689:4: error: too few argu2013-02-21 02:26:58
454354Applicationsidella4UNCONFIRMEDapp-emulation/xen-tools-4.2.1 - Fails to compile with KeyError: '.text.asm.out/../src/smp.c.68'2013-02-01 21:20:22
454492Toolstools-portageUNCONFIRMEDapp-portage/gentoolkit-0.3.0.7 - eclean-dist: UnboundLocalError: local variable 'cleaner' referenced2013-01-29 17:40:16
454572Applicationsweb-appsUNCONFIRMEDwww-apps/phpsysinfo-3.1.0: .htaccess file syntax error for apache-2.4.32013-01-30 05:35:22
454634DevelopmentrubyUNCONFIRMEDdev-lang/ruby-1.8.7_p371 - callback.func:1:7: error: expected identifier or '(' before 'long'2013-01-30 23:00:08
454868ApplicationslackUNCONFIRMEDx11-wm/fluxbox-? with updated media-libs/glew-1.9.0 - `fbrun` yields error while loading shared libr2013-02-04 17:23:15
454956GNOMEgnomeUNCONFIRMEDgnome-base/orbit-2.14.19-r1 with sys-devel/automake-1.13.1 - test/everything/Makefile.am:81: error: 2013-02-01 06:41:21
455072ServerswegenerUNCONFIRMEDnet-dns/pdns-3.1 with USE="sqlite3" - checking for SQLITE3... configure: error: +Could not find sqli2013-02-02 17:34:19
455162DevelopmentssuominenUNCONFIRMEDdev-util/catfish-0.4.0.2 needs dev-python/pygobject:3 in RDEPEND - Error: The required module gi.rep2013-02-04 02:33:15
455238LibraryprintingUNCONFIRMEDmedia-libs/vigra-1.7.1-r1 failed (compile phase): ImportError: No module named nose2013-02-05 01:00:18
455282LibrarytitanofoldUNCONFIRMEDdev-libs/libpqxx-4.0.1 with python 3.x - TypeError: 'str' does not support the buffer interface2013-02-19 08:19:43
455302Coredev-portageUNCONFIRMEDdispatch-conf broken: OSError: [Errno 21] Is a directory2013-02-03 17:22:38
455414Librarymaintainer-neededUNCONFIRMEDdev-libs/libmix-2.05-r6 with clang-3.2 - aes/saferp.c:22:8: error: redefinition of 'expf' as differe2013-02-05 12:13:40
455636ApplicationscardoeUNCONFIRMEDapp-emulation/libvirt-1.0.2 USE=-libvirtd - node_device/node_device_udev.c:1608:37: error: unknown t2013-02-05 21:55:17
456136Libraryidl0rUNCONFIRMEDnet-dns/bind-tools with dev-libs/openssl-1.0.1c - nslookup: error: [...] /usr/lib64/engines/libgost.2013-02-11 12:12:54
456354Applicationspolynomial-cUNCONFIRMEDapp-emulation/virtualbox-4.2.6-r1 fails to build. kmk_builtin_mv shows options help. kmk error 642013-02-11 17:25:35
456388KDEkdeUNCONFIRMEDkde-misc/krename-4.0.9: fatal error: freetype/config/ftheader.h: No such file or directory2013-02-19 06:44:46
456404Applicationssci-geosciencesUNCONFIRMEDsci-geosciences/gpsbabel-1.4.4 - shape.c:23:29: fatal error: libshp/shapefil.h: No such file or dire2013-02-12 14:56:18
456770Libraryhd_brummyUNCONFIRMEDmedia-libs/FusionSound-1.1.1-r1 - core_sound.c:328:6: error: too few arguments to function 'fusion_o2013-02-11 14:57:06
456896LibrarygraphicsUNCONFIRMEDmedia-libs/lensfun-0.2.5-r2 - Fatal error: can't create out/posix.x86_64/release/libs/lensfun/mod-co2013-02-12 08:34:39
456904ApplicationsmozillaUNCONFIRMED[mozilla overlay] dev-lang/spidermonkey-1.8.8 - ./dist/include/js/HashTable.h:898:9: error: size of 2013-02-12 16:50:39
456928Applicationsphp-bugsUNCONFIRMEDdev-lang/php-5.4.8[imap] - ./conftest: symbol lookup error: /usr/lib64/libc-client.so.1: undefined s2013-02-13 19:05:07
456932JavajavaUNCONFIRMEDERROR: dev-java/netbeans-javafx-7.2 failed (compile phase)2013-02-13 20:19:37
457010ApplicationsfloppymUNCONFIRMEDnet-misc/flexget-1.0.3344: BUG: Unhandled error in plugin --series: Only '='/'!=' operators can be u2013-02-17 18:32:40
457588ApplicationsxboxUNCONFIRMEDmedia-tv/xbmc-11.0 with a PaX kernel - xbmc.bin: LLVM ERROR: Allocation failed when allocating new m2013-02-15 15:39:36
458024Applicationsnet-fsUNCONFIRMEDnet-nds/rpcbind with sys-libs/uclibc - security.c:23:26: fatal error: rpcsvc/mount.h: No such file o2013-02-20 11:38:41
458254ApplicationsvoyageurUNCONFIRMEDapp-cdr/cdrtools-3.01_alpha12 with sys-devel/clang-3.2 - sha2.c:1006:2: error: call to 'SHA384Pad' i2013-02-21 02:51:12
458278DevelopmentqtUNCONFIRMEDdev-util/eric-5.2.7 - RuntimeError: the sip module implements API v9.0 to v9.1 but the PyKDE4.kdeui 2013-02-21 12:24:07
458386ApplicationsbugsUNCONFIRMEDapp-admin/collectd-5.2.0 - Assert error in VSM_n_Arg(), [...]/work/varnish-3.0.3/lib/libvarnishapi/v2013-02-20 14:29:22
458404LibrarycppUNCONFIRMEDdev-libs/boost-1.52.0-r5 - error: Duplicate name of actual target: libboost_system.so.1.2013-02-21 02:56:16
458470ServerpatrickUNCONFIRMEDwww-servers/apache-2.4.3 - Syntax error on line 156 of /etc/apache2/httpd.conf: Invalid command 'Use2013-02-20 15:13:48
458578Applicationsbug-wranglersUNCONFIRMEDapp-misc/geneweb-5.02: Fatal error: OCaml and preprocessor have incompatible versions2013-02-21 12:27:58


back



Support us on Content Nation

New Packages

- as rdf newsfeed
- as rss newsfeed
- as Atom newsfeed
2026-10-11
backports-zstd - 1.8.0
Ebuild name:

dev-python/backports-zstd-1.8.0

Description

Backport of PEP-784 adding Zstandard to the standard library

Added to portage

2026-10-11

backrefs - 8.1
Ebuild name:

dev-python/backrefs-8.1

Description

Wrapper around re or regex that adds additional back references

Added to portage

2026-10-11

beartype - 0.23.0
Ebuild name:

dev-python/beartype-0.23.0

Description

Unbearably fast runtime type checking in pure Python

Added to portage

2026-10-11

black - 26.10.1
Ebuild name:

dev-python/black-26.10.1

Description

The uncompromising Python code formatter

Added to portage

2026-10-11

entangle - 3.0-r5
Ebuild name:

media-gfx/entangle-3.0-r5

Description

Tethered Camera Control & Capture

Added to portage

2026-10-11

executing - 2.3.0
Ebuild name:

dev-python/executing-2.3.0

Description

Get information about what a Python frame is currently doing

Added to portage

2026-10-11

gnumeric - 1.12.62
Ebuild name:

app-office/gnumeric-1.12.62

Description

The GNOME Spreadsheet

Added to portage

2026-10-11

kali-archive-keyring - 2020.2
Ebuild name:

app-crypt/kali-archive-keyring-2020.2

Description

GnuPG archive keys of the Kali archive

Added to portage

2026-10-11

librsvg - 2.62.4
Ebuild name:

gnome-base/librsvg-2.62.4

Description

Scalable Vector Graphics (SVG) rendering library

Added to portage

2026-10-11

narwhals - 2.27.1
Ebuild name:

dev-python/narwhals-2.27.1

Description

Extremely lightweight compatibility layer between dataframe libraries

Added to portage

2026-10-11

nuitka - 4.3
Ebuild name:

dev-python/nuitka-4.3

Description

Python to native compiler

Added to portage

2026-10-11

orca - 50.3
Ebuild name:

app-accessibility/orca-50.3

Description

Extensible screen reader that provides access to the desktop

Added to portage

2026-10-11

parse - 1.22.3
Ebuild name:

dev-python/parse-1.22.3

Description

Parse strings using a specification based on the Python format() syntax

Added to portage

2026-10-11

pymdown-extensions - 12.2
Ebuild name:

dev-python/pymdown-extensions-12.2

Description

Extensions for Python Markdown

Added to portage

2026-10-11

pyproject-api - 1.11.5
Ebuild name:

dev-python/pyproject-api-1.11.5

Description

API to interact with the python pyproject.toml based projects

Added to portage

2026-10-11

pyspellchecker - 0.9.1
Ebuild name:

dev-python/pyspellchecker-0.9.1

Description

Pure python spell checker based on work by Peter Norvig

Added to portage

2026-10-11

scummvm - 2026.4.0
Ebuild name:

games-engines/scummvm-2026.4.0

Description

Reimplementation of various game engines for adventures and role-pla

Added to portage

2026-10-11

soupsieve - 3.0.1
Ebuild name:

dev-python/soupsieve-3.0.1

Description

A modern CSS selector implementation for BeautifulSoup

Added to portage

2026-10-11

tox - 4.65.2
Ebuild name:

dev-python/tox-4.65.2

Description

virtualenv-based automation of test activities

Added to portage

2026-10-11

tuba - 0.11.1-r1
Ebuild name:

net-misc/tuba-0.11.1-r1

Description

Browse the Fediverse (GTK client)

Added to portage

2026-10-11

txredisapi - 1.6.0
Ebuild name:

dev-python/txredisapi-1.6.0

Description

Non-blocking redis client for python

Added to portage

2026-10-11

wcmatch - 11.1
Ebuild name:

dev-python/wcmatch-11.1

Description

Wildcard/glob file name matcher

Added to portage

2026-10-11

2026-10-10
absl-py - 2.5.1
Ebuild name:

dev-python/absl-py-2.5.1

Description

Abseil Python Common Libraries

Added to portage

2026-10-10

alephone - 20260930
Ebuild name:

games-fps/alephone-20260930

Description

Enhanced game engine version from the classic Mac game, Marathon

Added to portage

2026-10-10

alephone-durandal - 20260930
Ebuild name:

games-fps/alephone-durandal-20260930

Description

Aleph One - Marathon 2 (Durandal)

Added to portage

2026-10-10

alephone-infinity - 20260930
Ebuild name:

games-fps/alephone-infinity-20260930

Description

Aleph One - Marathon Infinity

Added to portage

2026-10-10

alephone-marathon - 20260930
Ebuild name:

games-fps/alephone-marathon-20260930

Description

Aleph One - Marathon (M1A1)

Added to portage

2026-10-10

apache-arrow - 26.0.0
Ebuild name:

dev-libs/apache-arrow-26.0.0

Description

A cross-language development platform for in-memory data

Added to portage

2026-10-10

attica - 6.31.0
Ebuild name:

kde-frameworks/attica-6.31.0

Description

Framework providing access to Open Collaboration Services

Added to portage

2026-10-10

aws-c-mqtt - 1.1.1-r1
Ebuild name:

dev-libs/aws-c-mqtt-1.1.1-r1

Description

AWS C MQTT C99 implementation

Added to portage

2026-10-10

awscli - 2.37.12
Ebuild name:

app-admin/awscli-2.37.12

Description

Universal Command Line Environment for AWS

Added to portage

2026-10-10

baloo - 6.31.0
Ebuild name:

kde-frameworks/baloo-6.31.0

Description

Framework for searching and managing metadata

Added to portage

2026-10-10

bitarray - 3.12.0
Ebuild name:

dev-python/bitarray-3.12.0

Description

Efficient arrays of booleans -- C extension

Added to portage

2026-10-10

bitwarden-cli-bin - 2026.9.1
Ebuild name:

app-admin/bitwarden-cli-bin-2026.9.1

Description

CLI client for Bitwarden compatible servers

Added to portage

2026-10-10

blockbuster - 1.5.29
Ebuild name:

dev-python/blockbuster-1.5.29

Description

Utility to detect blocking calls in the async event loop

Added to portage

2026-10-10

bluez-qt - 6.31.0
Ebuild name:

kde-frameworks/bluez-qt-6.31.0

Description

Qt wrapper for Bluez 5 DBus API

Added to portage

2026-10-10

blurb - 2.2.0
Ebuild name:

dev-python/blurb-2.2.0

Description

Tool to create and manage NEWS blurbs for CPython

Added to portage

2026-10-10

bnd - 7.4.0
Ebuild name:

dev-java/bnd-7.4.0

Description

bndlib A Swiss Army Knife for OSGi

Added to portage

2026-10-10

bnd-annotation - 7.4.0
Ebuild name:

dev-java/bnd-annotation-7.4.0

Description

bnd Annotations Library

Added to portage

2026-10-10

bnd-ant - 7.4.0
Ebuild name:

dev-java/bnd-ant-7.4.0

Description

Bnd Ant Tasks

Added to portage

2026-10-10

bnd-util - 7.4.0
Ebuild name:

dev-java/bnd-util-7.4.0

Description

AQute Bnd Utilities

Added to portage

2026-10-10

bndlib - 7.4.0
Ebuild name:

dev-java/bndlib-7.4.0

Description

bndlib A Swiss Army Knife for OSGi

Added to portage

2026-10-10

boto3 - 1.43.111
Ebuild name:

dev-python/boto3-1.43.111

Description

The AWS SDK for Python

Added to portage

2026-10-10

botocore - 1.43.111
Ebuild name:

dev-python/botocore-1.43.111

Description

Low-level, data-driven core of boto 3

Added to portage

2026-10-10

breeze-icons - 6.31.0
Ebuild name:

kde-frameworks/breeze-icons-6.31.0

Description

Breeze SVG icon theme

Added to portage

2026-10-10

cappa - 0.33.0
Ebuild name:

dev-python/cappa-0.33.0

Description

Declarative CLI argument parser

Added to portage

2026-10-10

cargo-tarpaulin - 0.37.5
Ebuild name:

dev-util/cargo-tarpaulin-0.37.5

Description

Cargo-Tarpaulin is a tool to determine code coverage achieved via t

Added to portage

2026-10-10

clamav - 1.4.6
Ebuild name:

app-antivirus/clamav-1.4.6

Description

Clam Anti-Virus Scanner

Added to portage

2026-10-10

clamav - 1.5.4
Ebuild name:

app-antivirus/clamav-1.5.4

Description

Clam Anti-Virus Scanner

Added to portage

2026-10-10

clang - 24.0.0_pre20261010
Ebuild name:

dev-python/clang-24.0.0_pre20261010

Description

Python bindings for llvm-core/clang

Added to portage

2026-10-10

clang - 24.0.0_pre20261010
Ebuild name:

llvm-core/clang-24.0.0_pre20261010

Description

C language family frontend for LLVM

Added to portage

2026-10-10

clang-common - 24.0.0_pre20261010
Ebuild name:

llvm-core/clang-common-24.0.0_pre20261010

Description

Common files shared between multiple slots of clang

Added to portage

2026-10-10

clojure - 1.12.6
Ebuild name:

dev-lang/clojure-1.12.6

Description

General-purpose programming language with an emphasis on functional program

Added to portage

2026-10-10

clojure-tools - 1.12.6.1673
Ebuild name:

dev-util/clojure-tools-1.12.6.1673

Description

Development tools for the Clojure programming language

Added to portage

2026-10-10

compiler-rt - 24.0.0_pre20261010
Ebuild name:

llvm-runtimes/compiler-rt-24.0.0_pre20261010

Description

Compiler runtime library for clang (built-in part)

Added to portage

2026-10-10

compiler-rt-sanitizers - 24.0.0_pre20261010
Ebuild name:

llvm-runtimes/compiler-rt-sanitizers-24.0.0_pre20261010

Description

Compiler runtime libraries for clang (sanit

Added to portage

2026-10-10

crengine-ng - 0.9.14
Ebuild name:

app-text/crengine-ng-0.9.14

Description

Cross-platform library designed to implement e-book readers

Added to portage

2026-10-10

cssselect - 1.6.0
Ebuild name:

dev-python/cssselect-1.6.0

Description

Parse CSS3 Selectors and translate them to XPath 1.0

Added to portage

2026-10-10

curtail - 1.17.0
Ebuild name:

media-gfx/curtail-1.17.0

Description

Image compressor, supporting PNG, JPEG and WebP

Added to portage

2026-10-10

discord - 1.0.161
Ebuild name:

net-im/discord-1.0.161

Description

All-in-one voice and text chat for gamers

Added to portage

2026-10-10

eclipse-ecj - 4.41
Ebuild name:

dev-java/eclipse-ecj-4.41

Description

Eclipse Compiler for Java

Added to portage

2026-10-10

extra-cmake-modules - 6.31.0
Ebuild name:

kde-frameworks/extra-cmake-modules-6.31.0

Description

Extra modules and scripts for CMake

Added to portage

2026-10-10

faker - 40.42.0
Ebuild name:

dev-python/faker-40.42.0

Description

A Python package that generates fake data for you

Added to portage

2026-10-10

faker - 40.43.0
Ebuild name:

dev-python/faker-40.43.0

Description

A Python package that generates fake data for you

Added to portage

2026-10-10

filelock - 4.1.0
Ebuild name:

dev-python/filelock-4.1.0

Description

A platform independent file lock for Python

Added to portage

2026-10-10

flang - 24.0.0_pre20261010
Ebuild name:

llvm-core/flang-24.0.0_pre20261010

Description

LLVM's Fortran frontend

Added to portage

2026-10-10

flang-rt - 24.0.0_pre20261010
Ebuild name:

llvm-runtimes/flang-rt-24.0.0_pre20261010

Description

LLVM's Fortran runtime

Added to portage

2026-10-10

framework-tool-tui - 0.8.6
Ebuild name:

app-laptop/framework-tool-tui-0.8.6

Description

TUI for controlling and monitoring Framework Computers hardware

Added to portage

2026-10-10

frameworkintegration - 6.31.0
Ebuild name:

kde-frameworks/frameworkintegration-6.31.0

Description

Framework for integrating Qt applications with KDE Plasm

Added to portage

2026-10-10

freeipmi - 1.6.20
Ebuild name:

sys-libs/freeipmi-1.6.20

Description

Provides Remote-Console and System Management Software as per IPMI v1.5/2.

Added to portage

2026-10-10

fsautocomplete - 0.85.0
Ebuild name:

dev-dotnet/fsautocomplete-0.85.0

Description

F language server using the Language Server Protocol

Added to portage

2026-10-10

gallery-dl - 1.32.16
Ebuild name:

net-misc/gallery-dl-1.32.16

Description

Download image galleries and collections from several image hosting sit

Added to portage

2026-10-10

glslang - 1.4.363.0
Ebuild name:

dev-util/glslang-1.4.363.0

Description

Khronos reference front-end for GLSL and ESSL, and sample SPIR-V generat

Added to portage

2026-10-10

gruvbox-theme - 9999
Ebuild name:

app-emacs/gruvbox-theme-9999

Description

Gruvbox is a retro groove color scheme, now in Emacs

Added to portage

2026-10-10

httptools - 0.9.0
Ebuild name:

dev-python/httptools-0.9.0

Description

A collection of framework independent HTTP protocol utils

Added to portage

2026-10-10

huggingface_hub - 2.1.1
Ebuild name:

sci-ml/huggingface_hub-2.1.1

Description

a client library to interact with the Hugging Face Hub

Added to portage

2026-10-10

jakartaee-migration - 1.0.13
Ebuild name:

dev-java/jakartaee-migration-1.0.13

Description

Apache Tomcat tool for migration from Java EE 8 to Jakarta EE 9

Added to portage

2026-10-10

johntheripper-jumbo - 1.9.0_p20250703
Ebuild name:

app-crypt/johntheripper-jumbo-1.9.0_p20250703

Description

Fast password cracker, community enhanced version

Added to portage

2026-10-10

johntheripper-jumbo - 9999
Ebuild name:

app-crypt/johntheripper-jumbo-9999

Description

Fast password cracker, community enhanced version

Added to portage

2026-10-10

johntheripper-jumbo - 9999
Ebuild name:

app-crypt/johntheripper-jumbo-9999

Description

Fast password cracker, community enhanced version

Added to portage

2026-10-10

json5 - 0.17.3
Ebuild name:

dev-python/json5-0.17.3

Description

A Python implementation of the JSON5 data format

Added to portage

2026-10-10

jsonpatch - 1.34
Ebuild name:

dev-python/jsonpatch-1.34

Description

Apply JSON-Patches like http

Added to portage

2026-10-10

kali-archive-keyring - 2020.2
Ebuild name:

app-crypt/kali-archive-keyring-2020.2

Description

GnuPG archive keys of the Kali archive

Added to portage

2026-10-10

kapidox - 6.31.0
Ebuild name:

kde-frameworks/kapidox-6.31.0

Description

Framework for building KDE API documentation in a standard format and

Added to portage

2026-10-10

karchive - 6.31.0
Ebuild name:

kde-frameworks/karchive-6.31.0

Description

Framework for reading, creation, and manipulation of various archive

Added to portage

2026-10-10

kauth - 6.31.0
Ebuild name:

kde-frameworks/kauth-6.31.0

Description

Framework to let applications perform actions as a privileged user

Added to portage

2026-10-10

kbookmarks - 6.31.0
Ebuild name:

kde-frameworks/kbookmarks-6.31.0

Description

Framework for managing bookmarks stored in XBEL format

Added to portage

2026-10-10

kcalendarcore - 6.31.0
Ebuild name:

kde-frameworks/kcalendarcore-6.31.0

Description

Library for interfacing with calendars

Added to portage

2026-10-10

kcmutils - 6.31.0
Ebuild name:

kde-frameworks/kcmutils-6.31.0

Description

Framework to work with KDE System Settings modules

Added to portage

2026-10-10

kcodecs - 6.31.0
Ebuild name:

kde-frameworks/kcodecs-6.31.0

Description

Framework for manipulating strings using various encodings

Added to portage

2026-10-10

kcolorscheme - 6.31.0
Ebuild name:

kde-frameworks/kcolorscheme-6.31.0

Description

Framework for downloading and sharing additional application dat

Added to portage

2026-10-10

kcompletion - 6.31.0
Ebuild name:

kde-frameworks/kcompletion-6.31.0

Description

Framework for common completion tasks such as filename or URL com

Added to portage

2026-10-10

kconfig - 6.31.0
Ebuild name:

kde-frameworks/kconfig-6.31.0

Description

Framework for reading and writing configuration

Added to portage

2026-10-10

kconfigwidgets - 6.31.0
Ebuild name:

kde-frameworks/kconfigwidgets-6.31.0

Description

Framework providing an assortment of configuration-related wid

Added to portage

2026-10-10

kcontacts - 6.31.0
Ebuild name:

kde-frameworks/kcontacts-6.31.0

Description

Address book API based on KDE Frameworks

Added to portage

2026-10-10

kcoreaddons - 6.31.0
Ebuild name:

kde-frameworks/kcoreaddons-6.31.0

Description

Framework for solving common problems such as caching, randomisat

Added to portage

2026-10-10

kcrash - 6.31.0
Ebuild name:

kde-frameworks/kcrash-6.31.0

Description

Framework for intercepting and handling application crashes

Added to portage

2026-10-10

kdav - 6.31.0
Ebuild name:

kde-frameworks/kdav-6.31.0

Description

DAV protocol implemention with KJobs

Added to portage

2026-10-10

kdbusaddons - 6.31.0
Ebuild name:

kde-frameworks/kdbusaddons-6.31.0

Description

Framework for registering services and applications per freedeskt

Added to portage

2026-10-10

kdeclarative - 6.31.0
Ebuild name:

kde-frameworks/kdeclarative-6.31.0

Description

Framework providing integration of QML and KDE work spaces

Added to portage

2026-10-10

kded - 6.31.0
Ebuild name:

kde-frameworks/kded-6.31.0

Description

Central daemon of KDE workspaces

Added to portage

2026-10-10

kdesu - 6.31.0
Ebuild name:

kde-frameworks/kdesu-6.31.0

Description

Framework to handle super user actions

Added to portage

2026-10-10

kdnssd - 6.31.0
Ebuild name:

kde-frameworks/kdnssd-6.31.0

Description

Framework for network service discovery using Zeroconf

Added to portage

2026-10-10

kdoctools - 6.31.0
Ebuild name:

kde-frameworks/kdoctools-6.31.0

Description

Tools to generate documentation in various formats from DocBook fil

Added to portage

2026-10-10

kfilemetadata - 6.31.0
Ebuild name:

kde-frameworks/kfilemetadata-6.31.0

Description

Library for extracting file metadata

Added to portage

2026-10-10

kglobalaccel - 6.31.0
Ebuild name:

kde-frameworks/kglobalaccel-6.31.0

Description

Framework to handle global shortcuts

Added to portage

2026-10-10

kguiaddons - 6.31.0
Ebuild name:

kde-frameworks/kguiaddons-6.31.0

Description

Framework providing assorted high-level user interface components

Added to portage

2026-10-10

kholidays - 6.31.0
Ebuild name:

kde-frameworks/kholidays-6.31.0

Description

Library to determine holidays and other special events for a geogra

Added to portage

2026-10-10

ki18n - 6.31.0
Ebuild name:

kde-frameworks/ki18n-6.31.0

Description

Framework based on Gettext for internationalizing user interface text

Added to portage

2026-10-10

kiconthemes - 6.31.0
Ebuild name:

kde-frameworks/kiconthemes-6.31.0

Description

Framework for icon theming and configuration

Added to portage

2026-10-10

kid3 - 3.10.2
Ebuild name:

media-sound/kid3-3.10.2

Description

Simple tag editor based on Qt

Added to portage

2026-10-10

kidletime - 6.31.0
Ebuild name:

kde-frameworks/kidletime-6.31.0

Description

Framework for detection and notification of device idle time

Added to portage

2026-10-10

kimageformats - 6.31.0
Ebuild name:

kde-frameworks/kimageformats-6.31.0

Description

Framework providing additional format plugins for Qt's image I/

Added to portage

2026-10-10

kio - 6.31.0
Ebuild name:

kde-frameworks/kio-6.31.0

Description

Framework providing transparent file and data management

Added to portage

2026-10-10

kirigami - 6.31.0
Ebuild name:

kde-frameworks/kirigami-6.31.0

Description

Lightweight user interface framework for mobile and convergent appli

Added to portage

2026-10-10

kitemmodels - 6.31.0
Ebuild name:

kde-frameworks/kitemmodels-6.31.0

Description

Framework providing data models to help with tasks such as sortin

Added to portage

2026-10-10

kitemviews - 6.31.0
Ebuild name:

kde-frameworks/kitemviews-6.31.0

Description

Framework providing additional widgets for item models

Added to portage

2026-10-10

kjobwidgets - 6.31.0
Ebuild name:

kde-frameworks/kjobwidgets-6.31.0

Description

Framework providing assorted widgets for showing the progress of

Added to portage

2026-10-10

kmime - 6.31.0
Ebuild name:

kde-frameworks/kmime-6.31.0

Description

Library for handling mail messages and newsgroup articles

Added to portage

2026-10-10

knewstuff - 6.31.0
Ebuild name:

kde-frameworks/knewstuff-6.31.0

Description

Framework for downloading and sharing additional application data

Added to portage

2026-10-10

knotifications - 6.31.0
Ebuild name:

kde-frameworks/knotifications-6.31.0

Description

Framework for notifying the user of an event

Added to portage

2026-10-10

knotifyconfig - 6.31.0
Ebuild name:

kde-frameworks/knotifyconfig-6.31.0

Description

Framework for configuring desktop notifications

Added to portage

2026-10-10

kotlin-bin - 2.4.21
Ebuild name:

dev-lang/kotlin-bin-2.4.21

Description

Statically typed language that targets the JVM and JavaScript

Added to portage

2026-10-10

kpackage - 6.31.0
Ebuild name:

kde-frameworks/kpackage-6.31.0

Description

Framework to install and load packages of non binary content

Added to portage

2026-10-10

kparts - 6.31.0
Ebuild name:

kde-frameworks/kparts-6.31.0

Description

Framework providing elaborate user-interface components

Added to portage

2026-10-10

kpeople - 6.31.0
Ebuild name:

kde-frameworks/kpeople-6.31.0

Description

KDE contact person abstraction library

Added to portage

2026-10-10

kplotting - 6.31.0
Ebuild name:

kde-frameworks/kplotting-6.31.0

Description

Framework providing easy data-plotting functions

Added to portage

2026-10-10

kpty - 6.31.0
Ebuild name:

kde-frameworks/kpty-6.31.0

Description

Framework for pseudo terminal devices and running child processes

Added to portage

2026-10-10

kquickcharts - 6.31.0
Ebuild name:

kde-frameworks/kquickcharts-6.31.0

Description

QtQuick plugin providing high-performance charts

Added to portage

2026-10-10

krita - 6.0.4.1
Ebuild name:

media-gfx/krita-6.0.4.1

Description

Free digital painting application. Digital Painting, Creative Freedom

Added to portage

2026-10-10

krunner - 6.31.0
Ebuild name:

kde-frameworks/krunner-6.31.0

Description

Framework for providing different actions given a string query

Added to portage

2026-10-10

ksecretd-services - 6.31.0
Ebuild name:

kde-frameworks/ksecretd-services-6.31.0

Description

D-Bus service files for ksecretd kwallet runtime component

Added to portage

2026-10-10

kservice - 6.31.0
Ebuild name:

kde-frameworks/kservice-6.31.0

Description

Advanced plugin and service introspection

Added to portage

2026-10-10

kstatusnotifieritem - 6.31.0
Ebuild name:

kde-frameworks/kstatusnotifieritem-6.31.0

Description

Implementation of Status Notifier Items

Added to portage

2026-10-10

ksvg - 6.31.0
Ebuild name:

kde-frameworks/ksvg-6.31.0

Description

Components for handling SVGs

Added to portage

2026-10-10

ktexteditor - 6.31.0
Ebuild name:

kde-frameworks/ktexteditor-6.31.0

Description

Framework providing a full text editor component

Added to portage

2026-10-10

ktexttemplate - 6.31.0
Ebuild name:

kde-frameworks/ktexttemplate-6.31.0

Description

Library to allow separating the structure of documents from dat

Added to portage

2026-10-10

ktextwidgets - 6.31.0
Ebuild name:

kde-frameworks/ktextwidgets-6.31.0

Description

Framework providing an assortment of widgets for displaying and

Added to portage

2026-10-10

kunitconversion - 6.31.0
Ebuild name:

kde-frameworks/kunitconversion-6.31.0

Description

Framework for converting units

Added to portage

2026-10-10

kuserfeedback - 6.31.0
Ebuild name:

kde-frameworks/kuserfeedback-6.31.0

Description

Framework to collect user feedback for applications via telemet

Added to portage

2026-10-10

kwallet - 6.31.0
Ebuild name:

kde-frameworks/kwallet-6.31.0

Description

Interface to KWallet Framework providing desktop-wide storage for pas

Added to portage

2026-10-10

kwallet-runtime - 6.31.0
Ebuild name:

kde-frameworks/kwallet-runtime-6.31.0

Description

Framework providing desktop-wide storage for passwords

Added to portage

2026-10-10

kwidgetsaddons - 6.31.0
Ebuild name:

kde-frameworks/kwidgetsaddons-6.31.0

Description

Assortment of high-level widgets for common tasks

Added to portage

2026-10-10

kwindowsystem - 6.31.0
Ebuild name:

kde-frameworks/kwindowsystem-6.31.0

Description

Framework providing access to properties and features of the wi

Added to portage

2026-10-10

kxmlgui - 6.31.0
Ebuild name:

kde-frameworks/kxmlgui-6.31.0

Description

Framework for managing menu and toolbar actions in an abstract way

Added to portage

2026-10-10

libbpf - 1.8.0
Ebuild name:

dev-libs/libbpf-1.8.0

Description

Stand-alone build of libbpf from the Linux kernel

Added to portage

2026-10-10

libclc - 24.0.0_pre20261010
Ebuild name:

llvm-runtimes/libclc-24.0.0_pre20261010

Description

OpenCL C library

Added to portage

2026-10-10

libcxx - 24.0.0_pre20261010
Ebuild name:

llvm-runtimes/libcxx-24.0.0_pre20261010

Description

New implementation of the C++ standard library, targeting C

Added to portage

2026-10-10

libcxxabi - 24.0.0_pre20261010
Ebuild name:

llvm-runtimes/libcxxabi-24.0.0_pre20261010

Description

Low level support for a standard C++ library

Added to portage

2026-10-10

libg - 7.4.0
Ebuild name:

dev-java/libg-7.4.0

Description

A library to be statically linked. Contains many small utilities

Added to portage

2026-10-10

libgcc - 24.0.0_pre20261010
Ebuild name:

llvm-runtimes/libgcc-24.0.0_pre20261010

Description

Compiler runtime library for clang, compatible with libgcc_

Added to portage

2026-10-10

libunwind - 24.0.0_pre20261010
Ebuild name:

llvm-runtimes/libunwind-24.0.0_pre20261010

Description

C++ runtime stack unwinder from LLVM

Added to portage

2026-10-10

lit - 24.0.0_pre20261010
Ebuild name:

dev-python/lit-24.0.0_pre20261010

Description

A stand-alone install of the LLVM suite testing tool

Added to portage

2026-10-10

lld - 24.0.0_pre20261010
Ebuild name:

llvm-core/lld-24.0.0_pre20261010

Description

The LLVM linker (link editor)

Added to portage

2026-10-10

lldb - 24.0.0_pre20261010
Ebuild name:

llvm-core/lldb-24.0.0_pre20261010

Description

The LLVM debugger

Added to portage

2026-10-10

llvm - 24.0.0_pre20261010
Ebuild name:

dev-ml/llvm-24.0.0_pre20261010

Description

OCaml bindings for LLVM

Added to portage

2026-10-10

llvm - 24.0.0_pre20261010
Ebuild name:

llvm-core/llvm-24.0.0_pre20261010

Description

Low Level Virtual Machine

Added to portage

2026-10-10

llvm-common - 24.0.0_pre20261010
Ebuild name:

llvm-core/llvm-common-24.0.0_pre20261010

Description

Common files shared between multiple slots of LLVM

Added to portage

2026-10-10

man-pages - 6.19
Ebuild name:

sys-apps/man-pages-6.19

Description

A somewhat comprehensive collection of Linux man pages

Added to portage

2026-10-10

mlir - 24.0.0_pre20261010
Ebuild name:

llvm-core/mlir-24.0.0_pre20261010

Description

Multi-Level Intermediate Representation (library only)

Added to portage

2026-10-10

modemmanager-qt - 6.31.0
Ebuild name:

kde-frameworks/modemmanager-qt-6.31.0

Description

ModemManager bindings for Qt

Added to portage

2026-10-10

multidict - 7.1.0
Ebuild name:

dev-python/multidict-7.1.0

Description

multidict implementation

Added to portage

2026-10-10

mumps - 5.4.1
Ebuild name:

sci-libs/mumps-5.4.1

Description

MUltifrontal Massively Parallel sparse direct matrix Solver

Added to portage

2026-10-10

mutt - 2.4.3
Ebuild name:

mail-client/mutt-2.4.3

Description

A small but very powerful text-based mail client

Added to portage

2026-10-10

networkmanager-qt - 6.31.0
Ebuild name:

kde-frameworks/networkmanager-qt-6.31.0

Description

NetworkManager bindings for Qt

Added to portage

2026-10-10

ocaml - 5.5.1
Ebuild name:

dev-lang/ocaml-5.5.1

Description

Programming language supporting functional, imperative & object-oriented style

Added to portage

2026-10-10

okular - 26.04.3-r1
Ebuild name:

kde-apps/okular-26.04.3-r1

Description

Universal document viewer based on KDE Frameworks

Added to portage

2026-10-10

opencl-clang - 23.1.0
Ebuild name:

dev-libs/opencl-clang-23.1.0

Description

OpenCL-oriented thin wrapper library around clang

Added to portage

2026-10-10

openmp - 24.0.0_pre20261010
Ebuild name:

llvm-runtimes/openmp-24.0.0_pre20261010

Description

OpenMP runtime libraries for LLVM/clang compiler

Added to portage

2026-10-10

openmp-amdgcn-amd-amdhsa - 24.0.0_pre20261010
Ebuild name:

llvm-runtimes/openmp-amdgcn-amd-amdhsa-24.0.0_pre20261010

Description

OpenMP target library for amdgcn devices

Added to portage

2026-10-10

openmp-nvptx64-nvidia-cuda - 24.0.0_pre20261010
Ebuild name:

llvm-runtimes/openmp-nvptx64-nvidia-cuda-24.0.0_pre20261010

Description

OpenMP target library for nvptx64 devic

Added to portage

2026-10-10

openmp-spirv64-intel - 24.0.0_pre20261010
Ebuild name:

llvm-runtimes/openmp-spirv64-intel-24.0.0_pre20261010

Description

OpenMP target library for spirv64 Intel devic

Added to portage

2026-10-10

oxygen-icons - 6.31.0
Ebuild name:

kde-frameworks/oxygen-icons-6.31.0

Description

Oxygen SVG icon theme

Added to portage

2026-10-10

package-build - 5.1.0
Ebuild name:

app-emacs/package-build-5.1.0

Description

Tools for assembling a package archive

Added to portage

2026-10-10

pandoc-bin - 3.12.1
Ebuild name:

app-text/pandoc-bin-3.12.1

Description

Conversion between markup formats (binary package)

Added to portage

2026-10-10

polly - 24.0.0_pre20261010
Ebuild name:

llvm-core/polly-24.0.0_pre20261010

Description

Polyhedral optimizations for LLVM

Added to portage

2026-10-10

prison - 6.31.0
Ebuild name:

kde-frameworks/prison-6.31.0

Description

QRCode and data matrix barcode library

Added to portage

2026-10-10

purpose - 6.31.0
Ebuild name:

kde-frameworks/purpose-6.31.0

Description

Library for providing abstractions to get the developer's purposes fu

Added to portage

2026-10-10

pyarrow - 26.0.0
Ebuild name:

dev-python/pyarrow-26.0.0

Description

Python library for Apache Arrow

Added to portage

2026-10-10

pycparser - 3.11
Ebuild name:

dev-python/pycparser-3.11

Description

C parser and AST generator written in Python

Added to portage

2026-10-10

pypdf - 6.20.0
Ebuild name:

dev-python/pypdf-6.20.0

Description

Python library to work with PDF files

Added to portage

2026-10-10

python - 0.3.15.0
Ebuild name:

dev-lang/python-0.3.15.0

Description

Freethreading (no-GIL) version of Python programming language

Added to portage

2026-10-10

python - 3.15.0
Ebuild name:

dev-lang/python-3.15.0

Description

An interpreted, interactive, object-oriented programming language

Added to portage

2026-10-10

python-discovery - 1.6.2
Ebuild name:

dev-python/python-discovery-1.6.2

Description

Python interpreter discovery

Added to portage

2026-10-10

python-openstackclient - 10.4.0
Ebuild name:

dev-python/python-openstackclient-10.4.0

Description

A client for the OpenStack APIs

Added to portage

2026-10-10

python-tests - 0.3.15.0
Ebuild name:

dev-python/python-tests-0.3.15.0

Description

Test modules from dev-lang/python

Added to portage

2026-10-10

python-tests - 3.15.0
Ebuild name:

dev-python/python-tests-3.15.0

Description

Test modules from dev-lang/python

Added to portage

2026-10-10

pyupgrade - 3.22.0
Ebuild name:

dev-python/pyupgrade-3.22.0

Description

Tool + pre-commit hook to automatically upgrade syntax for newer Python

Added to portage

2026-10-10

qqc2-desktop-style - 6.31.0
Ebuild name:

kde-frameworks/qqc2-desktop-style-6.31.0

Description

Style for QtQuickControls 2 that uses QWidget's QStyle for

Added to portage

2026-10-10

rclone - 1.75.2
Ebuild name:

net-misc/rclone-1.75.2

Description

A program to sync files to and from various cloud storage providers

Added to portage

2026-10-10

sabctools - 9.7.2
Ebuild name:

dev-python/sabctools-9.7.2

Description

Module providing raw yEnc encoding/decoding for SABnzbd

Added to portage

2026-10-10

scalapack - 2.2.2-r1
Ebuild name:

sci-libs/scalapack-2.2.2-r1

Description

Subset of LAPACK routines redesigned for heterogenous (MPI) computing

Added to portage

2026-10-10

scalapack - 2.2.3-r1
Ebuild name:

sci-libs/scalapack-2.2.3-r1

Description

Subset of LAPACK routines redesigned for heterogenous (MPI) computing

Added to portage

2026-10-10

selenium - 4.51.0
Ebuild name:

dev-python/selenium-4.51.0

Description

Python language binding for Selenium Remote Control

Added to portage

2026-10-10

selenium-manager - 4.51.0
Ebuild name:

dev-util/selenium-manager-4.51.0

Description

CLI tool that manages the browser/driver infrastructure required b

Added to portage

2026-10-10

shaderc - 2026.4
Ebuild name:

media-libs/shaderc-2026.4

Description

Collection of tools, libraries and tests for shader compilation

Added to portage

2026-10-10

shell-maker - 0.97.5
Ebuild name:

app-emacs/shell-maker-0.97.5

Description

Interaction mode for making comint shells for GNU Emacs

Added to portage

2026-10-10

simdjson - 5.0.3
Ebuild name:

dev-libs/simdjson-5.0.3

Description

SIMD accelerated C++ JSON library

Added to portage

2026-10-10

sof-firmware - 2026.09.2
Ebuild name:

sys-firmware/sof-firmware-2026.09.2

Description

Sound Open Firmware (SOF) binary files

Added to portage

2026-10-10

solid - 6.31.0
Ebuild name:

kde-frameworks/solid-6.31.0

Description

Provider for platform independent hardware discovery, abstraction and m

Added to portage

2026-10-10

sonnet - 6.31.0
Ebuild name:

kde-frameworks/sonnet-6.31.0

Description

Framework for providing spell-checking through abstraction of popular

Added to portage

2026-10-10

spectacle - 6.7.5-r1
Ebuild name:

kde-plasma/spectacle-6.7.5-r1

Description

Screenshot capture utility

Added to portage

2026-10-10

spirv-headers - 1.4.363.0
Ebuild name:

dev-util/spirv-headers-1.4.363.0

Description

Machine-readable files for the SPIR-V Registry

Added to portage

2026-10-10

spirv-tools - 1.4.363.0
Ebuild name:

dev-util/spirv-tools-1.4.363.0

Description

Provides an API and commands for processing SPIR-V modules

Added to portage

2026-10-10

sqlglot - 30.22.0
Ebuild name:

dev-python/sqlglot-30.22.0

Description

An easily customizable SQL parser and transpiler

Added to portage

2026-10-10

syndication - 6.31.0
Ebuild name:

kde-frameworks/syndication-6.31.0

Description

Library for parsing RSS and Atom feeds

Added to portage

2026-10-10

syntax-highlighting - 6.31.0
Ebuild name:

kde-frameworks/syntax-highlighting-6.31.0

Description

Framework for syntax highlighting

Added to portage

2026-10-10

threadweaver - 6.31.0
Ebuild name:

kde-frameworks/threadweaver-6.31.0

Description

Framework for managing threads using job and queue-based interfa

Added to portage

2026-10-10

vaultwarden - 1.37.4
Ebuild name:

app-admin/vaultwarden-1.37.4

Description

Unofficial Bitwarden compatible password manager

Added to portage

2026-10-10

vulkan-headers - 1.4.363.0
Ebuild name:

dev-util/vulkan-headers-1.4.363.0

Description

Vulkan Header files and API registry

Added to portage

2026-10-10

vulkan-layers - 1.4.363.0
Ebuild name:

media-libs/vulkan-layers-1.4.363.0

Description

Vulkan Validation Layers

Added to portage

2026-10-10

vulkan-loader - 1.4.363.0
Ebuild name:

media-libs/vulkan-loader-1.4.363.0

Description

Vulkan Installable Client Driver (ICD) Loader

Added to portage

2026-10-10

vulkan-tools - 1.4.363.0
Ebuild name:

dev-util/vulkan-tools-1.4.363.0

Description

Official Vulkan Tools and Utilities for Windows, Linux, Android, an

Added to portage

2026-10-10

vulkan-utility-libraries - 1.4.363.0
Ebuild name:

dev-util/vulkan-utility-libraries-1.4.363.0

Description

Share code across various Vulkan repositories

Added to portage

2026-10-10

wine-proton - 11.0.2e
Ebuild name:

app-emulation/wine-proton-11.0.2e

Description

Valve Software's fork of Wine

Added to portage

2026-10-10

x265 - 4.3
Ebuild name:

media-libs/x265-4.3

Description

Library for encoding video streams into the H.265/HEVC format

Added to portage

2026-10-10

xfce4-panel - 4.21.3
Ebuild name:

xfce-base/xfce4-panel-4.21.3

Description

Panel for the Xfce desktop environment

Added to portage

2026-10-10

xvfbwrapper - 0.2.35
Ebuild name:

dev-python/xvfbwrapper-0.2.35

Description

Python wrapper for running a display inside X virtual framebuffer

Added to portage

2026-10-10

yq - 4.4.0
Ebuild name:

app-misc/yq-4.4.0

Description

Command-line YAML processor - jq wrapper for YAML documents

Added to portage

2026-10-10

rdf newsfeed | rss newsfeed | Atom newsfeed
Copyright 2004-2025 Sascha Nitsch Unternehmensberatung GmbH
- Copyright and legal notices -
Time to create this page: 34.1 ms