from small one page howto to huge articles all in one place

search text in:




Other .linuxhowtos.org sites: www.linuxhowtos.org
toolsntoys.linuxhowtos.org



Last additions:
How to make X listen on port 6000

How to make X listen on port 6000

words:

34

views:

89337

userrating:

average rating: 1.2 (52 votes) (1=very good 6=terrible)


May, 25th 2007:
April, 26th 2007:
Apr, 10th. 2007:
Druckversion . pdf icon
You are here: Portage


Details of app-text/par:

Description: a paragraph reformatter, vaguely similar to fmt, but better
Homepage:
http://www.nicemice.net/par/

available versions:

releasesalphaamd64armhppaia64mipsppcppc64ppc macoss390shsparcx86USE-Flagsdependenciesebuild warnings
par-1.53.0 -~---~-----~~none
show
show
Legend:
+ stable
~ testing
- not available
some ebuild warning depend on specific use-flags or architectures, all ebuild-warnings are shown.

Known bugs:
bug IDcomponentassigned tostatusdescriptionlast change
368731ApplicationsgnomeUNCONFIRMEDx11-libs/gdk-pixbuf-2.22.1: parallel install fails sometimes2012-01-30 10:16:01
368847Ebuildsmaintainer-wantedUNCONFIRMEDnet-proxy/andiparos ebuild request2011-05-27 08:47:21
373845Librarymaintainer-wantedUNCONFIRMEDdev-perl/PAR-Packer: new package2011-07-03 16:26:29
374149DevelopmentperlUNCONFIRMEDMoose-2.1.0 conflicts with all existent versions of File-ChangeNotify, MooseX-Params-Validate, and M2011-07-10 03:47:03
378645DevelopmentperlUNCONFIRMEDdev-perl/math-pari ignores profile, and fails when compiling on2011-08-20 17:10:38
381279Servernet-imUNCONFIRMEDnet-im/jabberd2-2.2.4: error: XML parse error (not well-formed (invalid token)) in c2s log for some 2012-10-20 06:45:03
382631Ebuildsmaintainer-wantedUNCONFIRMEDNew ebuild: dev-perl/HTML-StripScripts-Parser2011-09-13 20:33:24
383699ApplicationslackUNCONFIRMEDx11-plugins/screenlets-0.1.2 some parts depend on gconf-python2011-09-20 04:04:24
384137EbuildsperlUNCONFIRMEDdev-perl/Inline-0.480.0: fails tests with parallel make2011-09-27 16:26:48
384309Keywording and StabilizationperlUNCONFIRMEDadd ~sparc keyword for dev-perl/Crypt-PasswdMD52011-09-27 22:38:41
386019ApplicationsgraphicsUNCONFIRMEDmedia-gfx/openclipart-2.3 version bump2012-06-19 16:44:15
390665FreeBSDbsdUNCONFIRMEDdev-libs/openssl-1.0.0 fails to compile on sparc-fbsd2012-03-19 06:50:59
393057FreeBSDbsdUNCONFIRMEDsys-freebsd/freebsd-lib-9.0 fails to compile on sparc-fbsd2011-12-03 18:20:02
393391KDEvoyageurUNCONFIRMED[kde overlay] kde-base/katepart-9999 fails to compile with sys-devel/dragonegg-3.02012-09-28 13:05:52
394831FreeBSDbsdUNCONFIRMEDfreebsd9.0 profile for sparc2011-12-16 10:14:43
395801Applicationsmedia-videoUNCONFIRMEDmedia-video/libav-0.8_pre20111222 produces white noise with part of some music files2012-03-08 07:44:03
396179ApplicationspatrickUNCONFIRMEDdev-lang/nqp-2011.10 - /usr/bin/parrot: symbol lookup error: dynext/nqp_group.so: undefined symbol: 2011-12-27 21:15:43
396353Prefix SupportnetmonUNCONFIRMEDnet-analyzer/nmap fails with LDFLAGS="-Wl,--as-needed" on sparc64-solaris2013-01-15 17:08:42
398961Ebuildsnet-imUNCONFIRMEDnet-im/pidgin-2.10.1: please separate dbus-python dependency into a USE-flag2013-01-01 23:11:04
400721Installation Handbookdocs-teamUNCONFIRMEDPart about bonding should be reworked2012-09-05 11:11:12
402245Core systembase-systemUNCONFIRMEDsys-fs/dosfstools-3.0.12 dosfslabel does not work if long file names are used in partition2013-01-23 19:12:35
403119Core systembase-systemUNCONFIRMEDReplace sys-apps/microcode-data with a separate sys-kernel/intel-ucode2013-01-01 21:57:37
403249Core systembase-systemUNCONFIRMEDsys-apps/coreutils-8.14: Fails test-parse-datetime (exit: 134)2012-03-29 07:20:53
403283GNOMEgnomeUNCONFIRMEDgnome-base/gdm-3.2.1.1-r2 partially loads2013-01-22 22:52:56
405855Keywording and StabilizationjerUNCONFIRMEDx11-terms/rxvt-unicode-9.15 USE=-xft disables background transparency?2012-06-02 15:58:37
406583ApplicationschithanhUNCONFIRMEDwww-plugins/lightspark-0.5.4.1-r1 build fails - error regarding some ffmpeg stuff (?)2012-03-03 01:49:39
406895Ebuildsmaintainer-wantedUNCONFIRMEDmedia-gfx/psdparse-9999 - tools to parse Photoshop PSD/PSB format files2012-03-06 14:26:15
406937Ebuildsmaintainer-wantedUNCONFIRMEDdev-libs/rapidxml-1.13 - an attempt to create the fastest XML parser possible2012-03-05 20:41:21
407169Ebuildsfreedesktop-bugsUNCONFIRMEDsys-fs/udisks-1.0.4-r2 - file:///etc/xml/docbook:1: parser make[3]: *** [udisks.7] Fehler 4 parser e2012-10-03 07:06:31
408139Core systembase-systemUNCONFIRMEDsys-fs/mdadm-3.2.1 sends ioctl 1261 (BLKFLSBUF) to partition when displaying array details2012-11-11 22:39:56
409181Applicationsrobbat2UNCONFIRMEDapp-misc/g15stats - script does not parse extra options2013-01-31 19:03:48
409571Ebuildsmaintainer-wantedUNCONFIRMEDapp-vim/rainbow_paranthsis - assigns each pair of parentheses a different colour2012-03-24 17:42:11
410037Core systemmaintainer-neededUNCONFIRMEDsys-power/cpufreqd config parser prevents usage of multi-cpu profile support2012-11-18 12:15:58
410065ServererasUNCONFIRMEDnet-mail/dovecot-2.1.3 fails at parallel make: fatal error: ../../../src/plugins/quota/rquota.h: No 2012-07-12 15:51:16
410339Ebuildsmaintainer-wantedUNCONFIRMEDnew ebuild: net-libs/http-parser2012-12-20 09:45:17
411099GamesgamesUNCONFIRMEDgames-simulation/tpt_merbo-1.0 - A mod of The Powder Toy, a particle simulator2012-04-07 15:00:08
411471ServerpatrickUNCONFIRMEDapp-admin/apache-tools-2.2.22 fails on '--param keyword=value' in CFLAGS2013-02-16 13:33:09
411515Ebuildsmaintainer-wantedUNCONFIRMEDdev-util/peg - tools for generating recursive-descent parsers.2012-06-30 09:24:16
411815OpenRCopenrcUNCONFIRMEDsys-apps/openrc-0.9.8.4 does not install ethtool_ring and txqueuelen params for network cards in bon2012-05-05 17:48:36
412217LibrarysoundUNCONFIRMEDdev-libs/redland-1.0.15 has malformed Makefile, won't emerge: "missing separator"2012-04-16 17:47:14
413467Applicationspolynomial-cUNCONFIRMEDapp-emulation/virtualbox-4.1.12: parallel build sometimes fails2013-01-07 06:25:45
415367ApplicationsopenofficeUNCONFIRMEDapp-office/libreoffice selecting part of a file name does not work when using "LibreOffice file dial2012-05-10 13:37:24
415829Ebuildsmaintainer-wantedUNCONFIRMEDsci-chemistry/cclib-1.0.1 - Library for parsing and interpreting the results of computational chemis2012-05-15 15:01:01
416903ApplicationslivecdUNCONFIRMEDsys-block/parted-3.1 fails tests [t8001-loop-blkpg.sh t2100-zerolen.sh]2012-05-21 14:59:50
417365OpenRCopenrcUNCONFIRMEDsys-apps/openrc: parameter "-1" passed to dhclient, causing dhclient not to retry when failing2012-12-07 11:49:41
418007DevelopmentmaksbotanUNCONFIRMEDdev-python/scrapy-0.14.4 fails in setup while parsing urlparse_monkeypatches.py2012-06-14 16:40:49
418195Ebuildsmaintainer-wantedUNCONFIRMEDsci-misc/hets - the Heterogeneous Tool Set, a parsing, static analysis and proof management tool2012-05-30 12:49:44
418211Ebuildsmaintainer-wantedUNCONFIRMEDsys-process/xjobs - reads job descriptions line by line and executes them in parallel2012-06-01 14:23:50
418285Ebuildsmaintainer-wantedUNCONFIRMEDmedia-libs/dcmtk - DCMTK - a collection of libraries and applications implementing large parts the D2012-05-30 18:44:00
419685ServererasUNCONFIRMED=net-proxy/squid-3.1.19: eautoreconf in src_prepare() fails in libltdl/2013-01-08 02:24:49
419963DevelopmentperlUNCONFIRMEDdev-lang/perl-5.16.0 should PDEPEND virtual/perl-ExtUtils-ParseXS2012-06-07 02:24:27
421677JavajavaUNCONFIRMEDdev-java/ant-commons-net-1.8.4 - *** Semantic Error: The abstract method "int compareTo(java.lang.Ob2012-06-19 02:39:45
423399EbuildssciUNCONFIRMEDsci-libs/parmetis-3.2.0: fails tests2012-09-25 10:57:08
424445GamesgamesUNCONFIRMEDufo-ai-2.4 fails with Com_EParseValue: Illegal color statement '1 .874 .294 1'2012-08-02 20:55:27
425682Enhancement/Feature Requestsdev-portageUNCONFIRMEDTrue parallel fetch for each job running2012-07-14 20:37:13
426338genkernelgenkernelUNCONFIRMEDgenkernel 3.4.24_p2: missing separator between old and new kernel version2012-12-03 20:03:30
426358Core systembase-systemUNCONFIRMEDsys-block/partimage server crashes with pthread error when client attempts to download image2012-07-18 00:00:36
426444ApplicationsemacsUNCONFIRMEDapp-editors/emacs-23.4-r3 fails to build in parallel (--jobs=64)2012-07-18 15:26:44
427768ApplicationsgstreamerUNCONFIRMEDmedia-plugins/gst-plugins-ffmpeg-0.10.13-r2 - gstffmpegutils.c:42:40: error: parameter 1 ('smp_fmt')2012-07-24 15:31:30
428138ApplicationsjdhoreUNCONFIRMEDwww-client/seamonkey-bin-2.10.1: png icon has no transparency2012-07-26 17:38:00
429646GamesreavertmUNCONFIRMEDdev-games/openscenegraph-3.0.1 with sys-devel/clang-3.1 - error: cannot initialize a parameter of ty2012-08-04 00:29:11
429674Libraryamd64UNCONFIRMEDapp-emulation/emul-linux-x86-medialibs: move media-libs/faac to a separate package due to license "i2012-11-02 18:16:56
430102Unclassifieddev-portageUNCONFIRMEDEmerging in a deleted directory outputs lots of "getcwd: cannot access parent directories: No such f2012-08-21 00:22:33
430190Coredev-portageUNCONFIRMEDSlot conflict because of "no parents that aren't satisfied by other packages in this slot"2012-08-07 14:41:13
430938KDEkdeUNCONFIRMEDkde-base/plasma-workspace-4.8.5 fails with parallel build: fatal error: ui_killrunner_config.h: No s2012-10-24 16:55:05
431912InstallCDreleaseUNCONFIRMEDinstall-x86-minimal-20120710.iso - boot hangs while looking for cdrom when encounters swap partition2013-02-21 02:38:59
433003LibrarypythonUNCONFIRMEDdev-libs/libxml2 - File "/usr/lib/python2.7/xml/sax/__init__.py", line 93, in make_parser raise 2012-09-09 04:48:34
433070KDEkdeUNCONFIRMEDapp-editors/kile-2.1.2-r1 - index.docbook:124: parser error : Entity 'ged.vertaald' not defined2013-02-17 22:53:14
435690Applicationsmysql-bugsUNCONFIRMEDdev-db/mysql-5.1.62-r1 - Makefile:186: *** missing separator. Stop.2013-02-04 23:51:03
436448Applicationsdesktop-miscUNCONFIRMEDx11-misc/parcellite-1.0.2_rc5 generates too many interrupts (as seen in powertop)2012-10-08 19:44:07
436596Applicationsandrej.filipcicUNCONFIRMEDnet-fs/openafs-1.6.1-r1: parallel build failure - In file included from db_dump.c:31:0: database.h:12012-09-29 15:38:55
437446ApplicationsgraphicsUNCONFIRMEDmedia-gfx/nip2-7.26.4 - parser.h:57:12: error: conflicting types for ‘yyleng’ lex.c:275:11: note: pr2013-02-16 13:23:10
437494Core - Interface (emerge)dev-portageUNCONFIRMEDProvide a parameter for emerge so that 'emerge -pv' can display package description along with other2012-10-08 19:09:40
437704Applicationsmedia-videoUNCONFIRMEDmedia-video/gpac-0.4.5-r5: wxOsmo4.o: undefined reference to symbol 'gtk_widget_get_parent_window'2012-10-09 15:40:38
441862ApplicationsalexxyUNCONFIRMEDsys-apps/gptfdisk-0.8.5 - In function `GPTPart::GetDescription()': gptpart.cc:(.text+0x179): undefin2013-02-12 11:55:19
442222Ebuildsmaintainer-wantedUNCONFIRMEDdev-libs/thrust - a parallel algorithms library which resembles the C++ Standard Template Library2012-11-07 17:53:54
442320InstallCDreleaseUNCONFIRMEDinstall-cd (sparc) - errors at boot2012-12-16 05:42:05
442662Ebuildsmysql-bugsUNCONFIRMEDdev-db/mysql-connector-c++ - Output from mysql_config is parsed in in ugly way.2012-11-19 15:55:25
446142EbuildsmattschUNCONFIRMEDnet-misc/openconnect-4.07 - after 30 minutes the VPN reconnects but only has a partially working con2013-01-09 13:33:21
446198Ebuildsmaintainer-wantedUNCONFIRMEDdev-python/python-xcaplib-1.0.17 - Client for managing full or partial XML documents on XCAP servers2012-12-06 21:23:53
446204Core systemvapierUNCONFIRMEDsys-devel/crossdev: cross-emerge: support multiple parallel SYSROOTs for a single target2012-12-06 22:15:24
447006Enhancement/Feature Requestsportage-utilsUNCONFIRMEDapp-portage/portage-utils' "qgrep" should parse multiple args over entire file for broader search re2012-12-12 17:20:02
447044Ebuildsmaintainer-wantedUNCONFIRMEDdev-perl/Parse-DebianChangelog - Parse Debian changelogs and output them in other formats2012-12-26 21:51:22
447064ApplicationssgmlUNCONFIRMEDapp-text/build-docbook-catalog - file:///etc/xml/docbook:1: parser error : Document is empty2012-12-13 16:31:25
447474Core systembase-systemUNCONFIRMEDsys-devel/make-3.82-r4 - fails 1 test in features/parallelism2012-12-17 16:10:34
447502LibrarysciUNCONFIRMEDdev-python/numpy-1.6.2 - FAIL: test_pareto (test_random.TestRandomDist)2013-01-05 08:15:18
447882Keywording and Stabilizationweb-appsUNCONFIRMEDKeyword request: Please add the sparc keyword to www-apps/gallery2012-12-20 14:52:24
448334Core systembase-systemUNCONFIRMEDsys-apps/hdparm: add support for disk id in /etc/init.d/hdparm2013-01-09 18:41:41
448470Core systemrobbat2UNCONFIRMEDsys-process/audit-2.2.2 incorrectly suggests removal of /lib/libauparse.so.02013-02-03 19:08:30
449652Ebuildsmaintainer-wantedUNCONFIRMEDmedia-video/enzyme-0.2.ebuild - Video metadata parser2013-01-22 02:24:26
451054LibrarycjkUNCONFIRMEDdev-libs/oniguruma-5.9.2-r1 - autotools-utils_src_prepare: Cannot find the latest automake! Tried 1.2013-01-09 14:27:12
451316ApplicationscedkUNCONFIRMEDnet-firewall/conntrack-tools-0.9.14 - parse.c:230:34: error: ‘NULL’ undeclared (first use in this fu2013-01-11 16:17:24
451532GNOMEgnomeUNCONFIRMEDnet-libs/webkit-gtk-1.10.2 - ALT parameter is not shown instead of the image2013-01-13 09:53:12
452172Unclassifieddev-portageUNCONFIRMEDemerge's --jobs does not do full parallelization due to PDEPEND circular dependencies2013-01-15 11:55:26
453002LibrarypatrickUNCONFIRMEDsci-libs/openfoam-2.1.1 - Patches to make paraFoam work with Paraview 3.98.02013-02-18 18:55:08
453122ApplicationsperlUNCONFIRMEDPlease stabilize =app-text/po4a-0.42 (was: 0.38 misparses CDATA section)2013-02-19 20:59:42
453804JavajavaUNCONFIRMEDCreate ebuilds for jdk 8 (early access release), a current Java 8 partial implementation2013-01-24 12:02:05
453842GNOMEgnomeUNCONFIRMED[PATCH] gnome-base/gnome-shell-3.6.2-r1: Fix partialy memory leaks issues2013-02-12 09:35:27
454746Core systemrobbat2UNCONFIRMEDsys-fs/lvm2-2.02.97-r1, sys-fs/udev-197-r4: /dev/mapper entries absent for dm-crypt partitions mount2013-02-04 01:37:50
455104DevelopmentpythonUNCONFIRMEDdev-python/nose-1.2.1_p2012 fails tests (fails to parse coverage output)2013-02-06 10:00:25
455210DevelopmentpythonUNCONFIRMEDdev-lang/python-3.2.3 fails to build native Parser/pgen while crosscompiling2013-02-04 19:42:53
455816Librarynet-p2pUNCONFIRMEDnet-libs/gupnp-igd - src_prepare(): libgupnp-igd/Makefile.am:64: HAVE_INTROSPECTION does not appear 2013-02-06 13:54:26
455890Core systemlivecdUNCONFIRMEDsys-block/parted - parted binary should be installed in /usr/bin2013-02-07 02:12:12
456308Core systembase-systemUNCONFIRMEDgrub2 won't launch memtest86 and memtest86+ if / and /boot are separated partitions and grub2 graphi2013-02-13 22:19:39
456796Keywording and Stabilizationnet-imUNCONFIRMEDnet-im/pyicq-t: sparc keyword request2013-02-11 17:00:43
456798ApplicationsmozillaUNCONFIRMEDwww-client/firefox and mail-client/thunderbird 17.0.2 - parallel build issues2013-02-12 22:15:37
456938DevelopmentperlUNCONFIRMEDdev-perl/XML-SAX-0.990.0, dev-perl/XML-SAX-Base-1.80.0: Fail to remove vendor_perl/.../ParserDetails2013-02-13 19:14:50
457104KernelsecurityUNCONFIRMEDDriver of cypress corrupts file-system and partition table of external hard drives with M6116 SATA B2013-02-14 15:53:16
457546Ebuildsmaintainer-wantedUNCONFIRMEDNew ebuild: dev-db/torndb-0.1 - A lightweight wrapper around MySQLdb. Originally part of the Tornado2013-02-14 15:34:22
458074OpenRCopenrcUNCONFIRMEDsys-apps/openrc-0.11.8 doesn't parse correctly options contained two words abreast self2013-02-18 13:35:38


back



Support us on Content Nation

New Packages

- as rdf newsfeed
- as rss newsfeed
- as Atom newsfeed
2026-10-19
aws-session-manager-plugin - 1.2.896.0
Ebuild name:

app-admin/aws-session-manager-plugin-1.2.896.0

Description

AWS Session Manager Plugin for aws-cli

Added to portage

2026-10-19

containerd - 2.4.2
Ebuild name:

app-containers/containerd-2.4.2

Description

A daemon to control runC

Added to portage

2026-10-19

element - 1.12.32
Ebuild name:

www-apps/element-1.12.32

Description

A glossy Matrix collaboration client for the web

Added to portage

2026-10-19

golangci-lint - 2.15.0
Ebuild name:

dev-go/golangci-lint-2.15.0

Description

Fast linters runner for Go

Added to portage

2026-10-19

heroic-bin - 2.22.4
Ebuild name:

games-util/heroic-bin-2.22.4

Description

GOG and Epic Games Launcher for Linux

Added to portage

2026-10-19

jitterentropy - 3.6.0
Ebuild name:

app-crypt/jitterentropy-3.6.0

Description

Hardware RNG based on CPU timing jitter

Added to portage

2026-10-19

jitterentropy - 3.6.3
Ebuild name:

app-crypt/jitterentropy-3.6.3

Description

Hardware RNG based on CPU timing jitter

Added to portage

2026-10-19

nextcloud - 33.0.10
Ebuild name:

www-apps/nextcloud-33.0.10

Description

Personal cloud that runs on your own server

Added to portage

2026-10-19

nextcloud - 34.0.5
Ebuild name:

www-apps/nextcloud-34.0.5

Description

Personal cloud that runs on your own server

Added to portage

2026-10-19

nextcloud - 35.0.2
Ebuild name:

www-apps/nextcloud-35.0.2

Description

Personal cloud that runs on your own server

Added to portage

2026-10-19

ollama - 0.40.6
Ebuild name:

sci-ml/ollama-0.40.6

Description

Get up and running with Llama 3, Mistral, Gemma, and other language models

Added to portage

2026-10-19

pyside - 6.12.0
Ebuild name:

dev-python/pyside-6.12.0

Description

Python bindings for the Qt framework

Added to portage

2026-10-19

starship - 1.27.0
Ebuild name:

app-shells/starship-1.27.0

Description

The minimal, blazing-fast, and infinitely customizable prompt for any sh

Added to portage

2026-10-19

2026-10-18
Tensile - 10.1.0
Ebuild name:

dev-util/Tensile-10.1.0

Description

A tool for creating a benchmark-driven GEMMs and tensor contractions code

Added to portage

2026-10-18

amdsmi - 10.1.0
Ebuild name:

dev-util/amdsmi-10.1.0

Description

AMD System Management Interface for managing and monitoring GPUs

Added to portage

2026-10-18

aotriton-bin - 0.14.2b
Ebuild name:

sci-libs/aotriton-bin-0.14.2b

Description

Ahead of Time (AOT) Triton Math Library (binary package)

Added to portage

2026-10-18

broot - 1.61.0
Ebuild name:

app-misc/broot-1.61.0

Description

A new way to see and navigate directory trees

Added to portage

2026-10-18

cachetools - 7.2.3
Ebuild name:

dev-python/cachetools-7.2.3

Description

Extensible memoizing collections and decorators

Added to portage

2026-10-18

clang - 23.1.3-r1
Ebuild name:

llvm-core/clang-23.1.3-r1

Description

C language family frontend for LLVM

Added to portage

2026-10-18

composable-kernel - 10.1.0
Ebuild name:

sci-libs/composable-kernel-10.1.0

Description

High Performance Composable Kernel for AMD GPUs

Added to portage

2026-10-18

ebuild-mode - 1.88-r1
Ebuild name:

app-xemacs/ebuild-mode-1.88-r1

Description

Emacs modes for editing ebuilds and other Gentoo specific files

Added to portage

2026-10-18

esptool - 5.6.0
Ebuild name:

dev-embedded/esptool-5.6.0

Description

Serial utility for flashing and interacting with Espressif ESP8266 and E

Added to portage

2026-10-18

filelock - 4.2.1
Ebuild name:

dev-python/filelock-4.2.1

Description

A platform independent file lock for Python

Added to portage

2026-10-18

freeciv - 3.2.6
Ebuild name:

games-strategy/freeciv-3.2.6

Description

Multiplayer strategy game (Civilization Clone)

Added to portage

2026-10-18

gallery-dl - 1.32.17
Ebuild name:

net-misc/gallery-dl-1.32.17

Description

Download image galleries and collections from several image hosting sit

Added to portage

2026-10-18

git-cola - 4.19.0
Ebuild name:

dev-vcs/git-cola-4.19.0

Description

The highly caffeinated git GUI

Added to portage

2026-10-18

gradle-bin - 9.8.1
Ebuild name:

dev-java/gradle-bin-9.8.1

Description

A project automation and build tool with a Groovy based DSL

Added to portage

2026-10-18

hip - 10.1.0
Ebuild name:

dev-util/hip-10.1.0

Description

C++ Heterogeneous-Compute Interface for Portability

Added to portage

2026-10-18

hipBLAS - 10.1.0
Ebuild name:

sci-libs/hipBLAS-10.1.0

Description

ROCm BLAS marshalling library

Added to portage

2026-10-18

hipBLAS-common - 10.1.0
Ebuild name:

sci-libs/hipBLAS-common-10.1.0

Description

Common files shared by hipBLAS and hipBLASLt

Added to portage

2026-10-18

hipBLASLt - 10.1.0
Ebuild name:

sci-libs/hipBLASLt-10.1.0

Description

General matrix-matrix operations library for AMD Instinct accelerators

Added to portage

2026-10-18

hipCUB - 10.1.0
Ebuild name:

sci-libs/hipCUB-10.1.0

Description

Wrapper of rocPRIM or CUB for GPU parallel primitives

Added to portage

2026-10-18

hipFFT - 10.1.0
Ebuild name:

sci-libs/hipFFT-10.1.0

Description

CU / ROCM agnostic hip FFT implementation

Added to portage

2026-10-18

hipRAND - 10.1.0
Ebuild name:

sci-libs/hipRAND-10.1.0

Description

CU / ROCM agnostic hip RAND implementation

Added to portage

2026-10-18

hipSOLVER - 10.1.0
Ebuild name:

sci-libs/hipSOLVER-10.1.0

Description

CU / ROCM agnostic marshalling library for LAPACK routines on the GPU

Added to portage

2026-10-18

hipSPARSE - 10.1.0
Ebuild name:

sci-libs/hipSPARSE-10.1.0

Description

ROCm SPARSE marshalling library

Added to portage

2026-10-18

hipcc - 10.1.0
Ebuild name:

dev-util/hipcc-10.1.0

Description

Radeon Open Compute hipcc

Added to portage

2026-10-18

hipify-clang - 10.1.0
Ebuild name:

dev-util/hipify-clang-10.1.0

Description

A set of tools to translate CUDA source code into portable HIP C++

Added to portage

2026-10-18

hipother - 10.1.0
Ebuild name:

dev-libs/hipother-10.1.0

Description

ROCclr runtime implementation for non-AMD HIP platforms, like NVIDIA

Added to portage

2026-10-18

hipsparselt - 10.1.0
Ebuild name:

sci-libs/hipsparselt-10.1.0

Description

Sparse GEMM operations library for AMD Instinct accelerators

Added to portage

2026-10-18

jupyter-lsp - 2.3.1-r1
Ebuild name:

dev-python/jupyter-lsp-2.3.1-r1

Description

Multi-Language Server WebSocket proxy for Jupyter Notebook/Lab

Added to portage

2026-10-18

lazy-object-proxy - 1.13.0
Ebuild name:

dev-python/lazy-object-proxy-1.13.0

Description

A fast and thorough lazy object proxy

Added to portage

2026-10-18

libpass - 1.9.4
Ebuild name:

dev-python/libpass-1.9.4

Description

Fork of passlib, a password hashing framework

Added to portage

2026-10-18

libzip - 1.12.1
Ebuild name:

dev-libs/libzip-1.12.1

Description

Library for manipulating zip archives

Added to portage

2026-10-18

luau - 0.743
Ebuild name:

dev-lang/luau-0.743

Description

Gradually typed embeddable scripting language derived from Lua

Added to portage

2026-10-18

m17n-db - 1.8.15
Ebuild name:

dev-db/m17n-db-1.8.15

Description

Database for the m17n library

Added to portage

2026-10-18

m17n-lib - 1.8.7
Ebuild name:

dev-libs/m17n-lib-1.8.7

Description

Multilingual Library for Unix/Linux

Added to portage

2026-10-18

miopen - 10.1.0
Ebuild name:

sci-libs/miopen-10.1.0

Description

AMD's Machine Intelligence Library

Added to portage

2026-10-18

mrustc - 0.12.0_p20261018
Ebuild name:

dev-lang/mrustc-0.12.0_p20261018

Description

Mutabah's Rust Compiler

Added to portage

2026-10-18

nuitka - 4.3.1
Ebuild name:

dev-python/nuitka-4.3.1

Description

Python to native compiler

Added to portage

2026-10-18

paramiko - 5.0.1
Ebuild name:

dev-python/paramiko-5.0.1

Description

SSH2 protocol library

Added to portage

2026-10-18

platformdirs - 4.13.4
Ebuild name:

dev-python/platformdirs-4.13.4

Description

A small Python module for determining appropriate platform-specific

Added to portage

2026-10-18

pycryptodome - 4.0.1
Ebuild name:

dev-python/pycryptodome-4.0.1

Description

A self-contained cryptographic library for Python

Added to portage

2026-10-18

pypdf - 6.21.1
Ebuild name:

dev-python/pypdf-6.21.1

Description

Python library to work with PDF files

Added to portage

2026-10-18

pytest-mock - 3.17.0
Ebuild name:

dev-python/pytest-mock-3.17.0

Description

Thin-wrapper around the mock package for easier use with pytest

Added to portage

2026-10-18

pytimeparse - 1.1.10
Ebuild name:

dev-python/pytimeparse-1.1.10

Description

A small Python module to parse various kinds of time expressions

Added to portage

2026-10-18

rccl - 10.1.0
Ebuild name:

dev-libs/rccl-10.1.0

Description

ROCm Communication Collectives Library (RCCL)

Added to portage

2026-10-18

rocBLAS - 10.1.0
Ebuild name:

sci-libs/rocBLAS-10.1.0

Description

AMD's library for BLAS on ROCm

Added to portage

2026-10-18

rocFFT - 10.1.0
Ebuild name:

sci-libs/rocFFT-10.1.0

Description

Next generation FFT implementation for ROCm

Added to portage

2026-10-18

rocPRIM - 10.1.0
Ebuild name:

sci-libs/rocPRIM-10.1.0

Description

HIP parallel primitives for developing performant GPU-accelerated code on R

Added to portage

2026-10-18

rocRAND - 10.1.0
Ebuild name:

sci-libs/rocRAND-10.1.0

Description

Generate pseudo-random and quasi-random numbers

Added to portage

2026-10-18

rocSOLVER - 10.1.0
Ebuild name:

sci-libs/rocSOLVER-10.1.0

Description

Implementation of a subset of LAPACK functionality on the ROCm platform

Added to portage

2026-10-18

rocSPARSE - 10.1.0
Ebuild name:

sci-libs/rocSPARSE-10.1.0

Description

Basic Linear Algebra Subroutines for sparse computation

Added to portage

2026-10-18

rocThrust - 10.1.0
Ebuild name:

sci-libs/rocThrust-10.1.0

Description

HIP back-end for the parallel algorithm library Thrust

Added to portage

2026-10-18

rocWMMA - 10.1.0
Ebuild name:

sci-libs/rocWMMA-10.1.0

Description

library for accelerating mixed precision matrix multiply-accumulate operati

Added to portage

2026-10-18

rocdbgapi - 10.1.0
Ebuild name:

dev-libs/rocdbgapi-10.1.0

Description

AMD Debugger API

Added to portage

2026-10-18

rocm-comgr - 10.1.0
Ebuild name:

dev-libs/rocm-comgr-10.1.0

Description

Radeon Open Compute Code Object Manager

Added to portage

2026-10-18

rocm-core - 10.1.0
Ebuild name:

dev-libs/rocm-core-10.1.0

Description

Library that provides ROCm release version and install path information

Added to portage

2026-10-18

rocm-device-libs - 10.1.0
Ebuild name:

dev-libs/rocm-device-libs-10.1.0

Description

Radeon Open Compute Device Libraries

Added to portage

2026-10-18

rocm-opencl-runtime - 10.1.0
Ebuild name:

dev-libs/rocm-opencl-runtime-10.1.0

Description

Radeon Open Compute OpenCL Compatible Runtime

Added to portage

2026-10-18

rocminfo - 10.1.0
Ebuild name:

dev-util/rocminfo-10.1.0

Description

ROCm Application for Reporting System Info

Added to portage

2026-10-18

rocr-runtime - 10.1.0
Ebuild name:

dev-libs/rocr-runtime-10.1.0

Description

Radeon Open Compute Runtime

Added to portage

2026-10-18

roct-thunk-interface - 10.1.0
Ebuild name:

dev-libs/roct-thunk-interface-10.1.0

Description

Radeon Open Compute Thunk Interface

Added to portage

2026-10-18

roctracer - 10.1.0
Ebuild name:

dev-util/roctracer-10.1.0

Description

Callback/Activity Library for Performance tracing AMD GPU's

Added to portage

2026-10-18

rpp - 10.1.0
Ebuild name:

sci-libs/rpp-10.1.0

Description

AMD ROCm Performance Primitives (RPP) high-performance computer vision library

Added to portage

2026-10-18

sddm - 0.21.0_p20260819-r1
Ebuild name:

x11-misc/sddm-0.21.0_p20260819-r1

Description

Simple Desktop Display Manager

Added to portage

2026-10-18

sphinx-autodoc-typehints - 3.17.2
Ebuild name:

dev-python/sphinx-autodoc-typehints-3.17.2

Description

Type hints support for the Sphinx autodoc extension

Added to portage

2026-10-18

sqlite - 3.54.1
Ebuild name:

dev-db/sqlite-3.54.1

Description

SQL database engine

Added to portage

2026-10-18

tavern - 3.7.1
Ebuild name:

dev-python/tavern-3.7.1

Description

A tool, library, and Pytest plugin for testing RESTful APIs

Added to portage

2026-10-18

tox - 4.67.0
Ebuild name:

dev-python/tox-4.67.0

Description

virtualenv-based automation of test activities

Added to portage

2026-10-18

virtualenv - 21.14.10
Ebuild name:

dev-python/virtualenv-21.14.10

Description

Virtual Python Environment builder

Added to portage

2026-10-18

wine-staging - 11.20
Ebuild name:

app-emulation/wine-staging-11.20

Description

Free implementation of Windows(tm) on Unix, with Wine-Staging patc

Added to portage

2026-10-18

rdf newsfeed | rss newsfeed | Atom newsfeed
Copyright 2004-2025 Sascha Nitsch Unternehmensberatung GmbH
- Copyright and legal notices -
Time to create this page: 24.1 ms