from small one page howto to huge articles all in one place

search text in:




Other .linuxhowtos.org sites: www.linuxhowtos.org
toolsntoys.linuxhowtos.org



Last additions:
How to make X listen on port 6000

How to make X listen on port 6000

words:

34

views:

89124

userrating:

average rating: 1.2 (52 votes) (1=very good 6=terrible)


May, 25th 2007:
April, 26th 2007:
Apr, 10th. 2007:
Druckversion . pdf icon
You are here: Portage


Details of app-editors/fe:

Description: A small and easy to use folding editor
Homepage:
http://www.moria.de/~michael/fe/

available versions:

releasesalphaamd64armhppaia64mipsppcppc64ppc macoss390shsparcx86USE-Flagsdependenciesebuild warnings
fe-2.0-r1 -+----------+sendmail
show
show
Legend:
+ stable
~ testing
- not available
some ebuild warning depend on specific use-flags or architectures, all ebuild-warnings are shown.

Known bugs:
bug IDcomponentassigned tostatusdescriptionlast change
281522VulnerabilitiessecurityUNCONFIRMEDmedia-video/vlc Stack-based buffer overflows via smb:// URLs2012-09-19 13:03:24
365713ApplicationsclusterUNCONFIRMEDsys-cluster/maui-3.3.1 - mismatching spool dir in different files2011-05-08 19:17:50
365933Ebuildsmaintainer-wantedUNCONFIRMEDNew Ebuild, plug-0.7: Linux software for Fender Mustang amplifiers2011-05-07 04:30:11
367015Ebuildsshell-toolsUNCONFIRMEDapp-misc/dtach: scrollback buffer patch2013-01-20 10:32:16
367479Enhancement/Feature Requestsdev-portageUNCONFIRMEDemerge fetch function should be mirror-selective depending on ebuild location2012-12-07 05:07:03
369925OpenRCopenrcUNCONFIRMED/etc/conf.d/net - Setting associate_timeout_ does not have any effect with net-wireless/wpa_s2013-01-01 17:01:05
370223Applicationsrobbat2UNCONFIRMEDg-cpan crashes on install AnyEvent::Feed2011-06-09 08:02:55
371775Ebuildsmaintainer-wantedUNCONFIRMEDprotobuf-c-0.15.ebuild (New Package) - C bindings for Google's Protocol Buffers2012-06-03 20:47:25
372525ApplicationsproaudioUNCONFIRMEDmedia-sound/jack-audio-connection-kit-0.120.2 crashes with buffer overflow detected in jack_alsa.so2011-10-10 00:02:33
373281ApplicationsxemacsUNCONFIRMEDapp-editors/xemacs-21.5.31 fails to emerge, because check-features.el can not be loaded2013-02-17 11:58:08
377395Libraryx11UNCONFIRMED[drm:radeon_crtc_page_flip] *ERROR* failed to reserve new rbo buffer before flip2011-08-03 08:59:16
379177DevelopmenttexUNCONFIRMEDdev-tex/pdftex-1.40.10 ttf2afm.c:(.text+0x35e1): undefined reference to `kpse_set_progname'2011-08-19 21:14:54
379701Ebuildsmaintainer-wantedUNCONFIRMEDfeedgenerator-1.2.1.ebuild(New Package)2011-09-16 05:46:30
380295Conceptual/Abstract Ideasdev-portageUNCONFIRMED[patch] sys-apps/portage: Enhanced output for emerge --pretend --fetchonly2012-09-06 20:12:21
381333ApplicationsjerUNCONFIRMEDx11-terms/rxvt-unicode feature request (disable underline and cursor behaviour)2012-02-26 18:39:51
381679Ebuildsmaintainer-wantedUNCONFIRMEDPlease provide an ebuild for net-misc/lifenet2011-09-03 10:28:32
383295Librarymedia-videoUNCONFIRMEDmedia-libs/libdc1394-2.1.3-r1 fails to link (undefined references to yuy2_to_yv16 and yuy2_to_yv12)2011-10-05 09:12:28
383695ApplicationssoundUNCONFIRMEDBuffer overflow in media-sound/grip-3.3.1-r22012-01-18 10:56:30
383789Applicationssci-biologyUNCONFIRMEDsci-biology/ncbi-tools++-2010.06.15-r1: libmzXML.so: undefined reference to `ncbi::CMemberInfo::SetN2013-02-17 08:11:13
384925EbuildsrubyUNCONFIRMEDdev-ruby/knife-{ec2,rackspace,openstack}: ebuild request2012-05-29 04:47:03
386539Core systembase-systemUNCONFIRMEDsys-boot/grub-1.99-r2 doesn't detect framebuffer resolutions if /usr is not mounted2011-11-11 13:32:10
387009Applicationsnet-mailUNCONFIRMEDnet-mail/fetchmail - modified initscript to allow multiple daemons AND inlined configuration2011-11-08 12:12:48
390169Ebuildsmaintainer-wantedUNCONFIRMEDebuild for ADMB (Automatic Differentiation Model Builder) software suite2011-11-11 15:42:12
390415Ebuildsmaintainer-wantedUNCONFIRMEDmedia-gfx/iscan-plugin-perfection-gt-s630-0.1.1 for Epson Perfection V300 PHOTO2013-02-19 10:50:34
390429ApplicationswltUNCONFIRMEDdev-db/firebird-2.0.3.12981.0-r6: buffer overflow with kernel 3.0.62012-06-02 07:33:59
392727DevelopmentadaUNCONFIRMEDdev-lang/gnat-gcc-4.3.5: fetch failed missing gnatboot-4.3-amd64.tar.bz22012-02-03 18:23:19
392737Ebuildsmaintainer-wantedUNCONFIRMEDnet-misc/turpial-1.6.6 - Lightweigth and featurefull microblogging client2012-10-03 15:56:13
393161ApplicationsevaUNCONFIRMEDx11-drivers/xf86-input-synaptics-1.5.0: TwoFingerScroll no longer has any effect2012-03-23 20:58:34
395021Prefix SupportprefixUNCONFIRMEDWriting ebuilds that have different dependencies across platforms undocumented2012-03-01 16:39:16
395889EbuildssciUNCONFIRMED[science-overlay] embassy-domalign-0.1.0-r5 fails to fetch embassy-domalign-0.1.0-r5.tar.gz2012-02-20 14:34:34
395891ApplicationssciUNCONFIRMED[science overlay] sci-biology/embassy-memenew-4.0.0-r1 fails to fetch embassy-memenew-4.0.0-r1.tar.g2012-02-20 14:34:30
395895EbuildssciUNCONFIRMED[science-overlay] embassy-domsearch-0.1.0-r5 fails to fetch embassy-domsearch-0.1.0-r5.tar.gz2012-02-20 14:34:26
395899EbuildssciUNCONFIRMED[science-overlay] embassy-signature-0.1.0-r5 fails to fetch embassy-signature-0.1.0-r5.tar.gz2012-02-20 14:34:23
395901EbuildssciUNCONFIRMED[science-overlay] embassy-hmmer fails to fetch embassy-hmmer-2.3.2-r4.tar.gz2012-02-20 14:34:18
395905EbuildssciUNCONFIRMED[science-overlay] embassy-esim4-1.0.0-r7 fails to fetch embassy-esim4-1.0.0-r7.tar.gz2012-02-20 14:34:14
395907EbuildssciUNCONFIRMED[science-overlay] embassy-emnu-1.05-r7 fails to fetch embassy-emnu-1.05-r7.tar.gz2012-02-20 14:34:11
395967EbuildssciUNCONFIRMED[science-overlay] embassy-structure-0.1.0-r5 fails to fetch embassy-structure-0.1.0-r5.tar.gz2012-02-20 14:34:07
395969EbuildssciUNCONFIRMED[science-overlay] embassy-vienna-1.7.2-r2 fails to fetch embassy-vienna-1.7.2-r2.tar.gz2012-02-20 14:34:03
396383Ebuildsmaintainer-wantedUNCONFIRMED[sunrise] app-office/writerscafe (new ebuild)2012-01-11 18:13:18
396437JavasciUNCONFIRMED[science overlay] dev-java/hdf-java-2.7 fetch of hdf-java-2.7-src.tar fails2012-04-11 01:14:55
398601genkernelgenkernelUNCONFIRMED[patch] sys-kernel/genkernel few fixes to splash handling2012-01-12 17:17:06
400763Toolstools-portageUNCONFIRMEDglsa-check list only affected versions2012-01-25 15:50:55
400927Core systemwschlichUNCONFIRMEDsys-block/megarc-1.11-r1 needs fetch restriction2012-04-15 19:43:17
401185Ebuildsmaintainer-wantedUNCONFIRMEDdev-libs/protobuf-osm-1.2.1 - OSM Protocol Buffers2012-01-28 17:01:56
401943Applicationssci-biologyUNCONFIRMEDsci-biology/transfac-3.2 - tfextract segmentation fault in 0x00007f5df6cc4487 in ajStrDel (Pstr=0x72012-02-04 17:26:44
402749Otherrobbat2UNCONFIRMEDwillikins changelog feature broken2012-02-08 19:00:11
403051Applicationsmr_bones_UNCONFIRMEDmedia-gfx/gqview-2.1.5 - ld: pan-calendar.o: undefined reference to symbol 'sqrt@@GLIBC_2.0'2012-02-13 12:03:19
403123Unspecifiedshell-toolsUNCONFIRMEDapp-shells/gentoo-bashcomp - Add ebuild(1) --skip-manifest completion support2012-02-13 17:23:49
403279Core systembase-systemUNCONFIRMED=sys-apps/coreutils-8.15 fails FEATURES=test2012-02-18 16:37:27
403523Core systemfreedesktop-bugsUNCONFIRMEDsys-power/pm-utils-1.4.1-r2: power.d/xfs_buffer writes wrong/invalid value(s) in battery mode2012-02-14 18:47:19
403603ApplicationsrubyUNCONFIRMEDgames-util/rubygfe-0.3.4-r1 doesn't honor LINGUAS for locale files2012-02-23 21:38:44
404227ApplicationsgraphicsUNCONFIRMEDmedia-gfx/hugin-2011.4.0 - ../hugin_base/libhuginbase.so.0.0: undefined reference to `sgesvd_'2012-02-17 15:08:27
404345Applicationspolynomial-cUNCONFIRMEDapp-emulation/virtualbox-modules-4.1.4 - work/vboxpci/linux/VBoxPci-linux.c:989:9: Fehler: Zu wenige2012-02-18 16:57:37
405053Ebuildsx11UNCONFIRMEDx11-drivers/ati-drivers: EGL/OpenGL ES Features Broken.2012-02-20 18:05:48
405265Developmentrobbat2UNCONFIRMED"git svn clone/fetch/rebase" fail with dev-vcs/subversion[webdav-serf]2012-03-15 13:31:46
405565Core systemflameeyesUNCONFIRMEDapp-emulation/lxc - init script affects other init scripts2012-10-02 07:38:11
405765ApplicationsnetmonUNCONFIRMEDnet-analyzer/rrdtool-1.4.5-r2 - main.c:(.text+0x26c): undefined reference to `rrd_xport'2012-08-26 06:23:55
405807ApplicationssciUNCONFIRMEDsci-libs/blas-reference-20120215-r1 - eselect: Can't load module blas2012-02-27 15:25:26
405813Ebuildsmedia-videoUNCONFIRMEDmedia-libs/libvpx-1.0.0 USE=ssse3 - x86_systemdependent.c:(.text+0x263): undefined reference to `vp82013-01-15 22:37:22
406811Coredev-portageUNCONFIRMEDFeature request: enhance portage with "buildsrcpkg" that captures all source files for GPL complianc2012-03-04 07:20:32
407169Ebuildsfreedesktop-bugsUNCONFIRMEDsys-fs/udisks-1.0.4-r2 - file:///etc/xml/docbook:1: parser make[3]: *** [udisks.7] Fehler 4 parser e2012-10-03 07:06:31
407783Ebuildscorvus-gentooUNCONFIRMEDsys-fs/safecopy version bump to 1.72012-03-18 10:43:13
407841ApplicationsperlUNCONFIRMED=dev-lang/perl-5.14.2[build] is missing feature.pm, required by aclocal (during stage building)2012-05-27 02:40:44
408147UnspecifiedpythonUNCONFIRMEDapp-admin/eselect-python with FEATURES="nomac nodoc" - eselect python does not set man page (...)2012-03-14 19:23:10
409571Ebuildsmaintainer-wantedUNCONFIRMEDapp-vim/rainbow_paranthsis - assigns each pair of parentheses a different colour2012-03-24 17:42:11
414975ApplicationsmlUNCONFIRMEDnet-misc/unison-2.32.52 - hangs during file transfer2012-06-06 17:00:16
415305EbuildssoundUNCONFIRMEDmedia-sound/shoutcast-server-bin - update HOMEPAGE so that pkg_nofetch() is more helpful2012-10-28 04:33:12
415653ApplicationsfontsUNCONFIRMEDx11-misc/gbdfed - HOMEPAGE has been changed2012-05-13 16:29:09
416691KDEvoyageurUNCONFIRMEDkde-base/nepomuk-4.8.3 fails with undefined references (dragonegg problem)2012-09-28 13:05:52
417711ApplicationsgraphicsUNCONFIRMEDmedia-gfx/graphviz-2.26.3-r4 + distcc - iffe: x86_64-pc-linux-gnu-gcc : not a C compiler: should not2012-06-05 19:48:49
418161Hardenedx11UNCONFIRMEDmedia-libs/mesa-8.0.3 test causes buffer overflow2012-06-02 19:02:24
418403Ebuildsmaintainer-wantedUNCONFIRMEDapp-admin/puppet-dashboard - a web interface providing node classification and reporting features fo2012-10-09 03:21:48
419055GamesgamesUNCONFIRMEDgames-emulation:mednafen-0.9.21 does not compile2012-06-01 20:48:36
419921LibrarysciUNCONFIRMED[science overlay] sci-libs/framewave-1.3.1 - At global scope: domain/common/include/fe.h:1305:19: er2012-06-26 07:30:08
421741Developmentrobbat2UNCONFIRMEDdev-vcs/git-1.7.3.4-r1: test t7508-status.sh failed with FEATURES="sandbox -userpriv"2012-06-19 15:11:50
425106Core systembase-systemUNCONFIRMEDsys-libs/db-4.8.30 FEATURES="test" - tests are not run : You must have USE=tcl to run the sys-libs/d2012-07-10 14:09:54
425508Ebuildsmaintainer-wantedUNCONFIRMEDdev-games/caelum - atmospheric effects OGRE plugin2012-07-16 00:55:34
425682Enhancement/Feature Requestsdev-portageUNCONFIRMEDTrue parallel fetch for each job running2012-07-14 20:37:13
426450BugzillabugzillaUNCONFIRMEDUsing "File a new bug" on the bugzilla search result page leads to a different bug entry form than "2012-07-13 13:41:26
427302Applicationsx11UNCONFIRMEDmedia-fonts/font-alias-1.0.3 : Aliases referring to xyz-iso8859-1 when font packages install xyz-iso2012-07-24 13:58:10
427496ApplicationsalexxyUNCONFIRMEDnet-wireless/wimax-1.5.2-r1 with net-wireless/wpa_supplicant-1.0 USE=wimax - undefined reference to 2013-01-05 12:47:50
427616Prefix SupportprefixUNCONFIRMEDdev-lisp/sbcl-1.0.55-r1 fails to install on OS X (with FEATURES=test)2012-10-22 18:12:45
429372EbuildsnirbheekUNCONFIRMEDdev-python/pypy-1.9-r1 FEATURES=sandbox - Fatal error during initialization: out of memory2012-08-02 11:53:03
430316Ebuildsidl0rUNCONFIRMEDFeature request: Add a check for sane folder/file permission in net-dns/bind2012-08-07 16:19:51
431340PMS/EAPIpms-bugsUNCONFIRMED[Future EAPI] Allow bash-4.2 features2013-02-02 16:51:33
431684ApplicationsbenchmarksUNCONFIRMEDapp-benchmarks/bonnie++-1.96: manpage references ebuild-altered docpath2012-08-17 16:04:52
431978Coredev-portageUNCONFIRMEDsys-apps/portage: FEATURES=preserve-libs missed dependency (libmpc.so.2) in /usr/libexec/gcc/x86_64-2012-12-25 20:59:53
432292Ebuildsmaintainer-wantedUNCONFIRMEDmedia-gfx/iscan-plugin-(???) for Epson Perfection V2002013-02-19 10:47:20
434130ApplicationsmozillaUNCONFIRMEDdev-libs/nss-3.13.6 - /usr/lib/libnspr4.so: undefined reference to `__fdelt_chk'2012-09-24 16:48:11
434472ApplicationshannoUNCONFIRMEDnet-analyzer/openvas-scanner-3.2.4 - ld: CMakeFiles/openvassd.dir/preferences.c.o: undefined referen2013-01-01 12:37:32
434528ApplicationssoundUNCONFIRMEDmedia-sound/dagrab fails with buffer overflow detected when using cddb2012-09-10 11:44:45
434532OpenRCopenrcUNCONFIRMEDsys-apps/openrc - Unsafe Signal Handling?2012-09-18 21:01:49
435564Core systembase-systemUNCONFIRMEDsys-boot/grub-2.00: ignores 'GRUB_GFXMODE' and does not use framebuffer2012-11-03 22:59:15
435620ApplicationsspingUNCONFIRMEDapp-portage/fetchcommandwrapper-0.7.1 has path "/etc/make.conf" hardcoded2012-09-20 14:44:27
435656EbuildshannoUNCONFIRMEDnet-analyzer/greenbone-security-assistant-2.0.1 - ld: CMakeFiles/gsad.dir/gsad.c.o: undefined refere2012-09-24 10:44:47
435660Ebuildsmaintainer-wantedUNCONFIRMEDx11-themes/beefy-miracle-background - Fedora's official background artwork2012-09-20 15:36:51
435676Applicationssci-chemistryUNCONFIRMEDsci-chemistry/ghemical-2.99.2-r2 - /usr/lib64/libSCwfn.so: undefined reference to `sc::DenFunctional2012-09-21 16:11:33
435750ApplicationsxemacsUNCONFIRMEDapp-editors/xemacs-21.4.22-r2 crashes if syntax highlighting in current buffer is used2012-09-28 09:57:26
435848ApplicationsfloppymUNCONFIRMEDx11-misc/x11vnc-0.9.13 with net-libs/libvncserver-0.9.9 - buffer overflow detected in /usr/lib/libvn2013-01-20 19:18:24
436442Eclasses and Profileskernel-miscUNCONFIRMEDkernel-2.eclass - Offer a mean to install the kernel distribution under a tunable directory name2012-09-28 14:34:11
437186LibrarysoundUNCONFIRMEDmedia-libs/libclthreads has wrong DESCRIPTION and HOMEPAGE and should be moved to different category2012-10-04 17:21:28
437460Unspecifiedmaintainer-neededUNCONFIRMEDdev-libs/libaio-0.3.109-r3 USE=multilib - /usr/lib*/libaio.so: different ABIs have the same "OUTPUT_2013-01-27 02:19:44
437624Developmentdev-zeroUNCONFIRMED=dev-php/libvirt-php-0.4.6: too few arguments to function ‘set_error’2012-11-08 01:34:50
437704Applicationsmedia-videoUNCONFIRMEDmedia-video/gpac-0.4.5-r5: wxOsmo4.o: undefined reference to symbol 'gtk_widget_get_parent_window'2012-10-09 15:40:38
437722Core systemhardened-kernelUNCONFIRMEDsys-kernel/hardened-sources-3.4.5, 3.5.4-r1: BUG: unable to handle kernel NULL pointer dereference2013-01-22 13:36:29
438436ApplicationsgraphicsUNCONFIRMEDmedia-gfx/enblend-4.0 USE=doc - !pdfTeX error: pdfetex (file ./smooth-edge.pdf): reading image file 2012-10-15 11:31:41
438734Eclasses and Profileskernel-miscUNCONFIRMEDlinux-mod.eclass - KERNEL_DIR/KBUILD_OUTPUT version mismatch is not detected, KERNEL_DIR is not infe2012-10-18 07:40:38
438848ApplicationsqtUNCONFIRMEDsci-astronomy/stellarium crashes/hangs on start: QEglContext::swapBuffers(): "Bad surface (0x300D)"2012-10-26 20:08:07
439260ApplicationsmozillaUNCONFIRMEDwww-client/firefox(-bin)-(15|16).0.1 segfaults a lot in different situations2012-11-12 06:10:38
439676UnspecifiedvoyageurUNCONFIRMEDapp-i18n/ibus-qt-1.3.1 with clang 3.1 - qibusserializable.h:94:59: error: non-const lvalue reference2012-10-26 16:33:42
439754Ebuildsmaintainer-wantedUNCONFIRMEDsys-apps/inxi - A full featured system information script2012-11-19 17:19:20
439920Core systemperlUNCONFIRMEDdev-lang/perl-5.12.4-r1 - pp.o: In function `Perl_pp_pow': pp.c:(.text+0x3a8a): undefined reference 2012-10-28 16:20:23
440212ServergrobianUNCONFIRMEDmail-mta/exim - R=localuser T=local_delivery defer (27): File too large: error while writing to /var2012-10-30 16:23:42
441970Core systembase-systemUNCONFIRMEDnet-misc/dhcp: Fedora patches should be considered for inclusion2012-11-14 18:55:55
442610ServerhollowUNCONFIRMEDwww-servers/nginx - Feature support request for dav-ext-module.2012-11-26 20:05:19
443020ApplicationsbluenessUNCONFIRMEDnet-misc/tor-0.2.4.5_alpha USE=bufferevents [err] channel_closed(): Bug: src/or/channel.c:1315: chan2012-12-12 03:45:35
443604LibrarydotnetUNCONFIRMEDdev-dotnet/libgdiplus-2.10 - ../src/.libs/libgdiplus.so: error: undefined reference to 'atan' /// (m2012-11-19 10:30:17
443782HardenedhardenedUNCONFIRMEDapp-misc/cdrpager all versions buffer overflow2012-11-18 14:01:21
444532Applicationsrobbat2UNCONFIRMEDnet-misc/cfengine try to exec /sbin/ifconfig instead of /bin/ifconfig2013-02-08 06:53:29
444928Libraryx11UNCONFIRMEDmedia-libs/mesa-9.0.1 - ld: ../../auxiliary//libgallium.a(u_dl.o): undefined reference to symbol 'dl2012-11-27 16:36:13
445192Other documentsoverlaysUNCONFIRMEDDeprecated references to /etc/make.conf in the Gentoo overlays users' guide2012-12-01 07:27:56
445724Ebuildsmaintainer-wantedUNCONFIRMEDnet-p2p/armory - New package. - Full-featured Bitcoin client, offering a dozen innovative features..2012-12-04 14:45:46
445736Ebuildsmaintainer-wantedUNCONFIRMEDdev-libs/weston-1.0.2 - Wayland reference compositor2013-02-19 12:11:30
446028Ebuildsmaintainer-wantedUNCONFIRMEDdev-python/python-backports-1.0.1 - Backported python features2012-12-06 08:27:46
446326Core systemhardened-kernelUNCONFIRMED=sys-kernel/hardened-sources-3.6.8 - unable to handle kernel NULL pointer dereference - vsftpd copy_2013-01-22 13:36:00
447118Enhancement/Feature Requestsdev-portageUNCONFIRMEDFEATURES=clean-logs can be dangerous2012-12-13 14:54:27
447408DevelopmentvoyageurUNCONFIRMEDsys-devel/llvm-3.1r2 - X86ELFWriterInfo.cpp:85:1: interner Compiler-Fehler: Speicherzugriffsfehler2012-12-22 12:30:47
447474Core systembase-systemUNCONFIRMEDsys-devel/make-3.82-r4 - fails 1 test in features/parallelism2012-12-17 16:10:34
447904GamesgamesUNCONFIRMEDBuild games-rpg/pcgen from source with fewer bundled libraries2012-12-20 05:10:59
448130ApplicationsopenofficeUNCONFIRMEDapp-office/libreoffice-3.6.4.3 - /usr/lib64//libclucene-core.so: undefined reference to `std::__deta2012-12-27 07:54:58
448342GNOMEgnomeUNCONFIRMED[gnome-overlay] =app-admin/gnome-system-tools-3.0.0: undefined reference to `g_thread_init'2012-12-23 23:45:59
448416GamesgamesUNCONFIRMEDgames-strategy/dungeon-defenders - Humble Indie Bundle 7 game2013-01-04 00:06:56
449092LibraryqtUNCONFIRMED[qt overlay] x11-libs/qt-webkit-5.0.0 fails to build: undefined reference to `JSC::JSCell::classInfo2013-02-16 10:09:49
449266LibrarycppUNCONFIRMEDdev-libs/Ice-3.4.2-r1 - /usr/lib64/libIceGrid.so.34: undefined reference to `IceInternal::upCast(Ice2012-12-31 15:31:18
450116Ebuildsnet-mailUNCONFIRMEDnet-mail/fetchyahoo-2.14.9 bump request2013-01-05 16:03:52
450300Ebuildsmaintainer-wantedUNCONFIRMEDx11-misc/menulibre - An advanced menu editor that provides modern features in a clean, easy-to-use i2013-01-27 17:35:31
450772DevelopmentvoyageurUNCONFIRMEDsys-devel/llvm-9999 - subversion: can't fetch to /var/portage/distfiles/svn-src/llvm/trunk from http2013-01-09 19:43:43
451080Enhancement/Feature Requestsdev-portageUNCONFIRMEDsys-apps/portage emerge.log should record fetch time2013-01-10 17:15:32
451270Core systemclusterUNCONFIRMEDsys-infiniband/ofed-3.5 - /etc/infiniband/openib.conf: MLX4_LOAD=yes not obeyed by init script2013-01-11 16:26:21
451524Applicationssci-mathematicsUNCONFIRMEDsci-mathematics/octave-3.6.3 - libcruft/.libs/libcruft.so: undefined reference to `_gfortran_transfe2013-02-12 03:35:50
452178Core systemvapierUNCONFIRMEDapp-misc/pax-utils: w/python3: lddtree.py passes unicode buffers to pyelftools which expects byte bu2013-01-19 16:49:01
452604Eclasses and Profilesbase-systemUNCONFIRMEDCPU_FEATURES: move USE="mmx sse etc..." CPU features to USE expanded variable2013-01-25 05:38:49
453396ApplicationsswegenerUNCONFIRMEDnet-irc/irssi with sys-libs/ncurses[tinfo] - .../work/irssi-0.8.15/src/fe-text/terminfo-core.c:281: 2013-02-14 14:13:49
453562GNOMEgnomeUNCONFIRMEDx11-libs/gtk+-3.6.3-r2 USE="wayland" - ./.libs/libgdk-3.so: undefined reference to `wl_egl_pixmap_cr2013-01-24 09:23:22
453674Third-Party Toolstools-portageUNCONFIRMEDapp-portage/ufed: Shortening/cleaning flag descriptions by eliminating "[Enables/Adds/Includes] Supp2013-01-23 13:44:40
453894ApplicationsflameeyesUNCONFIRMEDnet-misc/lksctp-tools-1.0.12 - src/apps/sctp_darn.c:1870: undefined reference to `sctp_connectx'2013-01-26 01:40:32
454228HardenedbluenessUNCONFIRMEDsys-kernel/hardened-sources-3.2.37-r2 fails to build for ia64: mm/mmap.c:1689:4: error: too few argu2013-02-21 02:26:58
454366ServerwiredUNCONFIRMEDwww-servers/lighttpd - user/group hardcoded in init script, breaks when ran under different credenti2013-01-29 14:09:39
454460ApplicationsmozillaUNCONFIRMEDwww-client/firefox-18.0.1: undefined reference to `WebRtcAecm_WindowAndFFTNeon'2013-01-30 20:14:08
454492Toolstools-portageUNCONFIRMEDapp-portage/gentoolkit-0.3.0.7 - eclean-dist: UnboundLocalError: local variable 'cleaner' referenced2013-01-29 17:40:16
454604Third-Party ToolsdolsenUNCONFIRMEDapp-portage/layman feature requests2013-01-30 02:01:26
454914OpenRCopenrcUNCONFIRMEDsys-apps/openrc: Feature Request: Open logfile before chuid option2013-01-31 23:56:37
455234KDEkdeUNCONFIRMEDkmix: dbuscontrolwrapper.cpp:(.text+0x169): undefined reference to `vtable for DBusControlWrapper'2013-02-03 07:06:26
455282LibrarytitanofoldUNCONFIRMEDdev-libs/libpqxx-4.0.1 with python 3.x - TypeError: 'str' does not support the buffer interface2013-02-19 08:19:43
455348EbuildsvostorgaUNCONFIRMEDnet-news/liferea 1.10 rc1 version bump2013-02-05 11:25:38
455414Librarymaintainer-neededUNCONFIRMEDdev-libs/libmix-2.05-r6 with clang-3.2 - aes/saferp.c:22:8: error: redefinition of 'expf' as differe2013-02-05 12:13:40
455770ApplicationsmozillaUNCONFIRMEDmail-client/thunderbird - after changes to initial account setup, thunderbird can not fetch imap bec2013-02-06 03:48:42
455912OpenRCopenrcUNCONFIRMEDsys-apps/openrc-0.11.8 with sys-libs/ncurses[tinfo] - ../libeinfo/libeinfo.so: undefined reference t2013-02-14 14:13:57
456048ServerultrabugUNCONFIRMEDwww-servers/uwsgi-1.4.5 init script race condition if starting multiple uwsgi instances with differe2013-02-07 16:47:54
456172ApplicationstommyUNCONFIRMEDdev-vcs/subversion-(1.7.* ?) needs dev-db/sqlite:3 to be compiled with threadsafe2013-02-11 11:20:24
456328ApplicationschithanhUNCONFIRMEDwww-plugins/gnash-08.10-r2 with dev-libs/boost-1.52.0-r5 - ld: sdl_gnash-gnash.o: undefined referenc2013-02-12 14:38:36
456360KDEkdeUNCONFIRMEDkde-base/print-manager looking for org.fedoraproject.Config.Printing2013-02-14 21:31:30
456684ApplicationshwoarangUNCONFIRMEDmedia-gfx/shotwell-0.13.1-r2: opening preferences window causes segfault in gnome-shell-3.6.2-r1 + m2013-02-13 11:47:53
456770Libraryhd_brummyUNCONFIRMEDmedia-libs/FusionSound-1.1.1-r1 - core_sound.c:328:6: error: too few arguments to function 'fusion_o2013-02-11 14:57:06
457962Core systemhardenedUNCONFIRMEDsys-kernel/gentoo-source-3.6.11: lockd_init_net - kernel NULL pointer dereference2013-02-19 17:11:52


back



Support us on Content Nation

New Packages

- as rdf newsfeed
- as rss newsfeed
- as Atom newsfeed
2026-10-12
aioquic - 1.5.0
Ebuild name:

dev-python/aioquic-1.5.0

Description

An implementation of QUIC and HTTP/3

Added to portage

2026-10-12

beartype - 0.23.1
Ebuild name:

dev-python/beartype-0.23.1

Description

Unbearably fast runtime type checking in pure Python

Added to portage

2026-10-12

bitarray - 3.12.1
Ebuild name:

dev-python/bitarray-3.12.1

Description

Efficient arrays of booleans -- C extension

Added to portage

2026-10-12

bracex - 3.1
Ebuild name:

dev-python/bracex-3.1

Description

Bash style brace expansion for Python

Added to portage

2026-10-12

dist-kernel - 6.18.56
Ebuild name:

virtual/dist-kernel-6.18.56

Description

Virtual to depend on any Distribution Kernel

Added to portage

2026-10-12

dist-kernel - 7.2.10
Ebuild name:

virtual/dist-kernel-7.2.10

Description

Virtual to depend on any Distribution Kernel

Added to portage

2026-10-12

doxygen - 1.17.0-r1
Ebuild name:

app-text/doxygen-1.17.0-r1

Description

Documentation system for most programming languages

Added to portage

2026-10-12

doxygen - 1.18.0-r1
Ebuild name:

app-text/doxygen-1.18.0-r1

Description

Documentation system for most programming languages

Added to portage

2026-10-12

duckdb - 1.5.6
Ebuild name:

dev-db/duckdb-1.5.6

Description

high-performance analytical database system

Added to portage

2026-10-12

filelock - 4.1.1
Ebuild name:

dev-python/filelock-4.1.1

Description

A platform independent file lock for Python

Added to portage

2026-10-12

gcc - 14.4.1_p20261008
Ebuild name:

sys-devel/gcc-14.4.1_p20261008

Description

The GNU Compiler Collection

Added to portage

2026-10-12

gcc - 15.3.1_p20261009
Ebuild name:

sys-devel/gcc-15.3.1_p20261009

Description

The GNU Compiler Collection

Added to portage

2026-10-12

gcc - 16.2.1_p20261010
Ebuild name:

sys-devel/gcc-16.2.1_p20261010

Description

The GNU Compiler Collection

Added to portage

2026-10-12

gcc - 17.0.0_p20261011
Ebuild name:

sys-devel/gcc-17.0.0_p20261011

Description

The GNU Compiler Collection

Added to portage

2026-10-12

gentoo-kernel - 6.18.56
Ebuild name:

sys-kernel/gentoo-kernel-6.18.56

Description

Linux kernel built with Gentoo patches

Added to portage

2026-10-12

gentoo-kernel - 7.2.10
Ebuild name:

sys-kernel/gentoo-kernel-7.2.10

Description

Linux kernel built with Gentoo patches

Added to portage

2026-10-12

gentoo-kernel-bin - 6.18.56
Ebuild name:

sys-kernel/gentoo-kernel-bin-6.18.56

Description

Pre-built Linux kernel with Gentoo patches

Added to portage

2026-10-12

gentoo-kernel-bin - 7.2.10
Ebuild name:

sys-kernel/gentoo-kernel-bin-7.2.10

Description

Pre-built Linux kernel with Gentoo patches

Added to portage

2026-10-12

gentoo-kernel-modprep - 6.18.56
Ebuild name:

sys-kernel/gentoo-kernel-modprep-6.18.56

Description

Minimal subset of gentoo-kernel-bin for building modules,

Added to portage

2026-10-12

gentoo-kernel-modprep - 7.2.10
Ebuild name:

sys-kernel/gentoo-kernel-modprep-7.2.10

Description

Minimal subset of gentoo-kernel-bin for building modules, f

Added to portage

2026-10-12

hypothesis - 6.169.0
Ebuild name:

dev-python/hypothesis-6.169.0

Description

A library for property based testing

Added to portage

2026-10-12

jacksum - 4.0.2
Ebuild name:

app-crypt/jacksum-4.0.2

Description

Java utility for working with checksums, CRCs, and message digests (hashes)

Added to portage

2026-10-12

libxmp - 4.7.4
Ebuild name:

media-libs/libxmp-4.7.4

Description

Library that renders module files to PCM data

Added to portage

2026-10-12

lollypop - 1.4.48
Ebuild name:

media-sound/lollypop-1.4.48

Description

Modern music player for GNOME

Added to portage

2026-10-12

ls-qpack - 2.6.4
Ebuild name:

dev-libs/ls-qpack-2.6.4

Description

QPACK compression library for use with HTTP/3

Added to portage

2026-10-12

ls-qpack - 2.7.0
Ebuild name:

dev-libs/ls-qpack-2.7.0

Description

QPACK compression library for use with HTTP/3

Added to portage

2026-10-12

moto - 5.2.4
Ebuild name:

dev-python/moto-5.2.4

Description

Mock library for boto

Added to portage

2026-10-12

paraview - 6.2.0
Ebuild name:

sci-visualization/paraview-6.2.0

Description

Powerful scientific data visualization application

Added to portage

2026-10-12

patiencediff - 1.0.0
Ebuild name:

dev-python/patiencediff-1.0.0

Description

Python implementation of the patiencediff algorithm

Added to portage

2026-10-12

pikepdf - 10.17.0
Ebuild name:

dev-python/pikepdf-10.17.0

Description

Python library to work with pdf files based on qpdf

Added to portage

2026-10-12

platformdirs - 4.13.0
Ebuild name:

dev-python/platformdirs-4.13.0

Description

A small Python module for determining appropriate platform-specific

Added to portage

2026-10-12

pycryptodome - 3.24.1
Ebuild name:

dev-python/pycryptodome-3.24.1

Description

A self-contained cryptographic library for Python

Added to portage

2026-10-12

pydantic - 2.14.1
Ebuild name:

dev-python/pydantic-2.14.1

Description

Data parsing and validation using Python type hints

Added to portage

2026-10-12

pyglet - 2.1.19
Ebuild name:

dev-python/pyglet-2.1.19

Description

Cross-platform windowing and multimedia library for Python

Added to portage

2026-10-12

pylint - 4.1.3
Ebuild name:

dev-python/pylint-4.1.3

Description

Python code static checker

Added to portage

2026-10-12

pylsqpack - 1.0.0
Ebuild name:

dev-python/pylsqpack-1.0.0

Description

Python wrapper for the ls-qpack QPACK library

Added to portage

2026-10-12

pyrfc3339 - 2.1.1
Ebuild name:

dev-python/pyrfc3339-2.1.1

Description

Generates and parses RFC 3339 timestamps

Added to portage

2026-10-12

pyspelling - 2.13
Ebuild name:

dev-python/pyspelling-2.13

Description

Spell checker automation tool

Added to portage

2026-10-12

pytest-check - 3.0.0
Ebuild name:

dev-python/pytest-check-3.0.0

Description

pytest plugin that allows multiple failures per test

Added to portage

2026-10-12

python-utils - 4.1.1
Ebuild name:

dev-python/python-utils-4.1.1

Description

Collection of small Python functions & classes

Added to portage

2026-10-12

pyzstd - 0.20.0
Ebuild name:

dev-python/pyzstd-0.20.0

Description

Support for Zstandard (zstd) compression

Added to portage

2026-10-12

soupsieve - 3.0.2
Ebuild name:

dev-python/soupsieve-3.0.2

Description

A modern CSS selector implementation for BeautifulSoup

Added to portage

2026-10-12

source-highlight - 9999
Ebuild name:

dev-util/source-highlight-9999

Description

Generate highlighted source code as an (x)html document

Added to portage

2026-10-12

tmux - 3.8
Ebuild name:

app-misc/tmux-3.8

Description

Terminal multiplexer

Added to portage

2026-10-12

tox - 4.65.3
Ebuild name:

dev-python/tox-4.65.3

Description

virtualenv-based automation of test activities

Added to portage

2026-10-12

utidylib - 1.1.0
Ebuild name:

dev-python/utidylib-1.1.0

Description

TidyLib Python wrapper

Added to portage

2026-10-12

validators - 0.36.0
Ebuild name:

dev-python/validators-0.36.0

Description

Python Data Validation for Humans

Added to portage

2026-10-12

vanilla-kernel - 6.18.56
Ebuild name:

sys-kernel/vanilla-kernel-6.18.56

Description

Linux kernel built from vanilla upstream sources

Added to portage

2026-10-12

vanilla-kernel - 7.2.10
Ebuild name:

sys-kernel/vanilla-kernel-7.2.10

Description

Linux kernel built from vanilla upstream sources

Added to portage

2026-10-12

virtualenv - 21.14.7
Ebuild name:

dev-python/virtualenv-21.14.7

Description

Virtual Python Environment builder

Added to portage

2026-10-12

2026-10-11
AusweisApp - 2.6.0
Ebuild name:

sys-auth/AusweisApp-2.6.0

Description

Official authentication app for German ID cards and residence permits

Added to portage

2026-10-11

acme-sh - 3.1.6
Ebuild name:

app-crypt/acme-sh-3.1.6

Description

A pure Unix shell script implementing ACME client protocol

Added to portage

2026-10-11

aiohttp - 3.14.5
Ebuild name:

dev-python/aiohttp-3.14.5

Description

HTTP client/server for asyncio

Added to portage

2026-10-11

aioquic - 1.4.0
Ebuild name:

dev-python/aioquic-1.4.0

Description

An implementation of QUIC and HTTP/3

Added to portage

2026-10-11

arcconf - 5.12.00.28542
Ebuild name:

sys-block/arcconf-5.12.00.28542

Description

Microsemi Adaptec RAID Controller Command Line Utility

Added to portage

2026-10-11

backports-zstd - 1.8.0
Ebuild name:

dev-python/backports-zstd-1.8.0

Description

Backport of PEP-784 adding Zstandard to the standard library

Added to portage

2026-10-11

backrefs - 8.1
Ebuild name:

dev-python/backrefs-8.1

Description

Wrapper around re or regex that adds additional back references

Added to portage

2026-10-11

bash - 5.3_p20-r1
Ebuild name:

app-shells/bash-5.3_p20-r1

Description

The standard GNU Bourne again shell

Added to portage

2026-10-11

beartype - 0.23.0
Ebuild name:

dev-python/beartype-0.23.0

Description

Unbearably fast runtime type checking in pure Python

Added to portage

2026-10-11

bedrock-server - 1.26.52.3
Ebuild name:

games-server/bedrock-server-1.26.52.3

Description

The official bedrock (non-java) based server for the sandbox

Added to portage

2026-10-11

bitstring - 5.0.0
Ebuild name:

dev-python/bitstring-5.0.0

Description

A pure Python module for creation and analysis of binary data

Added to portage

2026-10-11

black - 26.10.1
Ebuild name:

dev-python/black-26.10.1

Description

The uncompromising Python code formatter

Added to portage

2026-10-11

cargo-c - 0.10.26
Ebuild name:

dev-util/cargo-c-0.10.26

Description

Helper program to build and install c-like libraries

Added to portage

2026-10-11

eduke32 - 20260807.10669
Ebuild name:

games-fps/eduke32-20260807.10669

Description

An open source engine port of the classic PC first person shooter

Added to portage

2026-10-11

entangle - 3.0-r5
Ebuild name:

media-gfx/entangle-3.0-r5

Description

Tethered Camera Control & Capture

Added to portage

2026-10-11

executing - 2.3.0
Ebuild name:

dev-python/executing-2.3.0

Description

Get information about what a Python frame is currently doing

Added to portage

2026-10-11

faudio - 26.10
Ebuild name:

app-emulation/faudio-26.10

Description

Accuracy-focused XAudio reimplementation for open platforms

Added to portage

2026-10-11

gentoo-sources - 6.18.56
Ebuild name:

sys-kernel/gentoo-sources-6.18.56

Description

Full sources including the Gentoo patchset for the . kernel tree

Added to portage

2026-10-11

gentoo-sources - 7.2.10
Ebuild name:

sys-kernel/gentoo-sources-7.2.10

Description

Full sources including the Gentoo patchset for the . kernel tree

Added to portage

2026-10-11

gentoolkit - 0.8.2
Ebuild name:

app-portage/gentoolkit-0.8.2

Description

Collection of administration scripts for Gentoo

Added to portage

2026-10-11

gnumeric - 1.12.62
Ebuild name:

app-office/gnumeric-1.12.62

Description

The GNOME Spreadsheet

Added to portage

2026-10-11

intel-compute-runtime - 26.35.39758.15
Ebuild name:

dev-libs/intel-compute-runtime-26.35.39758.15

Description

Intel Graphics Compute Runtime for oneAPI Level Zero

Added to portage

2026-10-11

intel-graphics-compiler - 2.42.3
Ebuild name:

dev-util/intel-graphics-compiler-2.42.3

Description

LLVM-based OpenCL compiler for OpenCL targetting Intel Gen

Added to portage

2026-10-11

intel-metrics-discovery - 1.16.197
Ebuild name:

dev-libs/intel-metrics-discovery-1.16.197

Description

A user mode library that provides access to GPU performan

Added to portage

2026-10-11

intel-metrics-library - 1.0.242
Ebuild name:

dev-libs/intel-metrics-library-1.0.242

Description

User mode driver helper library that provides access to GPU

Added to portage

2026-10-11

jsonpatch - 1.35
Ebuild name:

dev-python/jsonpatch-1.35

Description

Apply JSON-Patches like http

Added to portage

2026-10-11

jsonpointer - 3.2.1
Ebuild name:

dev-python/jsonpointer-3.2.1

Description

Identify specific nodes in a JSON document (according to draft 08)

Added to portage

2026-10-11

level-zero - 1.30.0-r1
Ebuild name:

dev-libs/level-zero-1.30.0-r1

Description

oneAPI Level Zero headers, loader and validation layer

Added to portage

2026-10-11

level-zero - 1.32.0-r1
Ebuild name:

dev-libs/level-zero-1.32.0-r1

Description

oneAPI Level Zero headers, loader and validation layer

Added to portage

2026-10-11

level-zero - 1.33.1-r1
Ebuild name:

dev-libs/level-zero-1.33.1-r1

Description

oneAPI Level Zero headers, loader and validation layer

Added to portage

2026-10-11

level-zero - 1.34.0
Ebuild name:

dev-libs/level-zero-1.34.0

Description

oneAPI Level Zero headers, loader and validation layer

Added to portage

2026-10-11

librsvg - 2.62.4
Ebuild name:

gnome-base/librsvg-2.62.4

Description

Scalable Vector Graphics (SVG) rendering library

Added to portage

2026-10-11

libsfml - 3.1.0-r1
Ebuild name:

media-libs/libsfml-3.1.0-r1

Description

Simple and Fast Multimedia Library (SFML)

Added to portage

2026-10-11

libupnp - 22.1.8
Ebuild name:

net-libs/libupnp-22.1.8

Description

An Portable Open Source UPnP Development Kit

Added to portage

2026-10-11

libzip - 1.12
Ebuild name:

dev-libs/libzip-1.12

Description

Library for manipulating zip archives

Added to portage

2026-10-11

luaposix - 37.0
Ebuild name:

dev-lua/luaposix-37.0

Description

Bindings for POSIX APIs

Added to portage

2026-10-11

minecraft-server - 26.3
Ebuild name:

games-server/minecraft-server-26.3

Description

The official server for the sandbox video game

Added to portage

2026-10-11

mumps - 5.5.1
Ebuild name:

sci-libs/mumps-5.5.1

Description

MUltifrontal Massively Parallel sparse direct matrix Solver

Added to portage

2026-10-11

mxml - 4.0.6
Ebuild name:

dev-libs/mxml-4.0.6

Description

A small XML parsing library that you can use to read XML data files or strings

Added to portage

2026-10-11

narwhals - 2.27.1
Ebuild name:

dev-python/narwhals-2.27.1

Description

Extremely lightweight compatibility layer between dataframe libraries

Added to portage

2026-10-11

netpbm - 11.16.1
Ebuild name:

media-libs/netpbm-11.16.1

Description

A set of utilities for converting to/from the netpbm (and related) format

Added to portage

2026-10-11

networkmanager-strongswan - 1.6.6
Ebuild name:

net-vpn/networkmanager-strongswan-1.6.6

Description

NetworkManager StrongSwan plugin

Added to portage

2026-10-11

nuitka - 4.3
Ebuild name:

dev-python/nuitka-4.3

Description

Python to native compiler

Added to portage

2026-10-11

numpy - 2.5.4
Ebuild name:

dev-python/numpy-2.5.4

Description

Fast array and numerical python library

Added to portage

2026-10-11

ollama - 0.40.3
Ebuild name:

sci-ml/ollama-0.40.3

Description

Get up and running with Llama 3, Mistral, Gemma, and other language models

Added to portage

2026-10-11

openrct2 - 0.5.6
Ebuild name:

games-simulation/openrct2-0.5.6

Description

An open source re-implementation of Chris Sawyer's RollerCoaster Ty

Added to portage

2026-10-11

opensmtpd - 7.9.0_p0
Ebuild name:

mail-mta/opensmtpd-7.9.0_p0

Description

Lightweight but featured SMTP daemon from OpenBSD

Added to portage

2026-10-11

orca - 50.3
Ebuild name:

app-accessibility/orca-50.3

Description

Extensible screen reader that provides access to the desktop

Added to portage

2026-10-11

parse - 1.22.3
Ebuild name:

dev-python/parse-1.22.3

Description

Parse strings using a specification based on the Python format() syntax

Added to portage

2026-10-11

portage - 3.0.83
Ebuild name:

sys-apps/portage-3.0.83

Description

The package management and distribution system for Gentoo

Added to portage

2026-10-11

procps - 4.0.5-r5
Ebuild name:

sys-process/procps-4.0.5-r5

Description

Standard informational utilities and process-handling tools

Added to portage

2026-10-11

pykka - 4.5.0
Ebuild name:

dev-python/pykka-4.5.0

Description

A Python implementation of the actor model

Added to portage

2026-10-11

pymdown-extensions - 12.2
Ebuild name:

dev-python/pymdown-extensions-12.2

Description

Extensions for Python Markdown

Added to portage

2026-10-11

pyproject-api - 1.11.5
Ebuild name:

dev-python/pyproject-api-1.11.5

Description

API to interact with the python pyproject.toml based projects

Added to portage

2026-10-11

pyspellchecker - 0.9.1
Ebuild name:

dev-python/pyspellchecker-0.9.1

Description

Pure python spell checker based on work by Peter Norvig

Added to portage

2026-10-11

pytest-env - 1.8.0
Ebuild name:

dev-python/pytest-env-1.8.0

Description

pytest plugin that allows you to add environment variables

Added to portage

2026-10-11

rrdtool - 1.11.0
Ebuild name:

net-analyzer/rrdtool-1.11.0

Description

A data logging and graphing system for time series data

Added to portage

2026-10-11

rrdtool-bindings - 1.11.0
Ebuild name:

dev-ruby/rrdtool-bindings-1.11.0

Description

Ruby bindings for rrdtool

Added to portage

2026-10-11

scalapack - 2.2.3-r2
Ebuild name:

sci-libs/scalapack-2.2.3-r2

Description

Subset of LAPACK routines redesigned for heterogenous (MPI) computing

Added to portage

2026-10-11

scummvm - 2026.4.0
Ebuild name:

games-engines/scummvm-2026.4.0

Description

Reimplementation of various game engines for adventures and role-pla

Added to portage

2026-10-11

soupsieve - 3.0.1
Ebuild name:

dev-python/soupsieve-3.0.1

Description

A modern CSS selector implementation for BeautifulSoup

Added to portage

2026-10-11

stress-ng - 0.22.01
Ebuild name:

app-benchmarks/stress-ng-0.22.01

Description

Stress test for a computer system with various selectable ways

Added to portage

2026-10-11

telegram-desktop - 7.1.2-r1
Ebuild name:

net-im/telegram-desktop-7.1.2-r1

Description

Official desktop client for Telegram

Added to portage

2026-10-11

telegram-desktop-bin - 7.3.1
Ebuild name:

net-im/telegram-desktop-bin-7.3.1

Description

Official desktop client for Telegram (binary package)

Added to portage

2026-10-11

thunar - 4.21.7
Ebuild name:

xfce-base/thunar-4.21.7

Description

File manager for the Xfce desktop environment

Added to portage

2026-10-11

tox - 4.65.2
Ebuild name:

dev-python/tox-4.65.2

Description

virtualenv-based automation of test activities

Added to portage

2026-10-11

tuba - 0.11.1-r1
Ebuild name:

net-misc/tuba-0.11.1-r1

Description

Browse the Fediverse (GTK client)

Added to portage

2026-10-11

txredisapi - 1.6.0
Ebuild name:

dev-python/txredisapi-1.6.0

Description

Non-blocking redis client for python

Added to portage

2026-10-11

unifi - 10.6.106
Ebuild name:

net-wireless/unifi-10.6.106

Description

A Management Controller for Ubiquiti Networks UniFi APs

Added to portage

2026-10-11

unionfs-fuse - 3.8
Ebuild name:

sys-fs/unionfs-fuse-3.8

Description

Self-syncing tree-merging file system based on FUSE

Added to portage

2026-10-11

vanilla-sources - 6.18.56
Ebuild name:

sys-kernel/vanilla-sources-6.18.56

Description

Full sources for the Linux kernel

Added to portage

2026-10-11

vanilla-sources - 7.2.10
Ebuild name:

sys-kernel/vanilla-sources-7.2.10

Description

Full sources for the Linux kernel

Added to portage

2026-10-11

wcmatch - 11.1
Ebuild name:

dev-python/wcmatch-11.1

Description

Wildcard/glob file name matcher

Added to portage

2026-10-11

xfdesktop - 4.21.1
Ebuild name:

xfce-base/xfdesktop-4.21.1

Description

Desktop manager for the Xfce desktop environment

Added to portage

2026-10-11

zookeeper-bin - 3.8.7
Ebuild name:

sys-cluster/zookeeper-bin-3.8.7

Description

A high-performance coordination service for distributed application

Added to portage

2026-10-11

zookeeper-bin - 3.9.6
Ebuild name:

sys-cluster/zookeeper-bin-3.9.6

Description

A high-performance coordination service for distributed application

Added to portage

2026-10-11

rdf newsfeed | rss newsfeed | Atom newsfeed
Copyright 2004-2025 Sascha Nitsch Unternehmensberatung GmbH
- Copyright and legal notices -
Time to create this page: 28.7 ms