from small one page howto to huge articles all in one place
 

search text in:




Other .linuxhowtos.org sites: www.linuxhowtos.org
toolsntoys.linuxhowtos.org



Last additions:
How to make X listen on port 6000

How to make X listen on port 6000

words:

34

views:

68033

userrating:

average rating: 1.2 (8 votes) (1=very good 6=terrible)


May, 25th 2007:
April, 26th 2007:
Apr, 10th. 2007:
Druckversion . pdf icon
You are here: Portage


Details of dev-perl/PAR:

Description: Perl Archive Toolkit

available versions:

releasesalphaamd64armhppaia64mipsppcppc64ppc macoss390shsparcx86USE-Flagsdependenciesebuild warnings
PAR-1.20.0 -+----+-----+none
show
show
PAR-1.19.0 -+----+-----+none
show
show
Legend:
+ stable
~ testing
- not available
some ebuild warning depend on specific use-flags or architectures, all ebuild-warnings are shown.

Known bugs:
bug IDcomponentassigned tostatusdescriptionlast change
368731ApplicationsgnomeUNCONFIRMEDx11-libs/gdk-pixbuf-2.22.1: parallel install fails sometimes2012-01-30 10:16:01
368847Ebuildsmaintainer-wantedUNCONFIRMEDnet-proxy/andiparos ebuild request2011-05-27 08:47:21
373845Librarymaintainer-wantedUNCONFIRMEDdev-perl/PAR-Packer: new package2011-07-03 16:26:29
374149DevelopmentperlUNCONFIRMEDMoose-2.1.0 conflicts with all existent versions of File-ChangeNotify, MooseX-Params-Validate, and M2011-07-10 03:47:03
378645DevelopmentperlUNCONFIRMEDdev-perl/math-pari ignores profile, and fails when compiling on2011-08-20 17:10:38
381279Servernet-imUNCONFIRMEDnet-im/jabberd2-2.2.4: error: XML parse error (not well-formed (invalid token)) in c2s log for some 2012-10-20 06:45:03
382631Ebuildsmaintainer-wantedUNCONFIRMEDNew ebuild: dev-perl/HTML-StripScripts-Parser2011-09-13 20:33:24
383699ApplicationslackUNCONFIRMEDx11-plugins/screenlets-0.1.2 some parts depend on gconf-python2011-09-20 04:04:24
384137EbuildsperlUNCONFIRMEDdev-perl/Inline-0.480.0: fails tests with parallel make2011-09-27 16:26:48
384309Keywording and StabilizationperlUNCONFIRMEDadd ~sparc keyword for dev-perl/Crypt-PasswdMD52011-09-27 22:38:41
386019ApplicationsgraphicsUNCONFIRMEDmedia-gfx/openclipart-2.3 version bump2012-06-19 16:44:15
390665FreeBSDbsdUNCONFIRMEDdev-libs/openssl-1.0.0 fails to compile on sparc-fbsd2012-03-19 06:50:59
393057FreeBSDbsdUNCONFIRMEDsys-freebsd/freebsd-lib-9.0 fails to compile on sparc-fbsd2011-12-03 18:20:02
393391KDEvoyageurUNCONFIRMED[kde overlay] kde-base/katepart-9999 fails to compile with sys-devel/dragonegg-3.02012-09-28 13:05:52
394831FreeBSDbsdUNCONFIRMEDfreebsd9.0 profile for sparc2011-12-16 10:14:43
395801Applicationsmedia-videoUNCONFIRMEDmedia-video/libav-0.8_pre20111222 produces white noise with part of some music files2012-03-08 07:44:03
396179ApplicationspatrickUNCONFIRMEDdev-lang/nqp-2011.10 - /usr/bin/parrot: symbol lookup error: dynext/nqp_group.so: undefined symbol: 2011-12-27 21:15:43
396353Prefix SupportnetmonUNCONFIRMEDnet-analyzer/nmap fails with LDFLAGS="-Wl,--as-needed" on sparc64-solaris2013-01-15 17:08:42
398961Ebuildsnet-imUNCONFIRMEDnet-im/pidgin-2.10.1: please separate dbus-python dependency into a USE-flag2013-01-01 23:11:04
400721Installation Handbookdocs-teamUNCONFIRMEDPart about bonding should be reworked2012-09-05 11:11:12
402245Core systembase-systemUNCONFIRMEDsys-fs/dosfstools-3.0.12 dosfslabel does not work if long file names are used in partition2013-01-23 19:12:35
403119Core systembase-systemUNCONFIRMEDReplace sys-apps/microcode-data with a separate sys-kernel/intel-ucode2013-01-01 21:57:37
403249Core systembase-systemUNCONFIRMEDsys-apps/coreutils-8.14: Fails test-parse-datetime (exit: 134)2012-03-29 07:20:53
403283GNOMEgnomeUNCONFIRMEDgnome-base/gdm-3.2.1.1-r2 partially loads2013-01-22 22:52:56
405855Keywording and StabilizationjerUNCONFIRMEDx11-terms/rxvt-unicode-9.15 USE=-xft disables background transparency?2012-06-02 15:58:37
406583ApplicationschithanhUNCONFIRMEDwww-plugins/lightspark-0.5.4.1-r1 build fails - error regarding some ffmpeg stuff (?)2012-03-03 01:49:39
406895Ebuildsmaintainer-wantedUNCONFIRMEDmedia-gfx/psdparse-9999 - tools to parse Photoshop PSD/PSB format files2012-03-06 14:26:15
406937Ebuildsmaintainer-wantedUNCONFIRMEDdev-libs/rapidxml-1.13 - an attempt to create the fastest XML parser possible2012-03-05 20:41:21
407169Ebuildsfreedesktop-bugsUNCONFIRMEDsys-fs/udisks-1.0.4-r2 - file:///etc/xml/docbook:1: parser make[3]: *** [udisks.7] Fehler 4 parser e2012-10-03 07:06:31
408139Core systembase-systemUNCONFIRMEDsys-fs/mdadm-3.2.1 sends ioctl 1261 (BLKFLSBUF) to partition when displaying array details2012-11-11 22:39:56
409181Applicationsrobbat2UNCONFIRMEDapp-misc/g15stats - script does not parse extra options2013-01-31 19:03:48
409571Ebuildsmaintainer-wantedUNCONFIRMEDapp-vim/rainbow_paranthsis - assigns each pair of parentheses a different colour2012-03-24 17:42:11
410037Core systemmaintainer-neededUNCONFIRMEDsys-power/cpufreqd config parser prevents usage of multi-cpu profile support2012-11-18 12:15:58
410065ServererasUNCONFIRMEDnet-mail/dovecot-2.1.3 fails at parallel make: fatal error: ../../../src/plugins/quota/rquota.h: No 2012-07-12 15:51:16
410339Ebuildsmaintainer-wantedUNCONFIRMEDnew ebuild: net-libs/http-parser2012-12-20 09:45:17
411099GamesgamesUNCONFIRMEDgames-simulation/tpt_merbo-1.0 - A mod of The Powder Toy, a particle simulator2012-04-07 15:00:08
411471ServerpatrickUNCONFIRMEDapp-admin/apache-tools-2.2.22 fails on '--param keyword=value' in CFLAGS2013-02-16 13:33:09
411515Ebuildsmaintainer-wantedUNCONFIRMEDdev-util/peg - tools for generating recursive-descent parsers.2012-06-30 09:24:16
411815OpenRCopenrcUNCONFIRMEDsys-apps/openrc-0.9.8.4 does not install ethtool_ring and txqueuelen params for network cards in bon2012-05-05 17:48:36
412217LibrarysoundUNCONFIRMEDdev-libs/redland-1.0.15 has malformed Makefile, won't emerge: "missing separator"2012-04-16 17:47:14
413467Applicationspolynomial-cUNCONFIRMEDapp-emulation/virtualbox-4.1.12: parallel build sometimes fails2013-01-07 06:25:45
415367ApplicationsopenofficeUNCONFIRMEDapp-office/libreoffice selecting part of a file name does not work when using "LibreOffice file dial2012-05-10 13:37:24
415829Ebuildsmaintainer-wantedUNCONFIRMEDsci-chemistry/cclib-1.0.1 - Library for parsing and interpreting the results of computational chemis2012-05-15 15:01:01
416903ApplicationslivecdUNCONFIRMEDsys-block/parted-3.1 fails tests [t8001-loop-blkpg.sh t2100-zerolen.sh]2012-05-21 14:59:50
417365OpenRCopenrcUNCONFIRMEDsys-apps/openrc: parameter "-1" passed to dhclient, causing dhclient not to retry when failing2012-12-07 11:49:41
418007DevelopmentmaksbotanUNCONFIRMEDdev-python/scrapy-0.14.4 fails in setup while parsing urlparse_monkeypatches.py2012-06-14 16:40:49
418195Ebuildsmaintainer-wantedUNCONFIRMEDsci-misc/hets - the Heterogeneous Tool Set, a parsing, static analysis and proof management tool2012-05-30 12:49:44
418211Ebuildsmaintainer-wantedUNCONFIRMEDsys-process/xjobs - reads job descriptions line by line and executes them in parallel2012-06-01 14:23:50
418285Ebuildsmaintainer-wantedUNCONFIRMEDmedia-libs/dcmtk - DCMTK - a collection of libraries and applications implementing large parts the D2012-05-30 18:44:00
419685ServererasUNCONFIRMED=net-proxy/squid-3.1.19: eautoreconf in src_prepare() fails in libltdl/2013-01-08 02:24:49
419963DevelopmentperlUNCONFIRMEDdev-lang/perl-5.16.0 should PDEPEND virtual/perl-ExtUtils-ParseXS2012-06-07 02:24:27
421677JavajavaUNCONFIRMEDdev-java/ant-commons-net-1.8.4 - *** Semantic Error: The abstract method "int compareTo(java.lang.Ob2012-06-19 02:39:45
423399EbuildssciUNCONFIRMEDsci-libs/parmetis-3.2.0: fails tests2012-09-25 10:57:08
424445GamesgamesUNCONFIRMEDufo-ai-2.4 fails with Com_EParseValue: Illegal color statement '1 .874 .294 1'2012-08-02 20:55:27
425682Enhancement/Feature Requestsdev-portageUNCONFIRMEDTrue parallel fetch for each job running2012-07-14 20:37:13
426338genkernelgenkernelUNCONFIRMEDgenkernel 3.4.24_p2: missing separator between old and new kernel version2012-12-03 20:03:30
426358Core systembase-systemUNCONFIRMEDsys-block/partimage server crashes with pthread error when client attempts to download image2012-07-18 00:00:36
426444ApplicationsemacsUNCONFIRMEDapp-editors/emacs-23.4-r3 fails to build in parallel (--jobs=64)2012-07-18 15:26:44
427768ApplicationsgstreamerUNCONFIRMEDmedia-plugins/gst-plugins-ffmpeg-0.10.13-r2 - gstffmpegutils.c:42:40: error: parameter 1 ('smp_fmt')2012-07-24 15:31:30
428138ApplicationsjdhoreUNCONFIRMEDwww-client/seamonkey-bin-2.10.1: png icon has no transparency2012-07-26 17:38:00
429646GamesreavertmUNCONFIRMEDdev-games/openscenegraph-3.0.1 with sys-devel/clang-3.1 - error: cannot initialize a parameter of ty2012-08-04 00:29:11
429674Libraryamd64UNCONFIRMEDapp-emulation/emul-linux-x86-medialibs: move media-libs/faac to a separate package due to license "i2012-11-02 18:16:56
430102Unclassifieddev-portageUNCONFIRMEDEmerging in a deleted directory outputs lots of "getcwd: cannot access parent directories: No such f2012-08-21 00:22:33
430190Coredev-portageUNCONFIRMEDSlot conflict because of "no parents that aren't satisfied by other packages in this slot"2012-08-07 14:41:13
430938KDEkdeUNCONFIRMEDkde-base/plasma-workspace-4.8.5 fails with parallel build: fatal error: ui_killrunner_config.h: No s2012-10-24 16:55:05
431912InstallCDreleaseUNCONFIRMEDinstall-x86-minimal-20120710.iso - boot hangs while looking for cdrom when encounters swap partition2013-02-21 02:38:59
433003LibrarypythonUNCONFIRMEDdev-libs/libxml2 - File "/usr/lib/python2.7/xml/sax/__init__.py", line 93, in make_parser raise 2012-09-09 04:48:34
433070KDEkdeUNCONFIRMEDapp-editors/kile-2.1.2-r1 - index.docbook:124: parser error : Entity 'ged.vertaald' not defined2013-02-17 22:53:14
435690Applicationsmysql-bugsUNCONFIRMEDdev-db/mysql-5.1.62-r1 - Makefile:186: *** missing separator. Stop.2013-02-04 23:51:03
436448Applicationsdesktop-miscUNCONFIRMEDx11-misc/parcellite-1.0.2_rc5 generates too many interrupts (as seen in powertop)2012-10-08 19:44:07
436596Applicationsandrej.filipcicUNCONFIRMEDnet-fs/openafs-1.6.1-r1: parallel build failure - In file included from db_dump.c:31:0: database.h:12012-09-29 15:38:55
437446ApplicationsgraphicsUNCONFIRMEDmedia-gfx/nip2-7.26.4 - parser.h:57:12: error: conflicting types for ‘yyleng’ lex.c:275:11: note: pr2013-02-16 13:23:10
437494Core - Interface (emerge)dev-portageUNCONFIRMEDProvide a parameter for emerge so that 'emerge -pv' can display package description along with other2012-10-08 19:09:40
437704Applicationsmedia-videoUNCONFIRMEDmedia-video/gpac-0.4.5-r5: wxOsmo4.o: undefined reference to symbol 'gtk_widget_get_parent_window'2012-10-09 15:40:38
441862ApplicationsalexxyUNCONFIRMEDsys-apps/gptfdisk-0.8.5 - In function `GPTPart::GetDescription()': gptpart.cc:(.text+0x179): undefin2013-02-12 11:55:19
442222Ebuildsmaintainer-wantedUNCONFIRMEDdev-libs/thrust - a parallel algorithms library which resembles the C++ Standard Template Library2012-11-07 17:53:54
442320InstallCDreleaseUNCONFIRMEDinstall-cd (sparc) - errors at boot2012-12-16 05:42:05
442662Ebuildsmysql-bugsUNCONFIRMEDdev-db/mysql-connector-c++ - Output from mysql_config is parsed in in ugly way.2012-11-19 15:55:25
446142EbuildsmattschUNCONFIRMEDnet-misc/openconnect-4.07 - after 30 minutes the VPN reconnects but only has a partially working con2013-01-09 13:33:21
446198Ebuildsmaintainer-wantedUNCONFIRMEDdev-python/python-xcaplib-1.0.17 - Client for managing full or partial XML documents on XCAP servers2012-12-06 21:23:53
446204Core systemvapierUNCONFIRMEDsys-devel/crossdev: cross-emerge: support multiple parallel SYSROOTs for a single target2012-12-06 22:15:24
447006Enhancement/Feature Requestsportage-utilsUNCONFIRMEDapp-portage/portage-utils' "qgrep" should parse multiple args over entire file for broader search re2012-12-12 17:20:02
447044Ebuildsmaintainer-wantedUNCONFIRMEDdev-perl/Parse-DebianChangelog - Parse Debian changelogs and output them in other formats2012-12-26 21:51:22
447064ApplicationssgmlUNCONFIRMEDapp-text/build-docbook-catalog - file:///etc/xml/docbook:1: parser error : Document is empty2012-12-13 16:31:25
447474Core systembase-systemUNCONFIRMEDsys-devel/make-3.82-r4 - fails 1 test in features/parallelism2012-12-17 16:10:34
447502LibrarysciUNCONFIRMEDdev-python/numpy-1.6.2 - FAIL: test_pareto (test_random.TestRandomDist)2013-01-05 08:15:18
447882Keywording and Stabilizationweb-appsUNCONFIRMEDKeyword request: Please add the sparc keyword to www-apps/gallery2012-12-20 14:52:24
448334Core systembase-systemUNCONFIRMEDsys-apps/hdparm: add support for disk id in /etc/init.d/hdparm2013-01-09 18:41:41
448470Core systemrobbat2UNCONFIRMEDsys-process/audit-2.2.2 incorrectly suggests removal of /lib/libauparse.so.02013-02-03 19:08:30
449652Ebuildsmaintainer-wantedUNCONFIRMEDmedia-video/enzyme-0.2.ebuild - Video metadata parser2013-01-22 02:24:26
451054LibrarycjkUNCONFIRMEDdev-libs/oniguruma-5.9.2-r1 - autotools-utils_src_prepare: Cannot find the latest automake! Tried 1.2013-01-09 14:27:12
451316ApplicationscedkUNCONFIRMEDnet-firewall/conntrack-tools-0.9.14 - parse.c:230:34: error: ‘NULL’ undeclared (first use in this fu2013-01-11 16:17:24
451532GNOMEgnomeUNCONFIRMEDnet-libs/webkit-gtk-1.10.2 - ALT parameter is not shown instead of the image2013-01-13 09:53:12
452172Unclassifieddev-portageUNCONFIRMEDemerge's --jobs does not do full parallelization due to PDEPEND circular dependencies2013-01-15 11:55:26
453002LibrarypatrickUNCONFIRMEDsci-libs/openfoam-2.1.1 - Patches to make paraFoam work with Paraview 3.98.02013-02-18 18:55:08
453122ApplicationsperlUNCONFIRMEDPlease stabilize =app-text/po4a-0.42 (was: 0.38 misparses CDATA section)2013-02-19 20:59:42
453804JavajavaUNCONFIRMEDCreate ebuilds for jdk 8 (early access release), a current Java 8 partial implementation2013-01-24 12:02:05
453842GNOMEgnomeUNCONFIRMED[PATCH] gnome-base/gnome-shell-3.6.2-r1: Fix partialy memory leaks issues2013-02-12 09:35:27
454746Core systemrobbat2UNCONFIRMEDsys-fs/lvm2-2.02.97-r1, sys-fs/udev-197-r4: /dev/mapper entries absent for dm-crypt partitions mount2013-02-04 01:37:50
455104DevelopmentpythonUNCONFIRMEDdev-python/nose-1.2.1_p2012 fails tests (fails to parse coverage output)2013-02-06 10:00:25
455210DevelopmentpythonUNCONFIRMEDdev-lang/python-3.2.3 fails to build native Parser/pgen while crosscompiling2013-02-04 19:42:53
455816Librarynet-p2pUNCONFIRMEDnet-libs/gupnp-igd - src_prepare(): libgupnp-igd/Makefile.am:64: HAVE_INTROSPECTION does not appear 2013-02-06 13:54:26
455890Core systemlivecdUNCONFIRMEDsys-block/parted - parted binary should be installed in /usr/bin2013-02-07 02:12:12
456308Core systembase-systemUNCONFIRMEDgrub2 won't launch memtest86 and memtest86+ if / and /boot are separated partitions and grub2 graphi2013-02-13 22:19:39
456796Keywording and Stabilizationnet-imUNCONFIRMEDnet-im/pyicq-t: sparc keyword request2013-02-11 17:00:43
456798ApplicationsmozillaUNCONFIRMEDwww-client/firefox and mail-client/thunderbird 17.0.2 - parallel build issues2013-02-12 22:15:37
456938DevelopmentperlUNCONFIRMEDdev-perl/XML-SAX-0.990.0, dev-perl/XML-SAX-Base-1.80.0: Fail to remove vendor_perl/.../ParserDetails2013-02-13 19:14:50
457104KernelsecurityUNCONFIRMEDDriver of cypress corrupts file-system and partition table of external hard drives with M6116 SATA B2013-02-14 15:53:16
457546Ebuildsmaintainer-wantedUNCONFIRMEDNew ebuild: dev-db/torndb-0.1 - A lightweight wrapper around MySQLdb. Originally part of the Tornado2013-02-14 15:34:22
458074OpenRCopenrcUNCONFIRMEDsys-apps/openrc-0.11.8 doesn't parse correctly options contained two words abreast self2013-02-18 13:35:38


back



Support us on Content Nation

New Packages

- as rdf newsfeed
- as rss newsfeed
- as Atom newsfeed
2024-07-14
argh - 0.31.3
Ebuild name:

dev-python/argh-0.31.3

Description

A simple argparse wrapper

Added to portage

2024-07-14

colored-traceback - 0.4.2
Ebuild name:

dev-python/colored-traceback-0.4.2

Description

Automatically color Python's uncaught exception tracebacks

Added to portage

2024-07-14

dracut - 103
Ebuild name:

sys-kernel/dracut-103

Description

Generic initramfs generation tool

Added to portage

2024-07-14

gcc - 14.1.1_p20240713
Ebuild name:

sys-devel/gcc-14.1.1_p20240713

Description

The GNU Compiler Collection

Added to portage

2024-07-14

hypothesis - 6.108.0
Ebuild name:

dev-python/hypothesis-6.108.0

Description

A library for property based testing

Added to portage

2024-07-14

immer - 0.8.1
Ebuild name:

dev-libs/immer-0.8.1

Description

Library of persistent and immutable data structures written in C++

Added to portage

2024-07-14

init-system-helpers - 1.66
Ebuild name:

sys-apps/init-system-helpers-1.66

Description

Helper scripts useful for both OpenRC and systemd

Added to portage

2024-07-14

krita - 5.2.3
Ebuild name:

media-gfx/krita-5.2.3

Description

Free digital painting application. Digital Painting, Creative Freedom

Added to portage

2024-07-14

lager - 0.1.1
Ebuild name:

dev-libs/lager-0.1.1

Description

Library to assist value-oriented design

Added to portage

2024-07-14

marknote - 1.3.0
Ebuild name:

app-text/marknote-1.3.0

Description

Markdown editor with a wide range of formating options for everyday notes

Added to portage

2024-07-14

pip-run - 12.7.0
Ebuild name:

dev-python/pip-run-12.7.0

Description

Install packages and run Python with them

Added to portage

2024-07-14

portalocker - 2.10.1
Ebuild name:

dev-python/portalocker-2.10.1

Description

A library for Python file locking

Added to portage

2024-07-14

rack-protection - 4.0.0
Ebuild name:

dev-ruby/rack-protection-4.0.0

Description

This gem protects against typical web attacks

Added to portage

2024-07-14

rspamd - 3.9.0
Ebuild name:

mail-filter/rspamd-3.9.0

Description

Rapid spam filtering system

Added to portage

2024-07-14

sinatra - 4.0.0
Ebuild name:

dev-ruby/sinatra-4.0.0

Description

A DSL for quickly creating web applications in Ruby with minimal effort

Added to portage

2024-07-14

sus - 0.28.0
Ebuild name:

dev-ruby/sus-0.28.0

Description

A fast and scalable test runner

Added to portage

2024-07-14

webmock - 3.23.1
Ebuild name:

dev-ruby/webmock-3.23.1

Description

Allows stubbing HTTP requests and setting expectations on HTTP requests

Added to portage

2024-07-14

xsimd - 13.0.0
Ebuild name:

dev-cpp/xsimd-13.0.0

Description

C++ wrappers for SIMD intrinsics

Added to portage

2024-07-14

zstandard - 0.22.0-r1
Ebuild name:

dev-python/zstandard-0.22.0-r1

Description

Zstandard Bindings for Python

Added to portage

2024-07-14

zug - 0.1.1
Ebuild name:

dev-libs/zug-0.1.1

Description

Transducers for C++

Added to portage

2024-07-14

2024-07-13
PyQt-builder - 1.16.4
Ebuild name:

dev-python/PyQt-builder-1.16.4

Description

The PEP 517 compliant PyQt build system

Added to portage

2024-07-13

abseil-cpp - 20230125.3-r4
Ebuild name:

dev-cpp/abseil-cpp-20230125.3-r4

Description

Abseil Common Libraries (C++), LTS Branch

Added to portage

2024-07-13

abseil-cpp - 20230802.0-r3
Ebuild name:

dev-cpp/abseil-cpp-20230802.0-r3

Description

Abseil Common Libraries (C++), LTS Branch

Added to portage

2024-07-13

abseil-cpp - 20240116.2-r3
Ebuild name:

dev-cpp/abseil-cpp-20240116.2-r3

Description

Abseil Common Libraries (C++), LTS Branch

Added to portage

2024-07-13

alcotest - 1.7.0-r1
Ebuild name:

dev-ml/alcotest-1.7.0-r1

Description

A lightweight and colourful test framework

Added to portage

2024-07-13

amule - 2.3.3-r4
Ebuild name:

net-p2p/amule-2.3.3-r4

Description

aMule, the all-platform eMule p2p client

Added to portage

2024-07-13

ark - 24.05.2-r1
Ebuild name:

kde-apps/ark-24.05.2-r1

Description

File archiver by KDE

Added to portage

2024-07-13

aspell-af - 0.50.0-r1
Ebuild name:

app-dicts/aspell-af-0.50.0-r1

Description

Aspell () language dictionary

Added to portage

2024-07-13

aspell-am - 0.03.1-r1
Ebuild name:

app-dicts/aspell-am-0.03.1-r1

Description

Aspell () language dictionary

Added to portage

2024-07-13

awscli - 1.33.26
Ebuild name:

app-admin/awscli-1.33.26

Description

Universal Command Line Environment for AWS

Added to portage

2024-07-13

base - 0.17.1
Ebuild name:

dev-ml/base-0.17.1

Description

Standard library for OCaml

Added to portage

2024-07-13

boto3 - 1.34.144
Ebuild name:

dev-python/boto3-1.34.144

Description

The AWS SDK for Python

Added to portage

2024-07-13

botocore - 1.34.144
Ebuild name:

dev-python/botocore-1.34.144

Description

Low-level, data-driven core of boto 3

Added to portage

2024-07-13

cfn-lint - 1.6.1
Ebuild name:

dev-python/cfn-lint-1.6.1

Description

CloudFormation Linter

Added to portage

2024-07-13

clang - 19.0.0_pre20240712
Ebuild name:

sys-devel/clang-19.0.0_pre20240712

Description

C language family frontend for LLVM

Added to portage

2024-07-13

clang-common - 19.0.0_pre20240712
Ebuild name:

sys-devel/clang-common-19.0.0_pre20240712

Description

Common files shared between multiple slots of clang

Added to portage

2024-07-13

clang-python - 19.0.0_pre20240712
Ebuild name:

dev-python/clang-python-19.0.0_pre20240712

Description

Python bindings for sys-devel/clang

Added to portage

2024-07-13

clang-runtime - 19.0.0_pre20240712
Ebuild name:

sys-devel/clang-runtime-19.0.0_pre20240712

Description

Meta-ebuild for clang runtime libraries

Added to portage

2024-07-13

compiler-rt - 19.0.0_pre20240712
Ebuild name:

sys-libs/compiler-rt-19.0.0_pre20240712

Description

Compiler runtime library for clang (built-in part)

Added to portage

2024-07-13

compiler-rt-sanitizers - 19.0.0_pre20240712
Ebuild name:

sys-libs/compiler-rt-sanitizers-19.0.0_pre20240712

Description

Compiler runtime libraries for clang (sanitizers

Added to portage

2024-07-13

conky - 1.21.4
Ebuild name:

app-admin/conky-1.21.4

Description

An advanced, highly configurable system monitor for X

Added to portage

2024-07-13

csvkit - 2.0.1
Ebuild name:

dev-python/csvkit-2.0.1

Description

A suite of utilities for converting to and working with CSV

Added to portage

2024-07-13

exceptiongroup - 1.2.2
Ebuild name:

dev-python/exceptiongroup-1.2.2

Description

Backport of PEP 654 (exception groups)

Added to portage

2024-07-13

exiv2 - 0.28.3
Ebuild name:

media-gfx/exiv2-0.28.3

Description

EXIF, IPTC and XMP metadata C++ library and command line utility

Added to portage

2024-07-13

faraday - 2.10.0
Ebuild name:

dev-ruby/faraday-2.10.0

Description

HTTP/REST API client library with pluggable components

Added to portage

2024-07-13

gcc - 11.4.1_p20240712
Ebuild name:

sys-devel/gcc-11.4.1_p20240712

Description

The GNU Compiler Collection

Added to portage

2024-07-13

gcc - 12.4.1_p20240711
Ebuild name:

sys-devel/gcc-12.4.1_p20240711

Description

The GNU Compiler Collection

Added to portage

2024-07-13

gcc - 13.3.1_p20240712
Ebuild name:

sys-devel/gcc-13.3.1_p20240712

Description

The GNU Compiler Collection

Added to portage

2024-07-13

gerbera - 2.2.0
Ebuild name:

net-misc/gerbera-2.2.0

Description

UPnP Media Server

Added to portage

2024-07-13

gimp - 2.99.18-r1
Ebuild name:

media-gfx/gimp-2.99.18-r1

Description

GNU Image Manipulation Program

Added to portage

2024-07-13

gimps - 30.19.20
Ebuild name:

sci-mathematics/gimps-30.19.20

Description

The Great Internet Mersenne Prime Search

Added to portage

2024-07-13

googleapis-common-protos - 1.63.2-r1
Ebuild name:

dev-python/googleapis-common-protos-1.63.2-r1

Description

Python classes generated from the common protos in th

Added to portage

2024-07-13

gson - 2.11.0-r1
Ebuild name:

dev-java/gson-2.11.0-r1

Description

Gson JSON library

Added to portage

2024-07-13

hishel - 0.0.30
Ebuild name:

dev-python/hishel-0.0.30

Description

An elegant HTTP Cache implementation for HTTPX and HTTP Core

Added to portage

2024-07-13

hpx - 1.10.0
Ebuild name:

sys-cluster/hpx-1.10.0

Description

C++ runtime system for parallel and distributed applications

Added to portage

2024-07-13

hypothesis - 6.107.0
Ebuild name:

dev-python/hypothesis-6.107.0

Description

A library for property based testing

Added to portage

2024-07-13

incus - 6.3-r1
Ebuild name:

app-containers/incus-6.3-r1

Description

Modern, secure and powerful system container and virtual machine manage

Added to portage

2024-07-13

irc - 20.4.3
Ebuild name:

dev-python/irc-20.4.3

Description

IRC client framework written in Python

Added to portage

2024-07-13

jide-oss - 3.7.12-r1
Ebuild name:

dev-java/jide-oss-3.7.12-r1

Description

JIDE Common Layer (Professional Swing Components)

Added to portage

2024-07-13

jupyter-server - 2.14.2
Ebuild name:

dev-python/jupyter-server-2.14.2

Description

Core services, APIs, and REST endpoints to Jupyter web application

Added to portage

2024-07-13

konsole - 24.05.2-r1
Ebuild name:

kde-apps/konsole-24.05.2-r1

Description

KDE's terminal emulator

Added to portage

2024-07-13

kvantum - 1.1.2-r1
Ebuild name:

x11-themes/kvantum-1.1.2-r1

Description

SVG-based theme engine for Qt5, KDE Plasma and LXQt

Added to portage

2024-07-13

libclc - 19.0.0_pre20240712
Ebuild name:

dev-libs/libclc-19.0.0_pre20240712

Description

OpenCL C library

Added to portage

2024-07-13

libcxx - 19.0.0_pre20240712
Ebuild name:

sys-libs/libcxx-19.0.0_pre20240712

Description

New implementation of the C++ standard library, targeting C++11

Added to portage

2024-07-13

libcxxabi - 19.0.0_pre20240712
Ebuild name:

sys-libs/libcxxabi-19.0.0_pre20240712

Description

Low level support for a standard C++ library

Added to portage

2024-07-13

libomp - 19.0.0_pre20240712
Ebuild name:

sys-libs/libomp-19.0.0_pre20240712

Description

OpenMP runtime library for LLVM/clang compiler

Added to portage

2024-07-13

lit - 19.0.0_pre20240712
Ebuild name:

dev-python/lit-19.0.0_pre20240712

Description

A stand-alone install of the LLVM suite testing tool

Added to portage

2024-07-13

lld - 19.0.0_pre20240712
Ebuild name:

sys-devel/lld-19.0.0_pre20240712

Description

The LLVM linker (link editor)

Added to portage

2024-07-13

lldb - 19.0.0_pre20240712
Ebuild name:

dev-debug/lldb-19.0.0_pre20240712

Description

The LLVM debugger

Added to portage

2024-07-13

llvm - 19.0.0_pre20240712
Ebuild name:

sys-devel/llvm-19.0.0_pre20240712

Description

Low Level Virtual Machine

Added to portage

2024-07-13

llvm-common - 19.0.0_pre20240712
Ebuild name:

sys-devel/llvm-common-19.0.0_pre20240712

Description

Common files shared between multiple slots of LLVM

Added to portage

2024-07-13

llvm-libunwind - 19.0.0_pre20240712
Ebuild name:

sys-libs/llvm-libunwind-19.0.0_pre20240712

Description

C++ runtime stack unwinder from LLVM

Added to portage

2024-07-13

llvm-ocaml - 19.0.0_pre20240712
Ebuild name:

dev-ml/llvm-ocaml-19.0.0_pre20240712

Description

OCaml bindings for LLVM

Added to portage

2024-07-13

makefun - 1.15.4
Ebuild name:

dev-python/makefun-1.15.4

Description

Small library to dynamically create Python functions

Added to portage

2024-07-13

mercurial - 6.8
Ebuild name:

dev-vcs/mercurial-6.8

Description

Scalable distributed SCM

Added to portage

2024-07-13

obs-studio - 30.2.0-r1
Ebuild name:

media-video/obs-studio-30.2.0-r1

Description

Software for Recording and Streaming Live Video Content

Added to portage

2024-07-13

ocaml-crunch - 3.3.1
Ebuild name:

dev-ml/ocaml-crunch-3.3.1

Description

Convert a filesystem into a static OCaml module

Added to portage

2024-07-13

odoc - 2.4.2
Ebuild name:

dev-ml/odoc-2.4.2

Description

OCaml documentation generator

Added to portage

2024-07-13

openpgp-keys-apache-tomcat - 10.1.26
Ebuild name:

sec-keys/openpgp-keys-apache-tomcat-10.1.26

Description

OpenPGP keys used by tomcat.apache.org

Added to portage

2024-07-13

pipdeptree - 2.16.2-r1
Ebuild name:

dev-python/pipdeptree-2.16.2-r1

Description

Utility for displaying installed packages in a dependency tree

Added to portage

2024-07-13

pipdeptree - 2.17.0-r1
Ebuild name:

dev-python/pipdeptree-2.17.0-r1

Description

Utility for displaying installed packages in a dependency tree

Added to portage

2024-07-13

pipdeptree - 2.18.1
Ebuild name:

dev-python/pipdeptree-2.18.1

Description

Utility for displaying installed packages in a dependency tree

Added to portage

2024-07-13

pipdeptree - 2.21.0-r1
Ebuild name:

dev-python/pipdeptree-2.21.0-r1

Description

Utility for displaying installed packages in a dependency tree

Added to portage

2024-07-13

pipdeptree - 2.22.0-r1
Ebuild name:

dev-python/pipdeptree-2.22.0-r1

Description

Utility for displaying installed packages in a dependency tree

Added to portage

2024-07-13

pipdeptree - 2.23.0-r1
Ebuild name:

dev-python/pipdeptree-2.23.0-r1

Description

Utility for displaying installed packages in a dependency tree

Added to portage

2024-07-13

pipdeptree - 2.23.1
Ebuild name:

dev-python/pipdeptree-2.23.1

Description

Utility for displaying installed packages in a dependency tree

Added to portage

2024-07-13

pipenv - 2024.0.1
Ebuild name:

dev-python/pipenv-2024.0.1

Description

Python Development Workflow for Humans

Added to portage

2024-07-13

pp - 1.2.0
Ebuild name:

dev-ml/pp-1.2.0

Description

Pretty-printing library

Added to portage

2024-07-13

ppx_js_style - 0.17.0
Ebuild name:

dev-ml/ppx_js_style-0.17.0

Description

Code style checker for Jane Street Packages

Added to portage

2024-07-13

prettytable - 3.10.2
Ebuild name:

dev-python/prettytable-3.10.2

Description

Easily displaying tabular data in a visually appealing ASCII table fo

Added to portage

2024-07-13

proto-plus - 1.24.0-r1
Ebuild name:

dev-python/proto-plus-1.24.0-r1

Description

Beautiful, Pythonic protocol buffers

Added to portage

2024-07-13

pydyf - 0.11.0
Ebuild name:

dev-python/pydyf-0.11.0

Description

A low-level PDF generator

Added to portage

2024-07-13

pyfakefs - 5.6.0
Ebuild name:

dev-python/pyfakefs-5.6.0

Description

A fake file system that mocks the Python file system modules

Added to portage

2024-07-13

pyglet - 2.0.16
Ebuild name:

dev-python/pyglet-2.0.16

Description

Cross-platform windowing and multimedia library for Python

Added to portage

2024-07-13

qcheck - 0.22
Ebuild name:

dev-ml/qcheck-0.22

Description

QuickCheck inspired property-based testing for OCaml

Added to portage

2024-07-13

qtile - 0.27.0
Ebuild name:

x11-wm/qtile-0.27.0

Description

A full-featured, hackable tiling window manager written in Python

Added to portage

2024-07-13

ruby2ruby - 2.5.1
Ebuild name:

dev-ruby/ruby2ruby-2.5.1

Description

Generates readable ruby from ParseTree

Added to portage

2024-07-13

ruby_parser - 3.21.1
Ebuild name:

dev-ruby/ruby_parser-3.21.1

Description

A ruby parser written in pure ruby

Added to portage

2024-07-13

shapely - 2.0.5
Ebuild name:

dev-python/shapely-2.0.5

Description

Geometric objects, predicates, and operations

Added to portage

2024-07-13

speed-dreams - 2.3.0-r1
Ebuild name:

games-sports/speed-dreams-2.3.0-r1

Description

Fork of the famous open racing car simulator TORCS

Added to portage

2024-07-13

sqlmap - 1.8.6
Ebuild name:

dev-db/sqlmap-1.8.6

Description

An automatic SQL injection and database takeover tool

Added to portage

2024-07-13

stellarsolver - 2.6
Ebuild name:

sci-libs/stellarsolver-2.6

Description

Cross-platform Sextractor and Astrometry.net-Based internal astrometric

Added to portage

2024-07-13

syd - 3.23.9
Ebuild name:

sys-apps/syd-3.23.9

Description

seccomp and landlock based application sandbox with support for namespaces

Added to portage

2024-07-13

tinywl - 0.18.0
Ebuild name:

gui-wm/tinywl-0.18.0

Description

Added to portage

2024-07-13

tokodon - 24.05.2-r2
Ebuild name:

net-im/tokodon-24.05.2-r2

Description

Mastodon client for Plasma and Plasma Mobile

Added to portage

2024-07-13

tomcat - 10.1.26
Ebuild name:

www-servers/tomcat-10.1.26

Description

Tomcat Servlet-6.0/JSP-3.1/EL-5.0/WebSocket-2.1/JASPIC-3.0 Container

Added to portage

2024-07-13

traces - 0.11.1
Ebuild name:

dev-ruby/traces-0.11.1

Description

Application instrumentation and tracing

Added to portage

2024-07-13

usermode-utilities - 20070815-r6
Ebuild name:

sys-apps/usermode-utilities-20070815-r6

Description

Tools for use with Usermode Linux virtual machines

Added to portage

2024-07-13

utop - 2.14.0
Ebuild name:

dev-ml/utop-2.14.0

Description

Universal toplevel for OCaml

Added to portage

2024-07-13

uuseg - 15.1.0
Ebuild name:

dev-ml/uuseg-15.1.0

Description

Unicode text segmentation for OCaml

Added to portage

2024-07-13

whipper - 0.10.0-r3
Ebuild name:

media-sound/whipper-0.10.0-r3

Description

A Python CD-DA ripper preferring accuracy over speed (forked from mor

Added to portage

2024-07-13

wlroots - 0.18.0
Ebuild name:

gui-libs/wlroots-0.18.0

Description

Pluggable, composable, unopinionated modules for building a Wayland composi

Added to portage

2024-07-13

xdg - 3.16.0
Ebuild name:

dev-ml/xdg-3.16.0

Description

XDG Base Directory Specification

Added to portage

2024-07-13

yojson - 2.2.2
Ebuild name:

dev-ml/yojson-2.2.2

Description

JSON parsing and pretty-printing library for OCaml

Added to portage

2024-07-13

yubikey-manager - 5.5.1
Ebuild name:

app-crypt/yubikey-manager-5.5.1

Description

Python library and command line tool for configuring a YubiKey

Added to portage

2024-07-13

yubikey-manager-qt - 1.2.5
Ebuild name:

app-crypt/yubikey-manager-qt-1.2.5

Description

Cross-platform application for configuring any YubiKey over all

Added to portage

2024-07-13

yubioath-flutter-bin - 6.1.0-r3
Ebuild name:

app-crypt/yubioath-flutter-bin-6.1.0-r3

Description

Yubico Authenticator for TOTP

Added to portage

2024-07-13

yubioath-flutter-bin - 6.4.0-r1
Ebuild name:

app-crypt/yubioath-flutter-bin-6.4.0-r1

Description

Yubico Authenticator for TOTP

Added to portage

2024-07-13

yubioath-flutter-bin - 7.0.0
Ebuild name:

app-crypt/yubioath-flutter-bin-7.0.0

Description

Yubico Authenticator for TOTP

Added to portage

2024-07-13

yubioath-flutter-bin - 7.0.0
Ebuild name:

app-crypt/yubioath-flutter-bin-7.0.0

Description

Yubico Authenticator for TOTP

Added to portage

2024-07-13

zulucrypt - 5.5.0_pre20180223
Ebuild name:

app-crypt/zulucrypt-5.5.0_pre20180223

Description

Front end to cryptsetup

Added to portage

2024-07-13

rdf newsfeed | rss newsfeed | Atom newsfeed
- Powered by LeopardCMS - Running on Gentoo -
Copyright 2004-2020 Sascha Nitsch Unternehmensberatung GmbH
Valid XHTML1.1 : Valid CSS : buttonmaker
- Level Triple-A Conformance to Web Content Accessibility Guidelines 1.0 -
- Copyright and legal notices -
Time to create this page: 33.5 ms