from small one page howto to huge articles all in one place
 

search text in:




Other .linuxhowtos.org sites: www.linuxhowtos.org
toolsntoys.linuxhowtos.org



Last additions:
How to make X listen on port 6000

How to make X listen on port 6000

words:

34

views:

68141

userrating:

average rating: 1.2 (8 votes) (1=very good 6=terrible)


May, 25th 2007:
April, 26th 2007:
Apr, 10th. 2007:
Druckversion . pdf icon
You are here: Portage


Details of dev-python/pp:

available versions:

releasesalphaamd64armhppaia64mipsppcppc64ppc macoss390shsparcx86USE-Flagsdependenciesebuild warnings
Legend:
+ stable
~ testing
- not available
some ebuild warning depend on specific use-flags or architectures, all ebuild-warnings are shown.

Known bugs:
bug IDcomponentassigned tostatusdescriptionlast change
209617OpenRCopenrcUNCONFIRMEDsys-apps/openrc-0.8.2-r1: user should be able to interrupt service start/stop pressing Ctrl+C2013-02-18 09:41:51
237994Applicationsbase-systemUNCONFIRMEDadd support for microcode loading with linux-2.6.27+2013-02-17 17:39:21
255644Ebuildsmaintainer-wantedUNCONFIRMEDapp-emulation/basiliskII-jit: a lot improved ebuild2012-12-14 15:37:41
256259ApplicationschutzpahUNCONFIRMEDwww-plugins/nspluginwrapper should allow native wrapping2012-04-18 08:47:57
266311Applicationsford_prefectUNCONFIRMEDmedia-sound/pulseaudio is lacking suspend support for sys-power/pm-utils (?)2012-10-19 12:32:55
325541Ebuildsmaintainer-wantedUNCONFIRMEDNew package: frandom (to sys-apps?)2012-09-19 19:20:54
331685Prefix SupportsysadminUNCONFIRMEDnet-analyzer/nrpe, net-analyzer/nagios-plugins: Gentoo Prefix support2012-08-24 13:27:59
333285Toolstools-portageUNCONFIRMEDapp-portage/gentoolkit: revdep-rebuild: add variable to make.conf default emerge options for revdep-2013-01-18 16:29:12
346251ApplicationspdaUNCONFIRMEDapp-pda/gtkpod: normalize volume doesn't work for .mp3 files with ApeV2 tags2013-01-11 16:10:10
360975Ebuildsmaintainer-wantedUNCONFIRMEDNew package: app-misc/endeavour2011-11-04 23:48:42
364941Ebuildsnet-dialupUNCONFIRMEDnet-dialup/rp-pppoe kernel-mode PPPoE support2011-04-26 19:48:13
365245Ebuildsmaintainer-wantedUNCONFIRMEDEbuild request app-dicts/stardict-freedict-fra-eng2012-01-22 22:08:04
365249Ebuildsmaintainer-wantedUNCONFIRMEDEbuild request app-dicts/stardict-xmlittre2012-01-22 22:08:08
365263Core systembase-systemUNCONFIRMEDsys-apps/less - auto convert UTF16/UTF32 inputs to active encoding2011-05-02 01:45:04
365299EbuildsforensicsUNCONFIRMEDapp-forensics/aide-0.15.1 hash signing does not work2013-02-03 13:00:34
365371Enhancement/Feature Requeststools-portageUNCONFIRMEDapp-portage/gentoolkit: equery - add EQUERY_DEFAULTS_OPTIONS for default global options2012-12-25 01:54:54
365643Ebuildspolynomial-cUNCONFIRMEDapp-emulation/virtualbox-additions-4.* License wrongly stated as PUEL2012-07-18 02:27:12
365655Unclassifieddev-portageUNCONFIRMEDsys-apps/portage implicit pointer check is broken with gcc-4.52011-05-06 02:51:27
365749Ebuildslu_zeroUNCONFIRMEDapp-emulation/bochs-2.4.5 unable to build in amd64 emulation on x86 platforms2011-05-10 21:14:05
366017Ebuildsmaintainer-wantedUNCONFIRMEDnew ebuild sys-apps/samefile2011-05-05 10:16:31
366051Ebuildsmaintainer-wantedUNCONFIRMEDAdd ebuild for NOC, Operation Support System (OSS) and Enterprise Network Operation Centers.2012-09-01 12:24:51
366215Applicationspolynomial-cUNCONFIRMEDapp-emulation/virtualbox has incomplete dependencies2013-01-01 09:29:16
366395Keywording and StabilizationrafaelmartinsUNCONFIRMED>=dev-lang/luajit-2.0.0_beta7 needs arm and ppc testing2012-05-31 17:47:27
366571DevelopmentpythonUNCONFIRMEDapp-admin/eselect-python: override python version from environment2011-07-29 06:41:23
366763ApplicationssgmlUNCONFIRMEDapp-text/asciidoc-8.6.4 should RDEPEND on app-text/dblatex2012-03-25 20:53:34
366779OpenRCopenrcUNCONFIRMEDsys-apps/openrc - "cannot allocate memory" when overcommit is disabled2012-02-27 14:07:23
366891OpenRCopenrcUNCONFIRMEDsys-apps/openrc-0.8.2-r1 will not restart over a broken NFS share.2011-12-19 18:01:59
366923Ebuildsbase-systemUNCONFIRMEDapp-arch/tar-1.26 changes matching behavior2011-05-13 00:18:52
367015Ebuildsshell-toolsUNCONFIRMEDapp-misc/dtach: scrollback buffer patch2013-01-20 10:32:16
367199Applicationsportage-utilsUNCONFIRMEDapp-portage/portage-utils 'qlop' - gauge option's description is vague and misleading2011-05-17 10:12:02
367203Toolstools-portageUNCONFIRMEDapp-portage/gentoolkit equery d --name-only (as with option b) would be useful2011-05-20 16:39:30
367443Ebuildspolynomial-cUNCONFIRMEDapp-emulation/virtualbox-9999 sets RPATH to /opt/VirtualBox but is installed to /usr/lib/virtualbox2011-05-17 17:41:46
367717OpenRCopenrcUNCONFIRMEDsys-apps/openrc: services which need net aren't starting on boot2011-06-29 16:46:02
367787GamesgamesUNCONFIRMEDrevenge-of-the-titans-1.80.12 doesn't support humble bundle installation files.2012-12-27 10:32:12
367799ApplicationsvadimkUNCONFIRMEDapp-emulation/vmware-player doesn't install thnuclnt (thinprint), so virtual printers do not work (b2011-05-18 00:14:08
368001Applicationsrobbat2UNCONFIRMEDapp-portage/g-cpan fails to install Sys::Filesystem2011-05-19 16:12:27
368053Ebuildsmaintainer-wantedUNCONFIRMEDnew ebuild : net-dns/yaddns - ddns is a small ddns client with multiple ddns server supports and a h2011-05-19 20:48:37
368161Applicationsx11UNCONFIRMEDx11-apps/xinit w/ sys-apps/openrc-0.8.2-r1 start-stop-daemon ignores PAM settings for user root2011-05-24 18:46:56
368377JavajavaUNCONFIRMEDjava-config should support JNI related native config options and ld.so.conf pathes2012-04-04 14:19:10
368497ApplicationsradhermitUNCONFIRMEDapp-admin/lsyncd - add init.d and configuration files2012-11-24 08:30:17
368659Unspecifiedpolynomial-cUNCONFIRMEDapp-emulation/virtualbox - add USE flag for net-misc/vde2011-11-23 09:07:24
368819Ebuildsmaintainer-wantedUNCONFIRMEDapp-emacs/sepia - perl+emacs integration (New Package)2011-06-08 06:30:23
368835Core systembase-systemUNCONFIRMEDapp-admin/sysklogd - no way to disable startup of klogd when sysklogd is used in a vserver2011-05-31 23:48:08
368955ApplicationsvadimkUNCONFIRMEDapp-emulation/open-vm-tools default scripts break network connectivity on pause/resume2011-12-03 05:48:53
369159Servernet-mailUNCONFIRMEDmail-filter/postgrey init script fails startup under sys-apps/openrc-0.8.2-r12013-01-14 07:23:32
369225Applicationsportage-utilsUNCONFIRMEDapp-portage/portage-utils: Request for atom support in qatom/qlist2011-10-03 00:54:56
369241EbuildssciUNCONFIRMEDsci-misc/boinc-6.12.26-r1.ebuild (Patch for PS3 Support)2012-06-26 16:01:33
369487Ebuildsmaintainer-wantedUNCONFIRMEDdev-libs/libapp-9999.ebuild (new ebuild)2011-06-06 00:21:52
369497UnspecifiedcardoeUNCONFIRMEDfirmware from media-tv/ivtv-firmware-20080701 fails to initialize hauppauge hvr-13002011-06-06 02:07:34
369539ApplicationsgraphicsUNCONFIRMEDmedia-gfx/k3d 0.7.11.0-r1 - work/k3d-source-0.7.11.0/k3dsdk/ngui/main_document_window.cpp:1572:36: e2012-06-19 11:22:07
369811ApplicationsopenrcUNCONFIRMEDsys-apps/openrc: Patch to measure time required for starting daemons (was: delay to sys-auth/console2012-05-20 13:25:32
369987Ebuildsmedia-tvUNCONFIRMEDapp-misc/lirc-0.9.0 emerge error econf failed2012-07-17 20:43:17
370191Serverweb-appsUNCONFIRMED=www-apps/viewvc-1.1.11 problem with =webapp-config-1.50.182012-02-21 14:00:57
370275Applicationsmedia-videoUNCONFIRMEDmedia-video/libav-0.7_pre20110327 error: selected processor does not support ARM mode2011-10-26 17:48:22
370287Applicationsmedia-tvUNCONFIRMEDapp-misc/lirc-0.9.0 fails to emerge, because 'struct i2c_adapter’ has no member named ‘id’2012-07-17 20:40:06
370445GNOMEmaintainer-wantedUNCONFIRMED[gnome overlay] Ebuild for gnome-shell-extensions-weather applet2011-12-30 11:49:48
370483Ebuildsmaintainer-wantedUNCONFIRMEDebuild request brother mfc-j265w lpr & cupswrapper ebuilds2012-04-08 14:01:44
370611Serverqmail-bugsUNCONFIRMEDmail-mta/netqmail-1.06 build failure: missing dependency - sys-apps/groff2011-06-08 06:31:17
371083ApplicationsbilllUNCONFIRMEDmedia-video/ogmrip - add support for ogg container2012-03-26 09:37:04
371373Ebuildsmaintainer-wantedUNCONFIRMEDapp-i18n/wordforge-0.8_rc1 - Offline translation and localization program working internally with XL2011-06-13 22:39:51
371635EbuildspatrickUNCONFIRMEDapp-portage/getdelta picks bad source file names2011-06-15 01:13:14
371729Prefix SupportprefixUNCONFIRMEDBootstrapping tar fails on SUSE Enterprise 11 SP02011-06-15 14:17:54
371785Prefix SupportprefixUNCONFIRMEDBootstrapping gcc fails on SUSE Enterprise 11 SP02011-06-15 15:13:04
371985Prefix SupportprefixUNCONFIRMEDdev-php5/pecl-imagick: add prefix support2012-10-18 08:27:51
372049Applicationstools-portageUNCONFIRMEDRequest for app-portage/gentoolkit to show (for a use flag) status of the flag in installed packages2012-12-25 01:55:20
372285ApplicationsxmwUNCONFIRMEDapp-admin/makepasswd-1.10 does not support the option "--crypt-md5"2011-06-21 00:38:51
372375ApplicationstoveUNCONFIRMEDapp-shells/zsh-4.3.11-r1 error: "compaudit:107: unknown group"2012-12-22 09:22:46
372453EbuildsdotnetUNCONFIRMEDapp-portage/eclass-manpages - Documentation for mono.eclass is awfull (one line)2011-06-29 10:17:45
372475Ebuildspolynomial-cUNCONFIRMEDRename app-emulation/virtualbox-additions to app-emulation/virtualbox-[guest-]additions[-bin]2012-04-08 19:23:25
372551OpenRCopenrcUNCONFIRMEDsys-apps/openrc: rc.c:read_key() hangs waiting for input at Interactive? prompt (termios problem)2012-02-15 12:49:05
372693Keywording and StabilizationarmUNCONFIRMEDapp-emulation/lxc ~arm keyword request2012-06-18 10:54:01
372949UnspecifiedpythonUNCONFIRMEDapp-admin/python-updater should depend on sys-apps/openrc2012-07-05 13:59:19
373207Applicationsmaintainer-wantedUNCONFIRMEDebuild request for app-cdr/mktoc2011-06-30 08:33:46
373281ApplicationsxemacsUNCONFIRMEDapp-editors/xemacs-21.5.31 fails to emerge, because check-features.el can not be loaded2013-02-17 11:58:08
373333EbuildsvmwareUNCONFIRMEDapp-emulation/vmware-ovftool-2.0.1.260188: version bump2011-07-03 16:45:55
373607Ebuildsmaintainer-wantedUNCONFIRMEDsys-apps/likwid: new package for Lightweight performance tools2012-04-07 13:13:49
373613EselecteselectUNCONFIRMEDapp-admin/eselect broken for eselect modules which rely on skel.bash (such as blas, cblas, lapack)2011-07-04 12:04:13
373635Ebuildsnet-dialupUNCONFIRMEDnet-dialup/ppp: add postinst message for break compatibility with dependent packages2011-07-01 01:38:55
373795Applicationsrobbat2UNCONFIRMEDapp-text/convmv-1.10 fails tests2012-11-07 11:19:40
373823Toolstools-portageUNCONFIRMEDapp-portage/gentoolkit-0.3.0.4: `euse -i` dumps errors about missing repo_name files2012-12-25 01:55:28
373891EbuildsramerethUNCONFIRMEDnet-misc/stunnel build fails: #error OpenSSL library compiled without thread support2012-12-25 04:27:10
373909Applicationsqmail-bugsUNCONFIRMEDnet-mail/qmailadmin-1.2.12: unmerge chokes on webapp-config2011-07-03 16:21:55
373979EbuildspatrickUNCONFIRMEDapp-emulation/virtualbox-modules-4.0.10 does not compile if KBUILD_OUTPUT != KERNEL_DIR2012-09-11 09:29:19
374021Toolstools-portageUNCONFIRMEDapp-portage/gentoolkit-0.3.0.4 - eclean-pkg traceback on unknown file2012-12-25 01:55:36
374259Core systemvimUNCONFIRMEDapp-editors/vim: confirm function in .vimrc causes cpu 100% & process lockup2011-08-12 18:52:09
374439ApplicationsgrozinUNCONFIRMEDapp-text/pybookreader-0.5.0 has bad homepage2011-07-27 06:53:37
374667Applicationsnet-dialupUNCONFIRMEDnet-dialup/rp-pppoe fail to cross compile2011-07-10 18:06:14
375249Ebuildsmaintainer-wantedUNCONFIRMEDapp-misc/xmind-portable (new package)2011-07-17 07:03:26
375555Ebuildsmaintainer-wantedUNCONFIRMEDnew ebuild app-office/wxbanker (version 0.8.2)2011-07-22 12:04:17
375597OpenRCopenrcUNCONFIRMEDsys-apps/openrc: netmount hangs with dead remotes2012-11-18 21:55:02
375777Applicationsmaintainer-neededUNCONFIRMEDapp-admin/ulogd-2.0.0_beta4 should warn about needed config changes2012-12-04 17:37:14
375783EbuildsgrozinUNCONFIRMEDmedia-gfx/fotoxx-11.07 ~ppc keyword request2011-07-21 11:28:06
375789ApplicationsdolsenUNCONFIRMED[TRACKER] app-portage/layman-2.0.12013-01-11 18:31:17
375825Applicationsmaintainer-neededUNCONFIRMEDapp-admin/ulogd-2.0.0_beta4 fails to build with +doc USE flag if latex is not installed2012-09-16 09:14:45
375879Ebuildsqmail-bugsUNCONFIRMED[PATCH] mail-mta/netqmail: Add SMTP authentication support (AUTH LOGIN) to qmail-remote2012-02-24 13:11:27
376123Ebuildsmaintainer-wantedUNCONFIRMEDCppUTest-2.3.ebuild (New Package)2011-07-25 09:15:02
376169Applicationsrobbat2UNCONFIRMEDapp-backup/amanda-3.2.[12] EXTRA_ECONF=--with-dump-honor-nodump - /usr/sbin/dump 9Sf /dev/null /dev/2013-01-13 19:09:47
376767Ebuildsrobbat2UNCONFIRMEDapp-portage/g-cpan-0.16.4 creates non-existent categories file without newline (inconsistent)2011-08-03 01:16:53
376775Ebuildsrobbat2UNCONFIRMEDapp-portage/g-cpan-0.16.4 handling of overlays2011-08-03 01:16:10
377105Applicationsweb-appsUNCONFIRMEDapp-admin/webapp-config-1.50.18: self.mkfile() dies while trying to delete a path to be created2011-08-04 02:04:41
377135Keywording and Stabilizationweb-appsUNCONFIRMEDwww-apps/mediawiki-1.16.4 works on ARM2012-11-18 10:21:22
377177ApplicationsfuzzyrayUNCONFIRMEDapp-portage/elogviewer-0.6.2-r1 - elogviewer fails to start for ordinary user in the portage group2011-08-27 17:52:02
377281ApplicationsforensicsUNCONFIRMEDapp-forensics/aide-0.15.1 will not run correctly when built statically.2013-02-03 13:02:19
377285Applicationspolynomial-cUNCONFIRMEDapp-emulation/virtualbox-4.0.12 - Windows guest has USB disk woes2012-10-18 13:10:29
377517Ebuildsmaintainer-wantedUNCONFIRMEDapp-admin/openark-kit (new package)2011-11-16 00:59:20
377641Applicationsmedia-tvUNCONFIRMEDapp-misc/lirc-0.9.0 doesn't work with most keys in imon_pad2012-04-27 12:09:04
377663Enhancement/Feature Requeststools-portageUNCONFIRMEDapp-portage/gentoolkit: Support "equery depends pkg[use]"2011-08-04 07:28:50
377831Ebuildsmaintainer-wantedUNCONFIRMEDsys-kernel/rtai-sources - Real Time Application Interface kernel sources2011-08-12 14:51:57
377859Ebuildsmaintainer-wantedUNCONFIRMEDapp-misc/libspnav - A free, compatible alternative for 3Dconnexion's 3D input SDK2011-09-22 19:29:47
377863Toolstools-portageUNCONFIRMEDapp-portage/gentoolkit: euse works improperly on g/fbsd2011-08-06 10:12:39
377933ApplicationsopenofficeUNCONFIRMEDapp-office/libreoffice-3.4.2.3 Impress text boxes become inaccessible when containing RTL text2012-04-03 23:26:53
377939Applicationsqmail-bugsUNCONFIRMEDnet-mail/vpopmail - added PostgreSQL support and USE flag2012-04-11 04:19:05
378013Applicationsmaintainer-wantedUNCONFIRMEDapp-crypt/pvk - Converts PVK files to PEM files and back again2011-08-07 13:57:30
378067ApplicationsforensicsUNCONFIRMEDapp-forensics/aide-0.14.2 - aide fails if non-standard paths are used2013-02-03 13:02:31
378559Applicationsdev-portageUNCONFIRMEDsys-apps/portage-2.1.10.10 add support for stripping PE322011-08-11 07:34:53
378683Applicationsbase-systemUNCONFIRMEDapp-admin/sysklogd-1.4.2 - klogd uses incorrect facility2011-08-13 14:33:29
379001LibrarygnomeUNCONFIRMEDsys-libs/ldb-1.1.4 fails on portage-multilib because of waflib module's python support2013-01-01 18:40:16
379003LibrarypatrickUNCONFIRMEDsys-libs/tevent-0.9.12 fails on portage-multilib because of waflib module's python support2012-12-25 21:03:18
379169DevelopmentyngwinUNCONFIRMEDapp-vim/gentoo-syntax: new ebuild: swap DEPEND and RDEPEND2012-07-25 05:17:56
379441Applicationsx11UNCONFIRMEDx11-apps/xinit: startx leaks .serverauth.???? files2011-10-27 13:53:49
379865Ebuildsbase-systemUNCONFIRMEDsys-apps/acl-2.2.51[nfs] fails acl-2.2.42-CITI_NFS4_ALL-2.dif2012-09-04 18:27:25
379967Applicationspolynomial-cUNCONFIRMEDapp-emulation/virtualbox-modules-4.0.12 doesn't check kernel config on compatibility2011-08-22 12:36:13
380021Ebuildsmaintainer-wantedUNCONFIRMEDNew ebuild: app-emulation/pearpc-0.52012-02-09 22:23:37
380235ApplicationswilliamhUNCONFIRMEDapp-accessibility/brltty: missing dependency on sys-libs/ncurses2011-08-25 13:06:41
380295Conceptual/Abstract Ideasdev-portageUNCONFIRMED[patch] sys-apps/portage: Enhanced output for emerge --pretend --fetchonly2012-09-06 20:12:21
380301Applicationspolynomial-cUNCONFIRMEDapp-emulation/virtualbox-4.1.2 crashes when compiling with -O2 option2012-02-01 09:06:12
380341Applicationsapp-backupUNCONFIRMEDapp-backup/cdbkup-1.0-r1: make jobserver unavailable2011-08-25 14:00:21
380389Enhancement/Feature Requestsdev-portageUNCONFIRMEDebuild skips EAPI unsupported phases silently2011-08-26 03:07:11
380647UnspecifieddolsenUNCONFIRMEDapp-portage/layman-2.0.0: More complete support for CVS2012-02-28 05:33:36
380857Applicationsapp-dictsUNCONFIRMEDapp-dicts/duali-data-0.1b -doins: stemsdb does not exist2011-10-23 14:29:09
380889Applicationsnet-imUNCONFIRMEDnet-im/sendxmpp-1.20 does not work when dev-perl/XML-Stream-1.22 is installed (1.23 needed)2011-09-01 19:39:25
380943Ebuildsmaintainer-wantedUNCONFIRMEDsys-apps/udev-discover: Sysfs browsing tool focused on helping udev users and developers (new packag2011-08-28 18:11:10
380959OtheraltUNCONFIRMEDapp-arch/dpkg: failed to compile on Mac OSX2011-10-08 16:59:55
381031Applicationsmaintainer-neededUNCONFIRMED[version bump] app-arch/rpm5-5.4.12012-07-26 08:04:22
381201ApplicationsvmwareUNCONFIRMEDapp-emulation/vmware-player and app-emulation/vmware-workstation: verify if we can drop libsexy depe2011-08-31 12:14:50
381365Core systemhannoUNCONFIRMEDsys-auth/pam_mount uses all virtual memory with app-cdr/k3b-2.0.2-r12013-01-08 13:37:30
381451ApplicationsswegenerUNCONFIRMEDAdd an init script to run multiple instances of app-misc/screen as a system service2011-09-08 12:17:13
381487Ebuildsmaintainer-wantedUNCONFIRMEDdev-python/DerApproximator - A python module for numerical optimization2011-09-05 11:36:51
381647Ebuildsmaintainer-wantedUNCONFIRMEDapp-vim/vst - Vim reStructured Text support2011-09-06 02:47:15
381927Ebuildsmaintainer-wantedUNCONFIRMEDapp-i18n/libgooglepinyin (new ebuild)2011-09-06 16:21:11
381969Ebuildsmaintainer-wantedUNCONFIRMEDAsus Notebook keyboard/backlight support kernel modules package2011-09-08 16:02:28
381973GamesgamesUNCONFIRMEDdev-games/physfs-2.0.2-r1 doesn't support 7z2012-01-07 19:54:58
382009Applicationstools-portageUNCONFIRMEDapp-portage/gentoolkit-0.3.0.4: revdep-rebuild does not try to re-create /var/cache/revdep-rebuild2012-12-25 01:56:04
382111LibrarygraphicsUNCONFIRMEDmedia-libs/libpgf-6.11.28: fails to build on ppc2011-09-09 00:09:11
382231Toolstools-portageUNCONFIRMEDapp-portage/gentoolkit-0.3.0.4 euse -i has undocumented output2011-09-19 18:28:14
382235EbuildslackUNCONFIRMEDapp-admin/gkrellm: Missing x11-libs/pango dependency2012-02-29 18:42:56
382339Ebuildsmaintainer-wantedUNCONFIRMED[ebuild request] app-office/dunnart - constraint-based diagram editor2011-09-09 07:53:17
382451Core systembase-systemUNCONFIRMEDapp-misc/ca-certificates-20110502: older verisign cert breaks with newer verisign cert2011-10-08 19:36:05
382589Toolstools-portageUNCONFIRMEDapp-portage/gentoolkit-0.3.0.4-r4: revdep-rebuild --library '/usr/lib/libgmp.so.3' doesn#t work2011-12-14 06:43:22
382807ApplicationsjavaUNCONFIRMED[java-overlay] app-text/languagetool-0.9.8 needs >=virtual/ooo-3.02011-12-09 23:13:42
382827Coredev-portageUNCONFIRMEDsys-apps/portage-2.1.10.11 crashes with confusing error when out of memory: TypeError: an integer is2011-09-14 13:56:03
383013JavajavaUNCONFIRMEDOnline bank security apple refuses to work unless I create a '/etc/.java' folder2011-09-15 18:53:28
383169Ebuildsmaintainer-wantedUNCONFIRMEDwww-apps/statusnet ebuild request2012-06-19 10:49:02
383323Javadev-portageUNCONFIRMEDsys-apps/portage: emerges pulls in older jdk slot when newer slot is masked (newer masked slot remai2012-09-06 19:32:08
383339Applicationsbase-systemUNCONFIRMEDapp-admin/syslog-ng-3.2.4: init script fails to start with ethernet bonding2011-09-19 10:38:08
383395UnspecifiedwineUNCONFIRMEDapp-emulation/wine-1.3.28 can't find gecko2012-08-18 09:34:28
383447PrintingprintingUNCONFIRMEDapp-text/ghostscript-gpl-9.05 fails to build2012-02-20 00:09:31
383455Ebuildsmaintainer-wantedUNCONFIRMEDapp-misc/openplacos/openplacos-0.3.0.ebuild New ebuild, latest stable releases on x86 and amd642012-10-11 17:25:44
383493baselayoutopenrcUNCONFIRMEDsys-apps/openrc-0.9.3-r1, net-firewall/ipset, net-firewall/iptables: Circular Dependency with custom2011-09-20 13:06:03
383581Core systemtoolchainUNCONFIRMED[Request] sys-devel/gcc-4.x: Re-add support for the D language2012-07-15 05:58:15
383669Applicationspolynomial-cUNCONFIRMEDapp-emulation/virtualbox-4.1.2: fails to compile due to Java name clash2011-12-21 14:52:14
383725Enhancement/Feature Requestsdev-portageUNCONFIRMEDsys-apps/portage include digital signature in xpak2011-09-19 23:52:27
383883Ebuildsmaintainer-wantedUNCONFIRMEDapp-backup/duply - duply (grown out of ftplicity) is a shell frontend for duplicity2011-09-26 02:08:12
383895Ebuildsc1pherUNCONFIRMEDapp-admin/gentoo-rsync-mirror file permission problem2012-07-04 17:48:16
384033Applicationsx11UNCONFIRMEDx11-base/xorg-server[xvfb]: add xvfb-run wrapper script2011-09-25 19:48:19
384167Prefix SupportprefixUNCONFIRMEDsys-devel/crossdev: prefix support2012-09-12 10:42:10
384199Ebuildsmedia-opticalUNCONFIRMEDapp-cdr/qpxtool new version2011-09-23 15:02:23
384205EbuildsgraphicsUNCONFIRMEDmedia-gfx/gnofract4d: gconf-2 dependency should be dropped2011-09-25 19:49:08
384371Ebuildsx11UNCONFIRMEDx11-apps/xdm drop stict x11-libs/libXinerama dependency2011-09-25 06:54:17
384401OtheraltUNCONFIRMEDapp-text/texlive-core-2011-r4: failed to compile on prefix/Mac OSX2011-09-25 06:48:07
384509EbuildstexUNCONFIRMEDUpgrade app-text/xindy to 2.4-12011-09-26 09:45:29
384537EbuildsgraphicsUNCONFIRMEDgraphviz 2.26.3-r3 and ocaml support2011-10-09 03:02:09
384581Mac OSXprefixUNCONFIRMEDapp-editors/emacs-23.3-r2: emerge failed with error unexec: my_endbss_static is not in section __bss2011-10-31 03:04:33
384617EbuildschainsawUNCONFIRMEDapp-emulation/dynamips fails to compile (w/ can't find a register in class 'GENERAL_REGS')2011-10-31 10:29:49
384883Applicationsnet-dialupUNCONFIRMEDnet-dialup/ppp: with net-dns/openresolv /etc/ppp/ip-up.d/50-initd.sh stomps /etc/ppp/ip-up.d/40-dns.2011-10-01 02:49:50
385131CorepythonUNCONFIRMEDapp-admin/python-updater-0.9: append --keep-going to emerge2012-03-17 11:41:48
385147Applicationsfreedesktop-bugsUNCONFIRMEDsys-apps/dbus-* crash via xfce4-panel2011-10-16 11:54:02
385153Prefix SupportprefixUNCONFIRMEDx11-libs/mesa: Support building our own OpenGL library on Mac OS X2011-10-01 07:56:36
385401ApplicationslxnayUNCONFIRMEDapp-admin/packagekit-base-0.6.18 compile error on using python3 as default2012-05-12 22:10:25
385483Ebuildsmaintainer-wantedUNCONFIRMEDnew ebuild: app-editors/x22012-05-04 15:36:31
385655Eclasses and Profilesweb-appsUNCONFIRMEDwebapp - allow multiple messages2011-10-10 14:38:20
385779ApplicationspatrickUNCONFIRMEDapp-admin/apache-tools-2.2.21 cross-compilation fix (libtool related)2013-02-16 13:32:00
386037DevelopmentqtUNCONFIRMEDapp-crypt/qca-ossl-2.0.0_beta3-r2: fails to build x86-abi with portage-multilib enabled2013-01-12 22:18:36
386041Core systemjdhoreUNCONFIRMEDsys-apps/paludis: Add USE-deps of the queries in pkg-setup2013-02-07 08:07:37
386163Core systempythonUNCONFIRMEDEmerging app-admin/eselect-python-20100321 fails with 2011-10-09 11:37:24
386507UnspecifiedbluenessUNCONFIRMEDapp-admin/webapp-config should allow tracd web server2011-12-30 16:02:14
386509Ebuildsweb-appsUNCONFIRMEDwww-apps/trac-git live git ebuild2011-10-11 07:02:02
386843DevelopmentvoyageurUNCONFIRMEDsys-devel/clang-2.9-r1 fails test PCH/cxx-typeid.cpp2011-10-16 03:36:44
386971Ebuildsmaintainer-wantedUNCONFIRMEDNew Ebuild: app-crypt/yyyRSA2011-10-21 07:13:09
387045EbuildsgrozinUNCONFIRMEDapp-text/pybookreader-0.5.0 should (R)DEPEND on gnome-base/libgnome{,ui}2011-11-18 14:13:50
387115ApplicationstomjbeUNCONFIRMEDapp-backup/bacula init script kills all bacula-fd clients instead only one2013-01-30 18:13:20
387167Ebuildsmaintainer-wantedUNCONFIRMEDwww-apps/concerto - Concerto Digital Signage2011-10-18 15:41:38
387213Applicationstools-portageUNCONFIRMEDapp-portage/gentoolkit-0.3.0.4-r4 - revdep-rebuild: replace "requires" with "was linked against"2011-10-18 16:20:34
387595Ebuildsmaintainer-wantedUNCONFIRMEDNew Ebuild: app-admin/ajenti2011-10-21 07:15:46
387619Ebuildsmaintainer-wantedUNCONFIRMEDEbuild for Brother DCP-7030 LPR driver and CUPS wrapper.2012-04-12 23:46:59
388425ApplicationswineUNCONFIRMEDapp-emulation/wine-1.3.30 sound not working, several apps stopped working.2012-03-22 12:19:51
388645Applicationsmaintainer-wantedUNCONFIRMEDapp-office/moneyguru - a personal finance management application2011-10-27 17:51:06
388931ApplicationspatrickUNCONFIRMEDapp-benchmarks/phoronix-test-suite-3.2.1: lspci command not found on first run2012-01-08 15:46:15
388983EbuildsvmwareUNCONFIRMEDapp-emulation/vmware-modules-238.5 with sys-kernel/hardened-sources-3.0.4-r4 - work/vmci-only/linux/2013-01-18 22:06:24
389011Ebuildsmaintainer-wantedUNCONFIRMEDnew ebuild : app-admin/sigar2011-10-30 23:49:09
389015Ebuildsmaintainer-wantedUNCONFIRMEDdev-libs/libpki - Provide an easy-to-use PKI library and tools for PKI enabled application developme2011-11-01 15:33:59
389027Ebuildsmaintainer-wantedUNCONFIRMEDnet-misc/qpid-cpp - cross-platform Enterprise Messaging system which implements the Advanced Message2012-08-31 06:30:43
389055Ebuildsmaintainer-wantedUNCONFIRMEDapp-admin/gpw - Trigraph Password Generator2011-11-13 06:59:34
389361Core systemgenkernelUNCONFIRMEDsys-kernel/genkernel-3.4.16 dmraid advises user to install obsolete device-mapper package2012-01-31 02:42:48
389419Applicationsnet-proxyUNCONFIRMEDnet-proxy/ntlmaps - add multiple configuration support2011-11-03 15:39:17
389647Applicationstools-portageUNCONFIRMEDapp-portage/gentoolkit: revdep-rebuild does not understand symlinks2011-12-20 14:54:27
389735Core - Dependenciesdev-portageUNCONFIRMEDsys-apps/portage-2.2.0_alpha72 fails to do --deep correctly2011-11-08 16:17:05
389853Applicationsshell-toolsUNCONFIRMEDapp-misc/fdupes-1.40 no longer in portage tree2012-07-06 07:28:27
390261EbuildschutzpahUNCONFIRMEDwww-plugins/nspluginwrapper-1.4.4-r1 - /usr/include/dirent.h:42:19: error: conflicting types for 'in2012-08-11 07:17:55
390363Core systemhardened-kernelUNCONFIRMEDsys-kernel/hardened-sources-2.6.32-r42/r68/r73 - Problem with support OCFS2 filesystems2011-12-24 02:47:23
390391Ebuildsmaintainer-wantedUNCONFIRMEDx11-misc/pdf_presenter_console - a GTK based presentation viewer application2012-08-12 14:09:53
390399JavajavaUNCONFIRMEDicedtea-bin-1.10.4 always redownloads web start application2011-12-05 12:55:11
390561Applicationsmaintainer-wantedUNCONFIRMEDapp-admin[?]/dmapd - Serve DAAP (iTunes) and DPAP (iPhoto) shares from Linux2011-11-15 15:39:23
390943Ebuildsx11UNCONFIRMED[x11 overlay] x11-apps/intel-gpu-tools: add live ebuild2012-08-26 14:09:05
391317Enhancement/Feature Requestsdev-portageUNCONFIRMEDsys-apps/portage: Multiple, consistent verbosity levels for emerge2011-11-22 13:28:07
391339EbuildshsggebhardtUNCONFIRMED[systemd overlay] sys-apps/systemd-units kdm.service long stopping2013-02-07 20:46:36
391407Eclasses and ProfilespatrickUNCONFIRMEDapache-2.eclass - support user patches & user configure2013-02-16 14:10:12
391705Applicationsmobile-phoneUNCONFIRMEDapp-mobilephone/kannel-1.5.0 version bump2011-11-24 17:47:28
391721Applicationslu_zeroUNCONFIRMEDapp-emulation/qemu-user-0.12.2 USE=static - lib64/libc.a(elf-init.o): In function `__libc_csu_irel':2012-01-16 15:48:56
391923Ebuildsmaintainer-wantedUNCONFIRMEDapp-office/charm-1.5.2 - Charm time tracking application2013-01-15 17:57:57
392261UnspecifiedhannoUNCONFIRMEDapp-emulation/dosemu -fno-pic causes build failure when using hardened compiler with PIE2012-12-23 17:38:30
392379ApplicationsvmwareUNCONFIRMEDapp-emulation/vmware-modules-238.5: vmmon-only/linux/hostif.c:2749:4: error: implicit declaration of2012-03-26 11:36:37
392769ApplicationspatrickUNCONFIRMEDapp-emulation/virtualbox-guest-additions-4.1.6-r1 fails to build from /etc/kernel/postinst.d - make[2012-03-14 22:38:37
392975Ebuildsmaintainer-wantedUNCONFIRMED[science overlay] sci-mathematics/pulp - a Python wrapper for linear programming solvers2011-12-04 05:05:24
393039FreeBSDbsdUNCONFIRMEDapp-misc/screen on Gentoo/FBSD9 - os.h:275:20: error: utmp.h: No such file or directory2012-12-04 00:53:30
393379EbuildsvoyageurUNCONFIRMEDx11-libs/qt-qt3support-4.7.4 fails to compile with sys-devel/dragonegg-3.02012-09-28 13:05:51
393419Eclasses and ProfilesvimUNCONFIRMEDapp-vim/gtk-syntax-20110214-r1 file collision2011-12-12 14:21:29
393489EbuildsvoyageurUNCONFIRMEDapp-office/libreoffice-3.5.0.0 fails to compile with sys-devel/dragonegg-3.02012-09-28 13:05:51
393497GNOMEgnomeUNCONFIRMEDgnome-base/gnome-applets-3.2.1 fails to install if sys-apps/linux-misc-apps is installed2012-08-07 17:34:06
393605ApplicationstuponeUNCONFIRMED[BUMP] app-misc/geneweb-6.05 version bump2013-02-19 18:52:27
394241Ebuildsmedia-videoUNCONFIRMEDmedia-libs/xvid - on ppc g3 hardware use flag -altivec is not honored2011-12-10 16:29:03
394353ApplicationsvimUNCONFIRMEDapp-vim/gtk-syntax-20110214-r1 mishighlights the "if" keyword as a function.2012-07-14 07:02:40
395095genkernelgenkernelUNCONFIRMEDgenkernel add support for custom location of boot config file2011-12-17 22:26:49
395311Ebuildsmaintainer-wantedUNCONFIRMEDapp-admin/petit - an open source log analysis tool2011-12-20 14:41:51
395399UnspecifiedperlUNCONFIRMEDapp-portage/perl-info: can't print out error message if PORTDIR is not set2011-12-20 20:21:36
395429Ebuildspolynomial-cUNCONFIRMEDapp-emulation/virtualbox-modules: need check CONFIG_HZ=value2011-12-21 02:10:58
395529EbuildssambaUNCONFIRMEDnet-fs/samba - add support for samba-virusfilter2011-12-21 17:17:13
395717Ebuildsweb-appsUNCONFIRMED[webapps-experimental overlay] www-apps/cforum-3.4.11 - /usr/include/bits/fcntl2.h:51:24: error: cal2011-12-28 16:56:06
395927Applicationspolynomial-cUNCONFIRMEDapp-emulation/virtualbox-4.1.8, app-emulation/virtualbox-extpack-oracle-4.1.8 - broken /usr/lib64/vi2011-12-26 10:21:44
396007Ebuildsmaintainer-wantedUNCONFIRMEDapp-admin/cpu-g-0.9.0 : New package2012-01-13 09:40:27
396125EbuildsbluenessUNCONFIRMEDapp-admin/webalizer-2.21.02 geodb does not work2013-01-13 14:44:27
396131Ebuildsmaintainer-wantedUNCONFIRMEDEbuild Request: sys-apps/tuned2011-12-26 22:41:41
396167Ebuildsmaintainer-wantedUNCONFIRMEDsys-power/jupiter-applet - a light weight power and hardware control applet for Linux2012-11-23 03:56:02
396289Ebuildsweb-appsUNCONFIRMEDapp-text/htp-1.17: version bump2011-12-29 16:27:39
396383Ebuildsmaintainer-wantedUNCONFIRMED[sunrise] app-office/writerscafe (new ebuild)2012-01-11 18:13:18
396411Ebuildsmaintainer-wantedUNCONFIRMEDsys-apps/ataidle ( New package )2011-12-29 14:37:43
396431ApplicationsvadimkUNCONFIRMEDapp-emulation/vmware-workstation-8.0.1.528992-r2 - segfault in libnvidia-glcore.so2011-12-29 18:43:30
396543Ebuildsmaintainer-wantedUNCONFIRMEDEbuild for Cherrytree - A hierarchical note taking application2013-01-30 17:37:55
396571ApplicationsziapannocchiaUNCONFIRMEDapp-misc/cwiid - udev-rule for uinput use non exitsting group plugdev2012-08-14 23:26:07
396665ApplicationspythonUNCONFIRMEDapp-admin/python-updater-0.10 does not update from /usr/lib/python3.1 to /usr/lib/python3.22012-11-07 14:06:55
397317Applicationsx11UNCONFIRMEDx11-apps/xrandr: --panning no longer works2012-02-06 17:31:07
397403ApplicationspatrickUNCONFIRMEDwww-apps/otrs - add app-admin/webapp-config compatibility / webapp.eclass support2012-08-24 13:09:08
397417Applicationsmaintainer-wantedUNCONFIRMEDPlease add app-dicts/dictd-gcide2012-01-03 17:31:10
397517ServernetmonUNCONFIRMEDapp-admin/sshguard-1.5 add attack signatures for net-misc/asterisk2012-08-19 01:00:03
397587ApplicationshollowUNCONFIRMEDwww-servers/nginx - add Naxsi web application firewall support2013-02-21 09:09:26
397901Applicationsx11UNCONFIRMED[x11 overlay] media-libs/glmark2-2011.08 - ../src/texture.cpp:81:48: ??????: expected type-specifier2012-01-10 16:33:32
397987Ebuildsweb-appsUNCONFIRMEDwww-apps/ampache-9999 LiveVCS ebuild2012-01-08 16:52:08
398089ApplicationstristanUNCONFIRMEDx11-misc/revelation-0.4.11-r2 USE=applet - configure:13842: error: failed to find module gnomeapplet2012-01-10 00:03:01
398113Ebuildsmobile-phoneUNCONFIRMEDapp-mobilephone/obexftp: disable unnecessary dev-lang/perl[-build] dependency2013-01-01 22:54:07
398123EbuildsforensicsUNCONFIRMEDapp-forensics/rkhunter missed dependency on virtual/mailx2012-01-08 16:25:00
398137Ebuildsmaintainer-wantedUNCONFIRMEDitap rdp client - a closed source rdp client that supports (among other things) TS-Gateway servers2012-01-10 15:05:30
398295StagesreleaseUNCONFIRMEDstage3-amd64-20120105 has PAGER=/usr/bin/less set but sys-apps/less not installed2013-02-12 19:10:42
398399ApplicationsvimUNCONFIRMEDapp-editors/vim-7.3.393 - if_perl.c:1102:1: error: static declaration of 'XS_VIM_Msg' follows non-st2012-09-29 14:38:20
398473genkernelgenkernelUNCONFIRMED[patch] sys-kernel/genkernel v86d support2012-01-12 17:13:07
398477genkernelgenkernelUNCONFIRMED[patch] sys-kernel/genkernel tuxonice-userui support2012-01-12 17:15:12
398631EbuildsultrabugUNCONFIRMEDvirtual/logger should rdepend also on >=sys-apps/systemd-382013-01-26 22:46:00
398731Ebuildsmaintainer-wantedUNCONFIRMEDnet-analyzer/slowhttptest-1.3.ebuild Application Layer DoS attack simulator2012-01-13 14:35:35
398983Core systembase-systemUNCONFIRMEDsys-apps/coreutils-8.7: gettext dependency is not split into libintl/gettext2013-01-05 01:16:15
399011ApplicationsultrabugUNCONFIRMEDapp-admin/rsyslog-5.8.6 logrotate config not working with systemd service2012-10-29 16:10:27
399065Ebuildsnet-dialupUNCONFIRMEDnet-dialup/ppp-2.4.5 EAP-TLS patch update2012-10-20 10:26:24
399139EbuildspythonUNCONFIRMEDapp-admin/eselect-python - Can't select python without man page2012-01-17 14:56:48
399199Ebuildsmaintainer-wantedUNCONFIRMEDmedia-sound/acoustid-fingerprinter - GUI application for submitting audio fingerprints to Acoustid2012-01-17 21:28:50
399201EbuildsrafaelmartinsUNCONFIRMEDdev-lua/toluapp-1.0.93: QA Notice: shared libraries lack a SONAME2012-01-17 21:14:10
399325ApplicationslackUNCONFIRMEDapp-admin/gkrellm-2.3.5 crashes when enabling x11-plugins/gkrellm-cpufreq-0.6.1 plugin2012-01-18 23:07:12
399353ApplicationsjerUNCONFIRMEDapp-admin/sysstat-10.0.3 generated daily report file will be truncated by cron.daily (sys-process/vi2012-05-10 14:40:15
399443Developmentrobbat2UNCONFIRMEDapp-portage/g-cpan-0.16.2 refuses to install LWP::UserAgent2012-04-05 01:19:58
399481ApplicationsrafaelmartinsUNCONFIRMEDapp-portage/g-octave - g-octave/odepkg-0.6.10 octave-3.6.0 - odepkg_auxiliary_functions.cc:457:52: e2012-12-20 00:22:48
399489Applicationsnet-imUNCONFIRMEDnet-im/pidgin XMPP/SASL authentication fail with >=dev-libs/cyrus-sasl-2.1.252012-02-07 20:53:55
399687ApplicationshannoUNCONFIRMEDSVGs exported by app-office/libreoffice cause segmentation fault in media-gfx/gimp-2.6.11-r52012-01-23 09:36:24
399839EbuildsfauliUNCONFIRMEDapp-admin/tmpwatch reports "Cannot stat file" with --fuser on sufficiently loaded system2012-02-17 15:33:53
399875Ebuildsmaintainer-wantedUNCONFIRMEDebuild for *all* brother linux drivers (lpr/cupswrapper)2012-04-13 00:01:20
399899Developmentlang-miscUNCONFIRMEDdev-lang/fpc-2.6.0 USE=ide - fpcalc.pas(244,3) Fatal: Selected assembler reader not supported2012-02-15 16:20:16
400585ApplicationsvimUNCONFIRMEDapp-editors/vim-7.3: broken unicode while copy/paste with X PRIMARY and CLIPBOARD2012-01-25 13:56:18
400623Ebuildsmaintainer-neededUNCONFIRMEDapp-text/ots-0.5.0: shared libraries don't have .so extension2012-03-04 10:37:54
400749Applicationsmaintainer-neededUNCONFIRMEDapp-laptop/ibam-0.5.2-r3 - ./ibam-0.5.2/debian/patches/04sysfs.dpatch fails2012-12-14 15:51:56
400897EbuildswineUNCONFIRMEDapp-emulation/crossover-office-pro-bin-10.2.0 version bump2012-02-27 22:15:26
401413Applicationsx11UNCONFIRMEDx11-apps/xdm-1.1.11-r1: elibtoolize called repeatedly2012-01-30 13:03:27
401473Ebuildsrobbat2UNCONFIRMEDapp-misc/dnetc-2.9110.519 version bump2012-11-19 09:35:41
401501Core systembase-systemUNCONFIRMEDapp-admin/sysklogd-1.5-r2: syslogd: /var/log/news/news.crit: No such file or directory2012-02-05 15:19:16
401523Applicationsx11UNCONFIRMEDx11-apps/xdm-1.1.11: does not start from within a chrooted environment if LiveDVD was booted with no2012-01-31 19:37:14
401559Ebuildsoli.huberUNCONFIRMEDwww-apps/joomla-2.5.0 version bump2012-04-23 21:29:49
401903Core systembase-systemUNCONFIRMEDapp-admin/sysklogd-1.5-r2: improve default syslog.conf to match syslog-ng.conf behavior2012-02-02 17:46:23
402027EbuildspythonUNCONFIRMEDdev-python/django-1.3.1 with dev-python/psycopg-2.4.2 fails app/project tests2012-04-28 20:35:29
402211Applicationsmaintainer-wantedUNCONFIRMEDapp-misc/freeplane (app-misc/freemind replacement) - software to support thinking, sharing informati2012-10-16 14:54:19
402415Third-Party ToolsmgornyUNCONFIRMEDapp-portage/flaggie breaks soft link after doing a cleanup2012-02-06 17:27:38
402465UnspecifiedprefixUNCONFIRMEDmedia-video/avidemux-2.5.6 - work/avidemux_2.5.6/plugins/ADM_audioDevices/Sdl/ADM_deviceSDL.cpp:15:12012-02-07 23:23:49
402645Developmentrobbat2UNCONFIRMEDapp-portage/g-cpan-0.16.4 fails to install Spreadsheet::XLSX due to "[in]correct package syntax"2012-02-13 21:18:27
402647Enhancement/Feature Requestsdev-portageUNCONFIRMEDsys-apps/portage emerge utility add layman sync functionality2012-02-09 06:29:42
402673Applicationsmedia-opticalUNCONFIRMEDapp-cdr/graveman-0.3.12_p5-r1 doesn't honor LINGUAS for locale files2012-02-23 21:38:44
402675ApplicationshannoUNCONFIRMEDapp-arch/unp-2.0_pre7 doesn't honor LINGUAS for locale files2012-02-23 21:38:44
402681Applicationsmaintainer-neededUNCONFIRMEDapp-editors/cooledit-3.17.17-r1 doesn't honor LINGUAS for locale files2012-02-23 21:38:44
402691ApplicationsperlUNCONFIRMEDapp-text/po4a-0.41 doesn't honor LINGUAS for locale files2012-02-23 21:38:44
402701Applicationsmaintainer-neededUNCONFIRMEDapp-dicts/fantasdic-1.0_beta7-r2 doesn't honor LINGUAS for locale files2013-02-03 13:13:42
402817Portage Documentationbase-systemUNCONFIRMEDapp-arch/tar: Man page does not list that -p is default for superuser2012-02-09 08:30:53
402891ApplicationscjkUNCONFIRMEDapp-i18n/uim-1.7.1-r1 doesn't honor LINGUAS for locale files2012-05-13 23:28:32
403119Core systembase-systemUNCONFIRMEDReplace sys-apps/microcode-data with a separate sys-kernel/intel-ucode2013-01-01 21:57:37
403123Unspecifiedshell-toolsUNCONFIRMEDapp-shells/gentoo-bashcomp - Add ebuild(1) --skip-manifest completion support2012-02-13 17:23:49
403249Core systembase-systemUNCONFIRMEDsys-apps/coreutils-8.14: Fails test-parse-datetime (exit: 134)2012-03-29 07:20:53
403279Core systembase-systemUNCONFIRMED=sys-apps/coreutils-8.15 fails FEATURES=test2012-02-18 16:37:27
403301Applicationsx11UNCONFIRMEDx11-apps/intel-gpu-tools-1.1 - work/intel-gpu-tools-1.1/tests/testdisplay.c:760:38: error: storage s2012-02-14 18:04:33
403317EbuildssystemdUNCONFIRMEDsys-apps/pcsc-lite - Add a systemd unit2012-12-27 21:50:11
403327PrintingprintingUNCONFIRMEDnet-print/foomatic-db-ppds-4.0.20120117-r1: Missing NickName and ModelName in /usr/share/cups/model/2012-02-14 21:13:08
403371Applicationsrobbat2UNCONFIRMEDsys-apps/rescan-scsi-bus-1.48: line 592: [: 1.03: integer expression expected2012-02-13 17:42:59
403407ApplicationspythonUNCONFIRMEDdev-python/rst2pdf - Add SVG support (IUSE=svg)2012-02-15 16:25:10
403633Applicationsnet-dialupUNCONFIRMEDnet-dialup/pppconfig-2.3.17-r1 doesn't honor LINGUAS for locale files2012-02-23 21:38:44
403667Ebuildsmaintainer-wantedUNCONFIRMEDapp-vim/ropevim-0.3_rc0 - vim plugin for using rope python refactoring library2012-02-14 21:15:54
403697Coredev-portageUNCONFIRMEDsys-apps/portage-2.1.10.46: TypeError: an integer is required2012-02-18 05:35:08
403841EbuildshwoarangUNCONFIRMEDdev-embedded/openocd-9999 - refactor and improve device support2012-11-05 12:32:05
403863ApplicationswiredUNCONFIRMEDapp-misc/mc-4.8.1-r1: typo in /etc/mc/mc.menu2013-01-16 23:21:14
404035ApplicationstoveUNCONFIRMEDapp-shells/zsh - add GREP_OPTIONS to profile2012-02-16 05:55:31
404143Ebuildsmaintainer-wantedUNCONFIRMEDapp-misc/kirikoo-upload-0.5.1 - CLI script for uploading images to http://kirikoo.net (French)2012-02-16 21:00:50
404157Coredev-portageUNCONFIRMEDsys-apps/portage : die in pkg_pretend() stops --keep-going from working2012-03-19 16:35:13
404345Applicationspolynomial-cUNCONFIRMEDapp-emulation/virtualbox-modules-4.1.4 - work/vboxpci/linux/VBoxPci-linux.c:989:9: Fehler: Zu wenige2012-02-18 16:57:37
404439Ebuildsmaintainer-wantedUNCONFIRMEDapp-backup/rear - Fully automated disaster Recovery for GNU/Linux2013-01-18 12:20:52
404445Core - Dependenciesdev-portageUNCONFIRMEDsys-apps/portage-2.1.10.44 tries to pull in dev-lang/perl-5.10.1 for virtual/perl-Time-Local-1.19.012012-02-18 22:44:10
404453EbuildspchristUNCONFIRMED=dev-lang/swig-2.0.4-r1 - Invalid conversion breaks PHP 5.4 support2012-12-28 19:37:35
404463EbuildscjkUNCONFIRMEDapp-i18n/uim shouldn't depend on fonts2012-05-13 23:28:32
404475GNOMEgnomeUNCONFIRMEDgnome-base/gnome-shell-3.2.2.1 segfaults in on_apps_tree_changed_cb()2012-02-20 03:31:40
404539Applicationsmedia-tvUNCONFIRMEDapp-misc/lirc-0.9.0 - /usr/src/linux-3.2.1-gentoo/arch/amd64/Makefile: No such file or directory mak2012-09-27 19:15:55
405089ApplicationsjlecUNCONFIRMEDapp-arch/p7zip-9.13 - ../../../Windows/Control/Controls.cpp:492:53: error: invalid conversion from '2012-05-30 19:43:20
405151ApplicationspatrickUNCONFIRMEDapp-emulation/virtualbox-guest-additions-4.1.4-r1: Failure to build with 3.2 kernel2012-04-02 07:44:24
405407Ebuildsmaintainer-wantedUNCONFIRMEDwww-misc/ppastats - a command line tool which retrieve statistics of a PPA and generates HTML pages.2012-02-23 22:08:20
405461Ebuildsmaintainer-wantedUNCONFIRMEDapp-editors/sublime-text - a sophisticated text editor for code, html and prose2012-11-18 12:37:09
405565Core systemflameeyesUNCONFIRMEDapp-emulation/lxc - init script affects other init scripts2012-10-02 07:38:11
405581Core systembase-systemUNCONFIRMEDapp-admin/sudo with net-nds/openldap-1.8.4_p1 - sudo: sudo_ldap_build_pass1 allocation mismatch2012-02-24 16:05:21
405643Ebuildsmaintainer-wantedUNCONFIRMEDapp-misc/stackapplet-1.5.1 - a small application that uses the new AppIndicator framework to display2012-02-26 17:22:22
405707Applicationsx11UNCONFIRMED=x11-apps/xdpyinfo-1.3.0 automagic dependency with x11-libs/libXinerama2012-02-27 00:04:12
405873ApplicationssciUNCONFIRMEDscience [overlay] sci-libs/lapackpp-2.5.4: configure: error: Blas/Lapack was not found.2012-02-27 02:46:24
405945Ebuildsmaintainer-wantedUNCONFIRMEDNew ebuild: app-misc/pycarddav - a simple way of accessing a CardDAV resource, mainly for use with m2012-10-14 18:19:44
406139Applicationsnet-dialupUNCONFIRMEDnet-dialup/ppp-2.4.5-r2: /etc/resolv.conf gets emptied upon connection re-negotiation.2012-04-06 22:11:33
406141ApplicationsljakabUNCONFIRMEDnet-misc/vpnc-0.5.3_p514: vpnc-script does not backup /etc/resolv.conf nor anticipate /etc/ppp/resol2013-02-06 15:31:36
406321ApplicationsrafaelmartinsUNCONFIRMEDapp-portage/g-octave - control package not found2012-05-21 11:33:34
406491Applicationsdesktop-wmUNCONFIRMEDx11-wm/oroborus-2.0.20 - menus in Qt applications do not appear2012-03-02 17:24:18
406503EbuildselvanorUNCONFIRMEDapp-office/openerp-server-6.0.3 version bump2012-03-02 17:28:05
406579Ebuildsnet-dialupUNCONFIRMEDnet-dialup/ppp: pppoe-discovery don't work in ppp >=2.4.5 because of the patch pado-timeout.patch2012-09-23 14:15:04
406645Toolstools-portageUNCONFIRMEDapp-portage/gentoolkit-0.3.0.5 please consider renaming the revdep-rebuild scripts2012-03-05 12:52:29
406685Ebuildsnet-p2pUNCONFIRMEDapp-arch/torrentzip-0.9 version bump request2012-12-30 07:20:56
406775Applicationsmedia-tvUNCONFIRMEDapp-misc/lirc - lircd reports "read invalid data from device /dev/lirc0" and no more output afterwar2012-03-05 19:44:56
406805ApplicationstitanofoldUNCONFIRMEDnet-dns/ddclient-3.8.1-r4 - Multiple interface support is broken2012-12-26 12:36:00
407227baselayoutnet-dialupUNCONFIRMEDnet-dialup/ppp - /etc/init.d/net.ppp0 goes into endless loop after openvpn was stopped2012-04-22 20:16:25
407245EbuildswineUNCONFIRMEDapp-emulation/crossover-office-pro-bin-11.0.0 version bump2012-11-17 19:10:14
407277Core systemsystemdUNCONFIRMEDsys-fs/mdadm - add support for systemd2013-02-04 15:19:48
407349Ebuildsmaintainer-wantedUNCONFIRMEDapp-misc/mpdlcd - Display MPD status on a lcdproc server2012-03-08 21:41:55
407471Applicationsmaintainer-wantedUNCONFIRMEDsys-cluster/blcr: a checkpoint and restart kernel support2012-03-09 15:14:37
407483ApplicationscjkUNCONFIRMEDapp-i18n/ibus-pinyin with dev-lang/lua-5.2.0 - ./.libs/libpylua.a(libpylua_la-lua-plugin.o): In func2012-03-09 15:19:06
407527Applicationsweb-appsUNCONFIRMEDwww-apps/drupal - add LINGUAS2012-03-12 12:17:51
407571Core systemhardened-kernelUNCONFIRMEDsys-apps/util-linux-2.20.1-r1 - authpriv.err: Mar 9 20:20:43 agetty[26171]: /dev/tty1: cannot get c2012-10-11 16:08:47
407669Applicationsmaintainer-wantedUNCONFIRMEDapp-misc/imgur-2.0 - A simple Imgur Bash screenshot utility2012-03-13 09:55:22
407725ApplicationsforensicsUNCONFIRMEDapp-forensics/chkrootkit-0.49 -n option does not recognize nfs4 mounts2012-03-13 10:15:38
407791Applicationsweb-appsUNCONFIRMEDwww-apps/drupal-7.12 Shows "Illegal string offset" Warning2012-03-13 11:22:43
408147UnspecifiedpythonUNCONFIRMEDapp-admin/eselect-python with FEATURES="nomac nodoc" - eselect python does not set man page (...)2012-03-14 19:23:10
408153ApplicationsgnustepUNCONFIRMED[gnustep overlay] gnustep-apps/sogo-1.3.14 and 2.0.0rc1 version bumps2012-11-22 15:43:06
408335Ebuildsmaintainer-neededUNCONFIRMEDapp-misc/ckermit-9.0.302 version bump2012-03-17 12:07:46
408607Applicationspolynomial-cUNCONFIRMEDapp-emulation/virtualbox - make --disable-vmmraw optional2012-03-18 05:32:07
408643Unspecifiedx11UNCONFIRMEDapp-admin/eselect-mesa needs update for r600 changes in mesa2012-07-11 11:14:47
408729Ebuildsmaintainer-wantedUNCONFIRMEDapp-misc/shelr - console screencasting tool2012-06-03 20:50:21
408855PrintingprintingUNCONFIRMEDapp-text/acroread-9.4.7 with www-client/firefox-10.0.1-r1 - after closing pdf loaded in tab acroread2012-03-20 14:30:11
408859Applicationsshell-toolsUNCONFIRMEDapp-misc/byobu-5.16: byobu-config option Help broken, IOError: No such file '/usr/share/doc/byobu/he2013-02-06 16:13:39
408893UnspecifiedbillieUNCONFIRMEDapp-admin/conky-1.8.1-r4 USE=apcupsd shows N/A in the output2013-01-14 06:22:23
409011Applicationsrobbat2UNCONFIRMEDapp-portage/g-cpan-0.16.4 'g-cpan -u' fails with Invalid ebuild name: /var/lib/cpan/perl-gcpan/Best/2012-03-23 07:38:06
409077Ebuildsmaintainer-wantedUNCONFIRMEDwww-apps/gerrit - web based code review and project management for Git based projects2012-03-21 15:35:16
409181Applicationsrobbat2UNCONFIRMEDapp-misc/g15stats - script does not parse extra options2013-01-31 19:03:48
409189EbuildsflameeyesUNCONFIRMEDapp-emulation/lxc-0.8.0_rc2-r1 : add {pre,post}{up,down} capabilities to init script [patch]2012-10-02 07:36:42
409239Ebuildsmaintainer-neededUNCONFIRMEDapp-arch/ppmd-10.1_p4 version bump2012-04-24 09:03:00
409385baselayoutbase-systemUNCONFIRMEDsys-apps/baselayout should be init agnostic2012-05-17 19:52:52
409571Ebuildsmaintainer-wantedUNCONFIRMEDapp-vim/rainbow_paranthsis - assigns each pair of parentheses a different colour2012-03-24 17:42:11
409583GNOMEfreedesktop-bugsUNCONFIRMEDapp-misc/tracker-9999 fails to compile with sys-devel/gettext-0.182012-04-02 12:35:18
409787OpenRCopenrcUNCONFIRMEDsys-apps/openrc-0.9.9.3: "rc-status -a" doesn't display all started services2012-11-07 15:40:11
409867EbuildsjmbsvicettoUNCONFIRMEDnet-misc/vde-2.3.2 version bump including Python support2012-06-08 13:16:39
409869Ebuildsmaintainer-wantedUNCONFIRMEDapp-emulation/virtualbricks-0.6.352 - A GTK frontend for VDE and QEMU/KVM2012-12-08 17:33:25
409947Unspecifiedapp-backupUNCONFIRMEDapp-backup/rdiff-backup-1.3.3 - "Security Violation" warning then "Fatal Error"2012-03-30 06:29:16
409961Applicationspolynomial-cUNCONFIRMEDapp-emulation/virtualbox-4.1.10[vboxwebsrv] with net-libs/gsoap-2.8.8[gnutls] - /usr/lib64/libgsoaps2012-03-28 12:53:46
410033Core systemmaintainer-neededUNCONFIRMEDsys-power/cpufreqd crashes on AC transition or startup with ACPI battery support2012-11-18 12:15:37
410037Core systemmaintainer-neededUNCONFIRMEDsys-power/cpufreqd config parser prevents usage of multi-cpu profile support2012-11-18 12:15:58
410053Applicationsidella4UNCONFIRMEDapp-emulation/xen-tools-4.1.2-r2 init script throws: option 'a' not supported2012-06-08 07:16:47
410079Ebuildsmaintainer-wantedUNCONFIRMEDnew ebuild: app-office/pyroom2012-03-29 01:31:21
410321ApplicationsfloppymUNCONFIRMEDwww-client/google-chrome-18.0.1025.142_p129054: "While your browser seems to support WebGL, it is di2012-07-24 04:30:58
410383Ebuildsmaintainer-wantedUNCONFIRMEDdev-cpp/cppcms - a Free C++ Web Development Framework aimed for Rapid Web Application Development2013-01-14 21:48:56
410451ApplicationspatrickUNCONFIRMEDwww-servers/apache-2.4.1-r1 APACHE2_MPMS="itk" - configure: error: MPM itk is not supported on this 2013-02-16 13:20:37
410527GamesgamesUNCONFIRMEDgames-board/scid-vs-pc-4.7 - A free chess database application2012-05-12 10:28:17
410553UnspecifiedswaponUNCONFIRMEDx11-drivers/xf86-video-virtualbox / app-emulation/virtualbox-guest-additions fail to cross-compile2012-04-03 15:23:22
410581Ebuildsmaintainer-wantedUNCONFIRMEDAdd extra shapes to app-office/dia2012-04-03 21:35:18
410595Ebuildsmaintainer-wantedUNCONFIRMEDsys-apps/fwts Firmware Test Suite2013-02-09 20:17:55
410605Core systembase-systemUNCONFIRMEDsys-apps/util-linux-2.20-r1: fsck complains about checking file systems mounted ro2013-02-05 14:52:10
410713Ebuildsmaintainer-wantedUNCONFIRMEDdev-db/cppdb - an SQL connectivity library for platform and database independent connectivity2012-06-28 17:50:44
410829Applicationsmr_bones_UNCONFIRMEDapp-admin/syslog-ng use "dbi" use flag instead of "sql"2012-04-05 02:44:56
410981ToolsdolsenUNCONFIRMEDapp-portage/etc-proposals with dev-lang/python-2.7[-berkdb] - raise error, "db type could not be det2012-04-09 20:36:29
411367EbuildsevermindUNCONFIRMED[pro-audio overlay] media-sound/glashctl-0.4.[2|3] - lashserverinterface.cpp: In constructor 'LASHSe2012-04-11 01:40:34
411461OpenRCopenrcUNCONFIRMEDsys-apps/openrc-0.9.8.4: services fail to start at boot because of "stalled" deptree cache2012-04-10 12:21:07
411471ServerpatrickUNCONFIRMEDapp-admin/apache-tools-2.2.22 fails on '--param keyword=value' in CFLAGS2013-02-16 13:33:09
411521ApplicationsmgornyUNCONFIRMEDapp-arch/zpaq-4.04 execution attempt in: 2013-01-12 17:31:30
411643ApplicationsfontsUNCONFIRMEDapp-arch/cabextract - consistent USE flag naming? - rename USE2012-04-12 01:14:50
411687ApplicationscjkUNCONFIRMEDapp-i18n/ibus-mozc: support uim-mozc (Mozc engine for app-i18n/uim)2012-04-12 23:00:50
411815OpenRCopenrcUNCONFIRMEDsys-apps/openrc-0.9.8.4 does not install ethtool_ring and txqueuelen params for network cards in bon2012-05-05 17:48:36
411829Applicationsmirror-adminUNCONFIRMEDwww-apps/mirmon-2.5 version bump2012-04-24 16:58:27
411861Ebuildsapp-backupUNCONFIRMEDapp-backup/backuppc-3.2.1-r1 needs several apache modules: ebuild should enforce that2012-04-14 05:51:11
411895Ebuildsmaintainer-wantedUNCONFIRMEDapp-text/peg-markdown -- an implementation of John Gruber's markdown in C2012-06-30 09:24:16
411901EbuildsvadimkUNCONFIRMEDapp-emulation/vmware-workstation-8* - Add system.d service2012-09-09 03:55:17
411973Ebuildsmaintainer-wantedUNCONFIRMEDapp-bacup/burp - Backup client/server for Unix and Windows systems2012-04-16 10:29:51
412041Ebuildsmaintainer-wantedUNCONFIRMEDmedia-sound/mudita24-1.0.3 - an application controlling the digital mixer, channel gains and other h2012-04-16 10:43:36
412135PrintingreavertmUNCONFIRMEDapp-text/poppler-0.16.7 and 0.20.2: pdftops creates postscript files which don't print on Brother MF2012-11-25 21:17:48
412249Ebuildsmaintainer-wantedUNCONFIRMEDdev-cpp/mpfrc++ -- high-performance C++ interface for MPFR library2012-10-31 13:24:54
412251Ebuildsmaintainer-wantedUNCONFIRMEDsys-apps/yum-utils-1.1.31 - Utilities for yum such as repotrack, reposync, and yumdownloader2012-04-17 15:19:54
412293PrintingprintingUNCONFIRMEDapp-text/acroread-9.5.1 - dirname missing operand in wrapper script2012-04-17 15:46:03
412457Librarymedia-videoUNCONFIRMEDmedia-video/gpac-0.4.5-r4 - ld: wxOsmo4.o: in function wxCreateApp():wxOsmo4.cpp(.text+0x1c): error:2012-04-18 15:19:39
412549Applicationsmaintainer-wantedUNCONFIRMEDapp-editors/vim-qt - An experimental Qt gui for Vim2012-06-01 05:52:22
412579Core systembase-systemUNCONFIRMEDnet-misc/wget-1.13.4-r1 - Add libproxy support2012-04-21 05:34:30
412695ApplicationsvirtualizationUNCONFIRMED[virtualization overlay] app-emulation/xen-tools-9999 fails to unpack2012-04-21 17:28:46
412773Prefix SupportprefixUNCONFIRMEDapp-editors/emacs-vcs: Includes incorrect libpng header file2012-04-22 13:12:19
412913Applicationsphp-bugsUNCONFIRMEDapp-admin/eselect-php leaves dangling files2012-04-24 14:07:08
412921Ebuildsmaintainer-wantedUNCONFIRMEDapp-text/peg-multimarkdown - An implementation of MultiMarkdown in C, using a PEG grammar2012-04-24 14:13:30
413191VulnerabilitiessecurityUNCONFIRMEDapp-portage/pfl - /usr/bin/e-file is too trusting of HTTP response.2012-06-18 06:04:49
413271Ebuildsx11UNCONFIRMEDx11-apps/rgb should DEPEND on x11-misc/util-macros - configure: No package 'xorg-macros' found2012-04-25 04:53:34
413325Applicationsx11UNCONFIRMEDx11-apps/xdpyinfo-1.3.0 has automagic dependency on x11-libs/libXxf86dga2012-04-24 16:02:19
413339ApplicationsppcUNCONFIRMEDsys-apps/powerpc-utils should use mirror://debian/ in SRC_URI2012-04-25 22:15:00
413417EbuildsalexxyUNCONFIRMEDsys-cluster/glusterfs - Stopping glusterd init script should not kill the glusterfsd processes2012-12-07 13:08:00
413443Serverweb-appsUNCONFIRMEDwww-apps/bugzilla-4.2.1 - missing excutable bit for scripts2012-04-25 15:32:38
413451Ebuildsweb-appsUNCONFIRMEDwww-apps/mantisbt uses system adodb, breaks Mantis' SOAP API2013-02-16 14:07:26
413467Applicationspolynomial-cUNCONFIRMEDapp-emulation/virtualbox-4.1.12: parallel build sometimes fails2013-01-07 06:25:45
413621Core systembase-systemUNCONFIRMEDsys-apps/coreutils-8.15 - src_test(): errors setting up rm/deep-2 and du/long-from-unreadable2012-11-20 03:30:47
413743EbuildsgamesUNCONFIRMEDapp-emulation/vice: Add a USE-flag for the SDL-UI2012-04-27 15:56:03
413779ApplicationsmatsuuUNCONFIRMEDwww-apps/redmine-1.4.1 without dev-ruby/ruby-net-ldap - ?2012-10-06 16:51:25
413793ApplicationsvadimkUNCONFIRMEDapp-emulation/vmware-workstation-8.0.2.591240 should tell users to be in vmware group2012-05-01 22:10:58
414155OpenRCopenrcUNCONFIRMED[patch] sys-apps/openrc local service enhancement2012-05-03 15:44:00
414185ApplicationstheologyUNCONFIRMEDapp-text/xiphos-3.1.5 segmentation fault2012-05-03 00:35:43
414289Prefix SupportprefixUNCONFIRMEDeselect-rails-0.18 support2012-05-23 20:25:13
414423Ebuildsmaintainer-wantedUNCONFIRMEDapp-antivirus/maldet-1.4.1 - Linux Malware Detect (LMD) is a malware scanner for Linux2012-08-21 13:50:57
414451Ebuildsnet-fsUNCONFIRMEDnet-fs/netatalk-2.2.2 USE=kerberos with app-crypt/heimdal - uams_gss.c:201:37: error: 'gss_nt_servic2012-05-03 16:05:11
414535EbuildsflameeyesUNCONFIRMEDapp-emulation/lxc should support doc use flag2013-01-12 02:20:44
414549Libraryamd64UNCONFIRMEDapp-emulation/emul-linux-x86-*; support for running PCSX2 32-bit released binary (or own)2012-07-18 15:48:39
414593PrintingprintingUNCONFIRMEDapp-text/ghostscript-gpl 9.05-r1 - ld: error in ./sobin/libgs.so(.eh_frame); no .eh_frame_hdr table 2012-12-19 23:42:44
414621Keywording and Stabilizationweb-appsUNCONFIRMEDPlease stabilize >=www-apps/bugzilla-3.6.92012-10-09 19:32:34
414655Toolstools-portageUNCONFIRMEDapp-portage/gentoolkit - eshowkw undocumented output2012-12-25 01:56:31
414815PMS/EAPIpms-bugsUNCONFIRMED[Future EAPI] Support for repository dependencies in DEPEND, PDEPEND and RDEPEND and atoms passed to2013-01-12 13:12:54
414817PMS/EAPIpms-bugsUNCONFIRMED[Future EAPI] Support for make.defaults, use.force, use.stable.force, use.mask, use.stable.mask, pac2013-01-12 13:13:11
414829Applicationseric.joshua.martinUNCONFIRMEDwww-apps/rt-4.0.5: Generated.pm configured directories point to /usr/share/webapps instaed of webapp2012-05-06 22:45:45
415029Applicationsmaintainer-wantedUNCONFIRMEDapp-misc/doublecmd - Double Commander is a cross platform open source file manager with two panels s2012-08-09 06:24:21
415089Applicationsx11UNCONFIRMEDx11-drivers/xf86-input-evdev - add utouch support2012-05-10 10:28:51
415359Core systemhsggebhardtUNCONFIRMED[systemd overlay] sys-apps/systemd-units: Support kexec2012-05-10 23:45:09
415367ApplicationsopenofficeUNCONFIRMEDapp-office/libreoffice selecting part of a file name does not work when using "LibreOffice file dial2012-05-10 13:37:24
415375Ebuildsmaintainer-wantedUNCONFIRMEDapp-office/makebeamerinfo - Creates .info file for use with app-office/impressive and dev-tex/latex-2012-05-10 14:51:46
415399EbuildsfauliUNCONFIRMEDapp-portage/g-ctan-2011.1 does not list pgfplots in CTAN database2012-12-16 13:13:12
415577ApplicationsopenofficeUNCONFIRMEDapp-office/libreoffice-3.5.3.2 QA Notice: make jobserver unavailable2012-05-16 02:57:58
415607ApplicationslxnayUNCONFIRMEDx11-apps/ardesia-1.0 version bump request2012-05-12 19:55:08
415685ApplicationsforensicsUNCONFIRMEDapp-forensics/magicrescue-1.1.9 installs broken dupemap2012-05-15 14:28:47
415789ApplicationsjlecUNCONFIRMEDapp-arch/p7zip-9.20.1-r1 fails tests2012-05-30 19:15:06
415931ApplicationslackUNCONFIRMEDapp-admin/gkrellm patch for ATI radeon temperature support2012-05-15 16:33:50
416021Applicationsmedia-tvUNCONFIRMEDapp-misc/lirc-*: livedrive_midi.c: livedrive_rec_midi fails to see SYSEX_END until logprintf(…) is a2012-12-02 02:09:04
416211Keywording and StabilizationgamesUNCONFIRMEDPlease stabilize app-emulation/vice-2.3 for PPC2012-05-16 11:36:08
416267Applicationsapp-backupUNCONFIRMEDapp-backup/backuppc-3.2.1 hangs and shows warnings about deprecated qw(...) with perl-5.142012-05-16 14:10:07
416361Core systembase-systemUNCONFIRMEDapp-arch/dump-0.4.44-r1 restore crashes restoring UNIX-domain socket with very long name2012-05-18 14:49:10
416415HardenedhardenedUNCONFIRMEDsys-apps/v86d-0.1.10 fails to read EBDA with GRKERNSEC_KMEM=y on some configurations2012-06-11 17:44:30
416829Applicationsgnome-officeUNCONFIRMEDapp-office/abiword-2.8.6-r2: USE=gnome is misleading, suggesting USE=goffice2012-07-07 13:04:16
416835ApplicationsgraphicsUNCONFIRMEDmedia-gfx/nip2 should support USE="compat examples"2013-02-16 14:13:54
416921Ebuildsmaintainer-wantedUNCONFIRMEDapp-backup/automysqlbackup-3.0_rc6 - Automatic MySQL Backup2012-09-09 11:04:39
416949Prefix SupportprefixUNCONFIRMEDapp-misc/figlet-222 works fine on x64-macos2012-05-21 18:21:31
417175EbuildshardenedUNCONFIRMEDapp-admin/bastille-3.0.9: homepage is not correct2012-05-22 21:45:41
417191Ebuildsamd64UNCONFIRMEDapp-emulation/emul-linux-x86-gtklibs-20120520 needs pax marking - gtk-query-immodules-2.0-32: error 2012-12-12 16:42:02
417263EbuildsembeddedUNCONFIRMEDsys-apps/busybox - USE=make-symlinks should not overwrite existing files2012-06-28 04:01:46
417295Ebuildsmaintainer-wantedUNCONFIRMEDmedia-video/sview-12.05 - a universal stereoscopic player which supports image viewing and movie pla2012-10-14 10:12:17
417365OpenRCopenrcUNCONFIRMEDsys-apps/openrc: parameter "-1" passed to dhclient, causing dhclient not to retry when failing2012-12-07 11:49:41
417409Core systemhardened-kernelUNCONFIRMEDsys-kernel/hardened-sources-3.2.11 - beam: page allocation failure: order:1, mode:0x20 or swapper: p2012-05-28 10:16:10
417515Unclassifieddev-portageUNCONFIRMEDsys-apps/portage-2.1.10.49 etc-update finds rc.conf twice2012-05-27 21:31:38
417525Ebuildsmobile-phoneUNCONFIRMEDapp-mobilephone/dfu-util-0.7 version bump2013-01-25 02:12:45
417597Repomandev-portageUNCONFIRMEDsys-apps/portage: repoman: Improve description of {P,R}DEPEND.suspect (rename .suspect to .blacklist2012-05-26 11:26:14
417785Ebuildsrobbat2UNCONFIRMEDapp-portage/g-cpan-0.16.4 broken regexp building for some cpan modules2012-05-30 09:21:46
417921ApplicationsvimUNCONFIRMEDapp-editors/vim - bash completion fails with paths containing spaces2012-05-28 11:50:58
417925Applicationsshell-toolsUNCONFIRMEDapp-shells/gentoo-bashcomp - bash completion fails with paths containing spaces2012-05-28 11:51:25
417929Applicationsshell-toolsUNCONFIRMEDapp-shells/bash-completion: some builtin completions don't work with spaces2012-05-28 11:52:38
417943Core systembase-systemUNCONFIRMEDsys-apps/util-linux-2.19.1-r1: blkid doesn't escape / in ID_FS_LABEL2012-05-28 12:05:23
417945Applicationsshell-toolsUNCONFIRMEDapp-misc/devtodo - bash completion fails with paths containing spaces2012-05-28 12:08:16
417947Applicationsmr_bones_UNCONFIRMEDapp-misc/figlet - bash completion fails with paths containing spaces2012-05-28 12:08:37
418285Ebuildsmaintainer-wantedUNCONFIRMEDmedia-libs/dcmtk - DCMTK - a collection of libraries and applications implementing large parts the D2012-05-30 18:44:00
418317Applicationsmr_bones_UNCONFIRMEDapp-admin/syslog-ng-3.3.5 - add systemd support2013-01-31 20:52:53
418343ApplicationsmarioUNCONFIRMEDapp-cdr/xfburn-0.4.3-r3 - /usr/share/applications/xfburn.desktop: file contains key "MimeType" in gr2012-05-31 14:59:11
418353Ebuildsmaintainer-wantedUNCONFIRMEDdev-php/pecl-dbase - DBASE support removed from PHP 5.32012-05-31 14:59:48
418403Ebuildsmaintainer-wantedUNCONFIRMEDapp-admin/puppet-dashboard - a web interface providing node classification and reporting features fo2012-10-09 03:21:48
418567Applicationsshell-toolsUNCONFIRMEDapp-misc/byobu-5.18: create session failed: /usr/bin/byobu-shell: Too many open files2013-02-06 16:13:27
419381Core - Interface (emerge)dev-portageUNCONFIRMEDsys-apps/portage-2.2.0_alpha109: emerge autounmask comment shows confusing "required by" dependency 2013-02-18 21:17:14
419755GamesgamesUNCONFIRMEDSupport amd64 for games-strategy/heroes32012-09-04 02:13:09
419787PrintingprintingUNCONFIRMEDnet-print/foo2zjs-99999999 with app-text/ghostscript-gpl-9.05-r1 fails tests2012-10-09 09:27:44
419793Prefix SupportprefixUNCONFIRMEDapp-emulation/hercules-3.07: install failed due to chown root2012-08-25 06:35:42
420067Ebuildsidella4UNCONFIRMEDapp-emulation/xen-tools init script for baselayout 22012-07-03 18:30:16
420393ApplicationsjlecUNCONFIRMEDapp-arch/p7zip-9.20.1-r2 fails to build 7zG/7zFM with "-l" in MAKEOPTS2012-06-09 14:44:20
420459Enhancement/Feature Requestsdev-portageUNCONFIRMEDemerge --keep-going should leave behind --resume state for skipped/failed builds2012-09-07 04:13:06
420495ApplicationsfauliUNCONFIRMEDapp-portage/g-ctan should provide explicit database update options2012-06-11 11:20:54
420505ApplicationsfauliUNCONFIRMEDapp-portage/g-ctan does not honour PORTDIR2012-06-11 11:20:25
420521ApplicationsfauliUNCONFIRMEDapp-portage/g-ctan does not allow to install all packages2012-11-29 14:49:37
420577Portage Documentationdev-portageUNCONFIRMEDsys-apps/portage: Polish manuals are severely outdated2013-01-05 13:26:13
420617Applicationsrobbat2UNCONFIRMEDapp-portage/g-cpan-0.16.4 does not read /etc/portage/make.conf2012-06-17 12:50:11
420641PrintingprintingUNCONFIRMEDapp-text/ghostscript-gpl-9.05-r1 - libgs.so gets built with _start etc2012-10-24 09:21:47
420675ApplicationstuponeUNCONFIRMEDapp-misc/geneweb-5.02 - File "srcfile.ml", line 195, characters 4-56: Error: Unbound constructor Std2013-02-21 12:35:28
420771GNOMEgnomeUNCONFIRMEDgnome-base/gvfs-1.12.3 (and apps using it, e.g. Nautilus) corrupt files on copy. Caused by prelink?2012-07-24 08:26:50
420819Applicationsnet-imUNCONFIRMEDnet-im/pidgin add support for mxit protocol2012-07-10 19:40:02
420941OpenRCopenrcUNCONFIRMEDsys-apps/openrc: add l2tp support2012-11-13 08:05:04
421011Ebuildsmaintainer-wantedUNCONFIRMEDapp-i18n/uim-mozc-9999 - mozc input method for uim2012-06-13 19:04:07
421135Ebuildsapache-bugsUNCONFIRMEDwww-servers/apache-2.4* - add support for mod_proxy_fcgi2013-02-20 00:33:10
421231GNOMEkdeUNCONFIRMEDkde-misc/plasma-widget-menubar needs appmenu-gtk2013-02-14 21:21:05
421287Toolstools-portageUNCONFIRMEDgentoolkit 0.3.0.6 euse -i option causes a lot of no such file or directory with app-admin/eselect-12012-06-20 16:02:59
421289ApplicationsultrabugUNCONFIRMEDdev-db/mongodb-2.0.6: Add support for USE="ssl"2012-12-23 14:34:12
421363Applicationsx11UNCONFIRMEDx11-apps/xinput_calibrator-0.7.5[-gtk] installs incorrect desktop entry2012-06-19 11:43:59
421459Applicationssci-geosciencesUNCONFIRMEDsci-geosciences/grass-6.4.2, strange Exec entries in /usr/share/applications/grass64-grass.desktop2012-11-21 18:48:02
421665SandboxsandboxUNCONFIRMEDsys-apps/busybox-1.20.1 fails with sandboxing enabled2012-11-26 17:24:29
421821PrintingprintingUNCONFIRMEDapp-text/libpaper-1.1.24-r1 bad postinst message2013-02-14 02:27:35
421845ApplicationsqemuUNCONFIRMEDapp-emulation/qemu: ABI=x32 support2012-12-13 22:09:00
422727ApplicationshannoUNCONFIRMEDapp-emulation/dosemu-1.4.1_pre20091009 - exits with SIGILL2012-06-21 15:43:13
423137ApplicationsvimUNCONFIRMEDapp-editors/vim-7.3.409: Misleading and outdated hint on solving a problem2012-06-26 14:55:41
423145ApplicationspatrickUNCONFIRMEDnet-irc/quassel support for syslog in init script2012-06-25 20:11:44
423151Ebuildslu_zeroUNCONFIRMEDapp-emulation/qemu-user-1.1.0 requires python2 >= 2.42012-06-27 21:02:40
423355Applicationspolynomial-cUNCONFIRMEDapp-emulation/virtualbox - remove `-f' from VBox_load_modules2012-07-26 14:30:14
423551EbuildsvimUNCONFIRMEDapp-vim/matrix - high memory usage / memory leak2012-07-11 01:20:36
423687Ebuildsmedia-tvUNCONFIRMEDmedia-tv/linuxtv-dvb-apps - Please enable building of alevt2012-06-27 14:05:27
423867Ebuildsmaintainer-wantedUNCONFIRMEDdev-vcs/gync - Synchronize data of desktop applications with Git2012-09-27 07:19:07
424041ApplicationssgmlUNCONFIRMEDapp-text/sgml-common-0.6.3-r5 fails with automake-1.12 - mkdir -p2012-10-13 18:56:21
424053Keywording and Stabilizationweb-appsUNCONFIRMEDPlease stabilize =www-apps/collectd-web-0.4.02012-06-29 15:11:21
424421Ebuildsmaintainer-wantedUNCONFIRMEDapp-text/xfardic: New ebuild2012-07-03 12:33:19
424461EbuildssciUNCONFIRMED[science overlay] app-portage/g-octave-9999 fails running with ImportError: cannot import name Confi2012-07-02 10:57:20
424463EbuildsrafaelmartinsUNCONFIRMEDapp-portage/g-octave please provide an updated database2012-08-03 22:03:54
424637Core systemsystemdUNCONFIRMEDsys-apps/systemd won't work with lvm due to udev and genkernel problems2012-07-07 09:32:46
424657Applicationsrobbat2UNCONFIRMEDapp-portage/g-cpan-0.16.4-r1 uses code that is depreciated in perl-5.16.02012-07-18 05:39:50
424699EbuildsflameeyesUNCONFIRMEDdev-perl/google-api-adwords-perl gzip support USE flag2012-07-08 19:56:15
424797EbuildspatrickUNCONFIRMEDapp-emulation/virtualbox-guest-additions-4.1.12: Successfully built on no-multilib amd642012-07-06 04:27:50
424816ApplicationspatrickUNCONFIRMEDapp-emulation/virtualbox-guest-additions-4.1.12 and x11-drivers/xf86-video-virtualbox-4.1.12 fail to2012-12-26 21:09:46
424854Ebuildsnet-mailUNCONFIRMEDdev-libs/cyrus-2.1.25-r2: subversion lose support for SASL with DIGEST-MD5 after upgrade cyrus-sasl 2012-07-05 06:54:33
424862Core systembase-systemUNCONFIRMEDsys-apps/logwatch - please add support for postscreen postfix service from upstream patch2012-08-28 08:48:18
425008ApplicationspatrickUNCONFIRMEDapp-crypt/gorilla-1.5.3.6 version bump2013-02-05 22:02:45
425022Core systembase-systemUNCONFIRMEDsys-apps/pciutils - lib/configure: Looking for access methods... Unfortunately, your OS is not suppo2012-07-10 09:18:23
425030EbuildscedkUNCONFIRMEDdev-util/nsis-2.4.6 - am64 support (no multilib)2012-07-06 13:37:44
425056OtherantarusUNCONFIRMEDGSoC 2012 gentoostats: Deploy the gentoostats webapp2012-09-05 11:19:59
425126OpenRCopenrcUNCONFIRMEDsys-apps/openrc-0.10.5 brings up br0 interface with nonfunctional route2012-07-07 00:20:16
425192PrintingprintingUNCONFIRMEDapp-text/acroread-9.5.1-r1 not able to open file by clicking in filemanager, bum request for acrorea2013-02-15 17:03:57
425196Developmentnet-proxyUNCONFIRMEDnet-proxy/adzapper needs flush.pl (removed from dev-lang/perl-5.16.0)2012-09-30 19:55:13
425200EbuildsperlUNCONFIRMEDwww-apps/Apache-Gallery-1.0_rc3 missing RDEPEND2012-07-10 04:10:51
425222Prefix SupportprefixUNCONFIRMEDopenexr/openexr-1.7.0-r1.ebuild with support for prefix2012-08-20 19:34:56
425316Applicationskernel-miscUNCONFIRMEDapp-misc/fdutils-5.5-r2 - fdmount.c:25:27: fatal error: linux/ext2_fs.h: No such file or directory2012-12-12 05:51:37
425524SandboxtoolchainUNCONFIRMED[ICE/4.6] sys-apps/sandbox build segfaults on hardened systems2012-11-17 19:16:55
425554Core systemdev-portageUNCONFIRMEDsys-apps/portage-2.2.0_alpha116: Ctrl+C during --jobs simply halts progress w/o quitting2012-12-25 21:05:58
425758EbuildsroxUNCONFIRMEDrox-base/rox-lib - Deprecation Warning: Usage of python_mod_optimize() in packages not support......2012-07-18 09:48:32
426194ApplicationspythonUNCONFIRMEDapp-admin/eselect-python: python wrapper breaks OpenELEC build2012-07-12 00:36:25
426260ServernxUNCONFIRMEDnet-misc/x2goserver - x2go loses the applications menu under gnome2012-07-17 18:04:16
426346Applicationsshell-toolsUNCONFIRMEDapp-shells/bash-completion - cd autocomplete's non-directories2012-07-17 20:17:44
426352Applicationsmaintainer-neededUNCONFIRMEDapp-text/htmldoc-1.8.27-r3 does not render PNGs properly2013-01-01 20:24:39
426360Ebuildsdev-embeddedUNCONFIRMEDdev-embedded/sgpp-lite-arm-eabi-bin-2012.03.56 version bump2012-07-16 17:54:18
426362ApplicationsgraphicsUNCONFIRMEDmedia-gfx/graphviz-2.28.0 media-gfx/graphviz-2.28.0 enables qt, despite USE=-qt4 builds Qt support2012-07-18 00:01:30
426398Applicationsnet-dialupUNCONFIRMEDnet-dialup/pptpclient - stability fixes2012-07-18 00:06:56
426444ApplicationsemacsUNCONFIRMEDapp-editors/emacs-23.4-r3 fails to build in parallel (--jobs=64)2012-07-18 15:26:44
426452GNOMEgnomeUNCONFIRMED[gnome-overlay] net-libs/webkit-gtk-1.9.4-r300 - Source/WebCore/platform/graphics/texmap/TextureMapp2012-07-29 17:48:32
426472Ebuildsmedia-videoUNCONFIRMEDmedia-plugins/live-2012.06.26: QA: compile: please use append-cppflags for preprocessor flags2012-07-18 15:11:05
426570Applicationsshell-toolsUNCONFIRMEDapp-shells/gentoo-bashcomp extended by a completion for eshowkw2012-07-17 16:56:11
426618Applicationsmaintainer-wantedUNCONFIRMEDapp-admin/eselect-flash-nsplugin - manage Flash plugin symlinks2012-07-18 16:27:18
426656Ebuildspolynomial-cUNCONFIRMEDapp-emulation/virtualbox-4.18 should depend on >=dev-util/kbuild-0.1.9998_pre20110817-r12012-07-18 15:40:35
426814Servermr_bones_UNCONFIRMEDapp-admin/syslog-ng - default configuration should @include "scl.conf"2012-07-18 16:14:44
426872Serveridella4UNCONFIRMEDapp-emulation/xen-tools-4.1* - disable HPET broadcast2012-08-13 09:47:39
426898Applicationspolynomial-cUNCONFIRMED=app-emulation/virtualbox-modules-4.1.12 with sys-kernel/vanilla-sources-3.4.5 - src_test(): .../wor2012-11-13 17:18:09
427062EbuildsxmwUNCONFIRMEDapp-admin/bcfg2-1.2.2-r1 - add support for Dynamic Reporting System2012-07-19 15:58:15
427194ApplicationshollowUNCONFIRMEDwww-servers/nginx: add rtmp module support2012-11-26 08:04:35
427310ApplicationsvoyageurUNCONFIRMED=dev-libs/ppl-0.12.1 fails tests with clang-3.1-r42012-07-25 14:12:12
427314Core systemvoyageurUNCONFIRMEDsys-apps/sed fails test with clang-3.1-r42012-07-21 14:07:01
427316Core systemvoyageurUNCONFIRMED=sys-apps/findutils-4.5.10-r1 fails tests with clang-3.1-r42012-07-21 14:07:00
427334Ebuildsmaintainer-wantedUNCONFIRMEDmail-client/mutt-kz - a fork of mutt with added support for net-mail/notmuch2012-08-03 06:29:47
427426Applicationsmaintainer-neededUNCONFIRMEDapp-misc/run-mailcap - run-mailcap unlinks tmplink before an app has a chance to read a file2012-07-30 18:15:09
427496ApplicationsalexxyUNCONFIRMEDnet-wireless/wimax-1.5.2-r1 with net-wireless/wpa_supplicant-1.0 USE=wimax - undefined reference to 2013-01-05 12:47:50
427572Applicationsapp-backupUNCONFIRMEDapp-backup/boxbackup - man pages are installed in /usr/man2012-07-24 14:08:07
427668Ebuildssci-geosciencesUNCONFIRMEDsci-geosciences/osm2pgsql-99999999 - support for *.pbf files2012-07-24 14:32:27
427688EbuildsjdhoreUNCONFIRMEDmedia-video/miro-5.0.1, pre-stripped files, and revdep-rebuild keeps rebuilding due to /usr/bin/code2012-08-14 16:25:31
427700Ebuildsmr_bones_UNCONFIRMEDapp-misc/figlet-2.2.5 version bump2012-07-23 12:15:04
427738Ebuildsmaintainer-wantedUNCONFIRMEDNew: dev-python/django-cms-2.3 - A Django application for managing hierarchical pages of content2012-12-12 12:04:20
427748Core systemdev-portageUNCONFIRMEDsys-apps/portage-2.2.0_alpha120 crashing when compile fails2012-07-23 18:57:51
427762Ebuildsmaintainer-wantedUNCONFIRMEDNew: dev-python/django-grappelli-2.4.0 - A grid-based alternative/extension to the Django administra2012-07-24 14:52:05
427770Ebuildsmaintainer-wantedUNCONFIRMEDNew: dev-python/django-publisher-0.0.3 - Django external publishing app2012-12-13 07:01:05
427946Eclasses and ProfilespatrickUNCONFIRMEDapache-2.eclass: Proposed enhancement: USE_EXPAND of APACHE2_MODULES should support IUSE-DEFAULTS2013-02-17 09:25:03
427974Applicationspolynomial-cUNCONFIRMEDapp-emulation/virtualbox-4.1.12 - .../work/VirtualBox-4.1.12/src/VBox/Devices/PC/Etherboot-src/arch/2012-07-25 02:41:01
427998OpenRCopenrcUNCONFIRMEDsys-apps/openrc: The root script does not work correctly if root or any filesystems it remounts are 2012-10-18 17:42:12
428008Core systemnet-fsUNCONFIRMEDnet-fs/nfs-utils-1.2.3-r1: Issues mapping uids and usernames between RHEL5 server and Gentoo client2012-07-25 15:56:19
428124Applicationspolynomial-cUNCONFIRMEDapp-emulation/virtualbox-4.1.12: "Failed to create the VirtualBox COM object"2012-09-21 15:25:00
428246Ebuildsmaintainer-wantedUNCONFIRMEDapp-backup/jungledisk-server - offsite managed backup for servers2012-07-28 23:06:49
428378ServerbluenessUNCONFIRMEDapp-admin/webapp-config-1.50.19 - fix paludis support2012-07-29 16:01:32
428410LibraryalexxyUNCONFIRMEDsys-apps/gptfdisk - make dev-libs/icu dependency optional2012-11-01 19:01:06
428656EbuildsjdhoreUNCONFIRMEDapp-accessibility/gnome-mag-0.16.3: fails to build2012-11-25 14:44:01
428678Core - Configurationdev-portageUNCONFIRMEDsys-apps/portage-2.1.10.65 omits some variables from cascaded profiles make.defaults2012-08-07 05:00:31
428716Ebuildslu_zeroUNCONFIRMEDapp-emulation/qemu-user-9999 - ?2012-07-30 22:56:27
429442EbuildsprintingUNCONFIRMEDapp-text/ghostscript-gpl - disable endian check when cross-compiling2012-08-02 13:07:09
429450Core systemrobbat2UNCONFIRMEDsys-apps/hwinfo-19.1 - hwinfo[NNNNN]: segfault at NNN ip NNNNNNNNNNNNNNNN sp NNNNNNNNNNNNNNNN error 2013-02-19 20:31:17
429462Core systembase-systemUNCONFIRMEDnet-misc/rsync - add --copy-devices support2012-08-02 11:50:17
429576Applicationsmaintainer-wantedUNCONFIRMEDapp-misc/ola: Open Lighting Architecture2013-01-20 18:34:59
429674Libraryamd64UNCONFIRMEDapp-emulation/emul-linux-x86-medialibs: move media-libs/faac to a separate package due to license "i2012-11-02 18:16:56
429778ApplicationshannoUNCONFIRMEDapp-emulation/dosemu-1.4.1_pre20091009 should depend on media-libs/libsdl2012-08-04 09:42:48
429802Ebuildsnet-imUNCONFIRMEDnet-im/sendxmpp-1.20 with 2012-08-04 16:43:36
429998Third-Party ToolsfauliUNCONFIRMEDapp-portage/g-ctan-2011.1 blocks >=app-text/texlive-20122012-11-23 15:46:37
430010ApplicationsbluenessUNCONFIRMEDapp-admin/webapp-config-1.50.19 fails test: WebappConfig.content.Contents2012-08-05 14:22:59
430224ApplicationsopenofficeUNCONFIRMEDapp-office/libreoffice-bin-3.5.4.2 - printing to CUPS fails before the job has been submitted2012-08-08 18:24:36
430266Prefix SupportprefixUNCONFIRMEDapp-arch/xz-utils fails to build on NetBSD2012-08-10 06:38:46
430318OpenRCopenrcUNCONFIRMEDsys-apps/openrc-0.10.5 fails to remounts reiserfs root file system read only on reboot: failed becau2012-11-07 11:40:40
430422ApplicationshannoUNCONFIRMEDapp-emulation/dosemu-1.4.1_pre20091009 : svga USE flag is not handled properly2012-08-08 09:56:45
430812Toolstools-portageUNCONFIRMEDapp-portage/gentoolkit - after recent binutils upgrade, revdep-rebuild did not catch libbfd-2.21.1.s2012-08-22 19:36:59
430862Ebuildsmaintainer-wantedUNCONFIRMEDx11-misc/pdfpc - a presenter console with multi-monitor support for PDF files2012-08-12 20:07:52
430912Core systemsystemdUNCONFIRMEDvirtual/init - add RDEPEND on sys-apps/systemd-sysv-utils2012-08-15 00:27:49
431028Ebuildsmaintainer-wantedUNCONFIRMEDapp-misc/command-not-found - In case a command could not be found this utility searches for packages2012-08-13 17:53:51
431080Toolsrobbat2UNCONFIRMEDapp-portage/g-cpan-0.16.4-r1 does not handle quotes in description properly2012-08-13 01:48:00
431200ApplicationsrubyUNCONFIRMEDdev-lang/rubinius-1.2.4.20110705 - m/builtin/unpack.cpp:284:5: error: narrowing conversion of ‘214742013-02-12 09:50:38
431214CatalystcatalystUNCONFIRMEDdev-util/catalyst: add qemu support2012-08-16 21:52:46
431252Ebuildsnet-fsUNCONFIRMEDnet-fs/nfs-utils unable to run nfs client only (nfs4), without server support in kernel2012-08-14 12:57:57
431256ApplicationstoveUNCONFIRMEDapp-shells/zsh-4.3.15 wrong syntax for "ip tunnel del"2012-08-14 12:58:33
431368ApplicationshaskellUNCONFIRMEDx11-misc/xmobar-0.14 - src/Plugins/Monitors/CoreCommon.hs:139:30: No instance for (Applicative (Cont2012-08-14 13:16:12
431484Coredev-portageUNCONFIRMEDsys-apps/portage-2.1.11.10 is slow2012-08-30 07:43:24
431608Keywording and StabilizationpythonUNCONFIRMEDStabilize dev-python/virtualenvwrapper2013-01-04 01:17:32
431636KDEkdeUNCONFIRMEDkde-base/konqueror downloads dont appear as bin files2012-08-28 07:33:50
431638SandboxsandboxUNCONFIRMEDsys-apps/sandbox-2.6 sometimes sends QA warnings to tty2012-08-16 19:44:12
431684ApplicationsbenchmarksUNCONFIRMEDapp-benchmarks/bonnie++-1.96: manpage references ebuild-altered docpath2012-08-17 16:04:52
431802Ebuildsmaintainer-wantedUNCONFIRMEDwww-apps/gitlab Project management and code hosting application written in ruby2013-01-23 04:07:24
431804Ebuildsmaintainer-wantedUNCONFIRMEDapp-text/pelican-3.0 - A tool to generate a static blog, with restructured text (or markdown) input 2012-08-18 15:39:10
431806ApplicationsmozillaUNCONFIRMEDwww-client/firefox-14.0.1 does not run on PPC642012-08-26 10:01:23
431824Ebuildsx11UNCONFIRMEDx11-apps/xinput-1.6.0 requires x11-apps/xrandr2012-08-18 15:37:23
431926PrintingprintingUNCONFIRMEDnet-print/foomatic-filters - foomatic-gswrapper symlink broken2013-02-04 19:46:49
431928Ebuildsmaintainer-wantedUNCONFIRMEDapp-benchmarks/mmtests - a configurable test suite that runs a number of common workloads of interes2012-08-20 02:07:01
431958Unclassifiedshell-toolsUNCONFIRMEDapp-shells/zsh-completion-20091203-r1 is broken because =sys-apps/portage-2.2.0_alpha121 does not in2013-01-28 08:57:32
431978Coredev-portageUNCONFIRMEDsys-apps/portage: FEATURES=preserve-libs missed dependency (libmpc.so.2) in /usr/libexec/gcc/x86_64-2012-12-25 20:59:53
432040Ebuildsmaintainer-wantedUNCONFIRMEDdev-libs/xdispatch - a event processing library (aka Grand Central Dispatch by Apple)2012-08-23 09:02:49
432112Core systemtoolchainUNCONFIRMEDsys-libs/libspe2 with ppc64 requires multilib install2012-09-14 22:21:15
432166Printingmaintainer-wantedUNCONFIRMEDEbuilds for Brother HL-2270DW LPR driver and CUPS wrapper2012-12-10 16:02:28
432224ApplicationsaleUNCONFIRMEDapp-admin/keepass - windows and dialogs have scrambled fonts2013-01-15 16:09:02
432326EbuildspatrickUNCONFIRMEDapp-emulation/virtualbox-guest-additions should add group "vboxsf" to support automount shared folde2012-10-23 10:19:47
432342EbuildsfloppymUNCONFIRMEDwww-client/google-chrome - wrapper does not respect $CHROMIUM_USER_FLAGS2012-08-23 00:47:10
432378Applicationsshell-toolsUNCONFIRMEDapp-shells/bash-completion - hard-coded path "/sbin/modinfo" in /usr/share/bash-completion/module-in2012-11-03 18:30:08
432418PrintingprintingUNCONFIRMEDnet-print/gutenprint should optionally support Epson printers2012-11-09 14:13:17
432564Ebuildsmaintainer-wantedUNCONFIRMEDapp-text/gtumbler - a graphical PDF manager2012-08-24 13:40:32
432588EbuildselvanorUNCONFIRMEDnet-voip/sflphone-1.0.1-r1 with net-libs/pjsip-1.8.10 (too old): sipaccount.cpp:612:17: error: ‘pjsi2012-08-24 13:48:14
432620Enhancement/Feature Requestspms-bugsUNCONFIRMEDdobin: automatic support of EXEEXT2012-08-24 18:51:54
432652Applicationsbase-systemUNCONFIRMEDnet-misc/dhcp - dhclient (ipv6) not enabled for ppp devices2012-12-02 10:22:16
432688Ebuildsmaintainer-wantedUNCONFIRMEDapp-shells/zsh-completions-0.6.0 - Additional completion definitions for Zsh2012-10-22 11:21:26
432884Ebuildspolynomial-cUNCONFIRMEDapp-emulation/virtualbox-modules: undeclared 'VM_RESERVED'2013-01-24 15:45:20
432908ApplicationsbluenessUNCONFIRMEDapp-admin/webapp-config-1.50.19: Allow precise declaration of server uid/gid in the configuration fi2012-09-30 16:18:23
432992Core - Ebuild Supportrobbat2UNCONFIRMEDsys-apps/portage-2.2.0_alpha121 breaks g-cpan (/etc/make.globals symlink is gone)2013-01-04 22:46:36
433004Applicationsmaintainer-neededUNCONFIRMEDapp-office/mdbtools version upgrade 0.7 now on git2012-08-28 10:48:54
433070KDEkdeUNCONFIRMEDapp-editors/kile-2.1.2-r1 - index.docbook:124: parser error : Entity 'ged.vertaald' not defined2013-02-17 22:53:14
433153ApplicationsramerethUNCONFIRMEDapp-emulation/ganeti should install logrotate config2012-09-03 11:31:29
433171ApplicationserasUNCONFIRMEDnet-proxy/squid - add epatch_user support2012-09-02 18:19:17
433457Core systemsystemdUNCONFIRMEDsys-apps/systemd should not store coredumps in its journal yet2012-10-27 21:52:30
433511Enhancement/Feature Requestsdev-portageUNCONFIRMEDadd multilib support (from portage multilib branch in git) to master branch2012-11-06 06:43:19
433515Prefix SupportprefixUNCONFIRMEDemerge app-doc/NaturalDocs-1.52 : request Prefix support2012-10-10 12:41:47
433531Prefix SupportprefixUNCONFIRMEDfox.eclass: request for Prefix support2012-09-29 14:02:59
433864Ebuildsmaintainer-wantedUNCONFIRMEDapp-misc/format-junkie - a program that can convert your media files (audio files, videos and pictur2012-09-10 17:00:15
433972Prefix SupportprefixUNCONFIRMEDapp-text/tree-1.6.0-r1: failed to compile on Mac OSX Mountain Lion2012-10-10 01:23:24
434024JavajavaUNCONFIRMEDwww-client/firefox-15.0, "click to play": Java applets don't work2012-09-20 09:38:49
434074KDEkdeUNCONFIRMEDkde-base/krossruby add ruby-1.9 support2012-09-07 13:39:08
434076KDEkdeUNCONFIRMEDkde-base/qtruby add ruby-1.9 support2012-09-07 14:02:46
434078KDEkdeUNCONFIRMEDkde-base/korundum add ruby-1.9 support2012-09-07 14:02:46
434090Core systemsystemdUNCONFIRMEDsys-apps/systemd - mount and df list devices multiple times2012-09-19 18:51:11
434110Applicationsrobbat2UNCONFIRMEDapp-admin/cancd-0.1.0-r2: netconsole init script fails to start due to wrong ifconfig path2012-09-06 14:20:31
434138ApplicationscjkUNCONFIRMEDapp-i18n/scim-1.4.14 breaks x11-wm/windowmaker's root window mouse actions2012-09-14 15:30:36
434366Ebuildsshell-toolsUNCONFIRMEDapp-text/pastebin: malfunctions because pastebin.com has changed their API2012-09-13 22:48:44
434410OpenRCopenrcUNCONFIRMED=sys-apps/util-linux-2.22 - hwclock shows/sets false time2013-01-26 19:05:36
434452EbuildstoolchainUNCONFIRMED[4.5/ICE] www-client/firefox-15.0.1 - .../work/mozilla-release/js/src/vm/ObjectImpl.cpp:485:1: inter2012-12-07 08:28:56
434496Toolstools-portageUNCONFIRMEDapp-portage/gentoolkit-0.3.0.6-r3 - equery crashes on unhandled exception portage.exception.InvalidD2012-09-10 06:45:50
434532OpenRCopenrcUNCONFIRMEDsys-apps/openrc - Unsafe Signal Handling?2012-09-18 21:01:49
434536Core systemtools-portageUNCONFIRMEDapp-portage/gentoolkit: revdep-rebuild doesn't handle USE=multislot2013-01-28 11:04:57
434574Toolstools-portageUNCONFIRMEDapp-portage/genlop: bashcomp script fails when make.conf is in /etc/portage/2012-12-13 16:13:07
434728Applicationsmaintainer-wantedUNCONFIRMEDapp-text/calibre-bin - binary version of app-text/calibre2012-09-13 15:09:28
434734Applicationsphp-bugsUNCONFIRMEDapp-doc/php-docs-20101029-r1 doesn't install anything except symlink2013-01-14 14:39:05
434828Ebuildsmaintainer-wantedUNCONFIRMEDapp-editors/gedit-collaboration-9999 - GNOME Text Editor Collaboration Plugin2012-09-18 23:55:14
434894ApplicationsbluenessUNCONFIRMEDapp-admin/webapp-config: Bad permissions for server-owned dirs (umask 022)2012-09-13 14:23:46
434900Ebuildspavel.stratil-junUNCONFIRMEDsys-apps/timer_entropyd-0.2 silently changed behavior2012-09-13 14:16:28
434902EbuildsultrabugUNCONFIRMEDapp-admin/rsyslog - add proper kerberos init.d script support2012-10-29 16:10:32
434904EbuildsultrabugUNCONFIRMEDapp-admin/rsyslog-5.8.11 - fix imgssapi plugin2012-10-29 16:10:37
434910ApplicationsbluenessUNCONFIRMEDapp-admin/webapp-config - various bug fixes2012-09-13 15:38:10
434914ApplicationsbluenessUNCONFIRMEDapp-admin/webapp-config: Manage recursive server-owned dirs independently2012-11-01 08:18:58
434916ApplicationsbluenessUNCONFIRMEDapp-admin/webapp-config, SELinux support: set 'server-owned' file as rw content2012-09-21 18:37:35
435024Ebuildsmaintainer-wantedUNCONFIRMEDsys-fs/diskdevcmds-540.1 - HFS and HFS+ utils ported from OSX, supplies mkfs and fsck2012-09-14 14:23:28
435044Prefix SupportprefixUNCONFIRMEDbootstrap-prefix.txt fails on comilation of portage/app-editors/nano-2.3.1-r22012-10-01 14:08:25
435086Core systemlu_zeroUNCONFIRMEDsys-apps/spu-tools-2.3.0.136 - version bump2012-09-16 14:40:23
435092GamesgamesUNCONFIRMEDgames-fps/quake2-data update - support expansion packs2012-09-15 04:21:45
435102Ebuildsmedia-videoUNCONFIRMEDmedia-video/vlc-9999 - 300_all_pic.patch fails to apply2012-09-18 20:17:27
435212BugzillabugzillaUNCONFIRMEDgentoo's bugzilla does not support xz compressed patches2012-11-28 14:34:32
435284Ebuildsmaintainer-wantedUNCONFIRMEDapp-text/pdf2htmlEX - A PDF to HTML converter2012-10-07 21:07:55
435304Unspecifiedrobbat2UNCONFIRMEDapp-portage/g-cpan-0.16.4-r1 generates broken ebuild depending on perl-g-cpan instead of dev-perl mo2013-02-21 07:50:32
435410Applicationsbase-systemUNCONFIRMEDapp-arch/zip-3.0: bzip2 flag broken, unicode flag broken, cross compilation broken2013-02-16 13:20:59
435442ApplicationsprintingUNCONFIRMEDapp-text/pdftk-1.44 - /usr/libexec/gcc/x86_64-pc-linux-gnu/4.7.1/ecj1: symbol lookup error: /usr/lib2012-09-18 19:33:09
435448EbuildsopenofficeUNCONFIRMEDapp-office/libreoffice 3.6.1.2 - .../work/libreoffice-core-3.6.1.2/workdir/unxlngx6.pro/CxxObject/co2012-09-20 18:39:47
435516Applicationsgnome-accessibilityUNCONFIRMEDapp-accessibility/accerciser-3.4.1 - /usr/lib/python2.7/site-packages/accerciser/plugin/base_plugin.2012-09-21 19:29:04
435528Prefix SupportprefixUNCONFIRMEDant-apache-bsf USE=javascript ~x64-macos prefix support2013-01-01 10:21:40
435534ApplicationsqemuUNCONFIRMEDapp-emulation/qemu-kvm-1.1.1-r1 - manual pages are not installed2012-11-30 12:14:46
435596Ebuildsmaintainer-wantedUNCONFIRMEDdev-ruby/rainbow - extension to ruby's String class adding support for colorizing text on ANSI termi2012-10-03 17:50:28
435602Ebuildsmaintainer-wantedUNCONFIRMEDdev-ruby/sourcify - Workarounds before ruby-core officially supports Proc#to_source (& friends)2012-10-03 17:54:40
435604Ebuildsmaintainer-wantedUNCONFIRMEDdev-ruby/trogdoro-el4r - Emacs Lisp Ruby bridge: extend Emacs with Ruby (or Ruby apps with Emacs Lis2012-10-03 17:46:09
435620ApplicationsspingUNCONFIRMEDapp-portage/fetchcommandwrapper-0.7.1 has path "/etc/make.conf" hardcoded2012-09-20 14:44:27
435674Applicationsmobile-phoneUNCONFIRMEDapp-mobilephone/gnome-phone-manager-0.68: phonemgr.c:47:2: error: too many arguments to function 'bl2012-12-18 08:29:47
435686Librarydev-zeroUNCONFIRMEDdev-libs/boost-1.49.0-r1 - In file included from [...] libs/date_time/src/gregorian/greg_month.cpp:12012-11-11 05:45:20
435712Ebuildsmaintainer-wantedUNCONFIRMEDnet-nntp/es-f-2.6.0 - web based HTML frontend for esniper, a lightweight console application for sni2013-01-23 03:27:50
435750ApplicationsxemacsUNCONFIRMEDapp-editors/xemacs-21.4.22-r2 crashes if syntax highlighting in current buffer is used2012-09-28 09:57:26
436062Developmentrobbat2UNCONFIRMEDapp-portage/g-cpan - perl-gcpan/RT-Extension-Nginx-0.02 - mkdir /usr/etc: Permission denied at /usr/2012-09-24 11:14:58
436122Ebuildsnet-dialupUNCONFIRMEDnet-dialup/ppp-2.4.5-r3 - Failed Patch: 80_all_eaptls-mppe-0.991-gentoo.patch !2012-11-09 04:09:40
436140GamesgamesUNCONFIRMEDgames-action/descent3 - updated ebuild to support installation from GOG package2012-09-24 22:54:46
436266OpenRCopenrcUNCONFIRMEDsys-apps/openrc-0.9.8.4: start in LXC brings down lxc-initialized interface2012-10-05 14:00:02
436290KDEkdeUNCONFIRMEDkde-base/okular-4.9.1 - hpcups[7483]: prnt/hpcups/HPCupsFilter.cpp 536: cupsRasterOpen failed, fd = 2013-01-10 19:35:12
436348EbuildstoveUNCONFIRMEDPlease stabilize =app-shells/zsh-5.0.22013-02-10 03:55:11
436458ApplicationstoveUNCONFIRMEDwww-apps/ikiwiki-3.20120725 img plugin depends on media-gfx/imagemagick[perl]2012-09-28 04:02:43
436500LibraryprintingUNCONFIRMEDapp-text/ghostscript-gpl with media-libs/freetype-2.4.10-r1 USE=infinality - ghostscript based appli2013-02-16 21:14:40
436536Applicationspolynomial-cUNCONFIRMEDnet-irc/xchat-2.8.8-r2 - patches that apply cleanly and fix several issues2012-09-29 15:32:27
436558Ebuildsoli.huberUNCONFIRMEDwww-apps/joomla-3.0.0 version bump2012-11-26 22:52:16
436594Core systembase-systemUNCONFIRMED>=sys-apps/memtest86+-2.00 should make use of/document "console="2012-09-29 15:40:51
436680ApplicationsbluenessUNCONFIRMEDapp-admin/webapp-config wrong permissions for vhost_perms_defaultowned_dir2012-10-01 00:54:40
436702ApplicationsgurligebisUNCONFIRMEDnet-wireless/wpa_supplicant - systemd unit does not configure ctrl_interface2012-11-18 13:03:00
436744Eclasses and ProfilesvimUNCONFIRMEDvim.eclass - add lua support2013-01-16 08:12:28
436898Prefix SupportprefixUNCONFIRMEDnet-misc/connect-100 Interix support2012-10-02 00:52:10
436958Ebuildsmaintainer-wantedUNCONFIRMEDapp-office/projectlibre - the open source replacement of Microsoft Project2013-01-18 18:28:23
436986Applicationsrobbat2UNCONFIRMEDapp-portage/g-cpan - perl-gcpan/Finance-QuoteHist-1.16 attempts to pull in perl-gcpan/Date-Manip, ig2012-10-02 17:09:49
436992GNOMEgnomeUNCONFIRMEDgnome-base/gvfs-1.12.3-r1 - /usr/share/applications/mount-archive.desktop: warning: key "Encoding" i2012-11-21 18:48:43
437056LibraryyngwinUNCONFIRMEDapp-admin/eselect-infinality - after setting to nyx, 43-repl-terminus.conf cannot be load2012-10-17 12:12:28
437106Ebuildsmaintainer-wantedUNCONFIRMEDapp-misc/stiki - a tool for reverting vandalism on Wikipedia2012-10-04 06:58:58
437176Applicationsx11UNCONFIRMEDx11-apps/xcalc-1.0.4.1 number keys stopped working2012-10-08 20:37:46
437350Applicationsnet-p2pUNCONFIRMEDnet-p2p/deluge-1.3.5 init.d script does not apply DELUGED_OPTS2013-01-26 06:26:03
437530EbuildschithanhUNCONFIRMEDapp-office/openoffice-bin-3.4.1 can't add font2012-10-07 15:19:15
437730Prefix SupportprefixUNCONFIRMEDapp-admin/augeas-0.10.0 will not build2012-10-09 14:47:54
437958ApplicationsxmwUNCONFIRMEDnet-misc/minidlna - add epatch_user support2012-10-11 13:47:33
437976Toolstools-portageUNCONFIRMEDProblems with "euse --active" from app-portage/gentoolkit-0.3.0.6-r32012-10-11 14:02:48
438084ApplicationspatrickUNCONFIRMEDwww-servers/apache-2.4 - add auth_form support2013-02-16 14:07:33
438086Applicationsweb-appsUNCONFIRMEDwww-apps/gallery-2.3.1 - "Begin Installation" fails with "The requested URL /gallery/install/
<
2012-10-12 16:43:46
438144Prefix SupportprefixUNCONFIRMEDdev-util/quilt-0.60 using app-misc/getopt2012-10-12 16:13:50
438164Unspecifiedpolynomial-cUNCONFIRMEDapp-emulation/virtualbox - EQ overflow in X server when virtualbox starts with Wacom tablet's mouse 2012-10-14 18:22:06
438262Core systemrobbat2UNCONFIRMEDsys-fs/lvm2-2.02.97 /etc/init.d/device-mapper does not support multi-line volumes in /etc/dmtab2013-01-28 12:11:27
438270ApplicationsxmwUNCONFIRMEDapp-backup/backintime should respect LINGUAS2012-10-14 18:13:30
438276ApplicationsbluenessUNCONFIRMEDapp-admin/webapp-config-1.50.19 - ignores vhost_config_dir value2013-02-17 00:47:25
438314Ebuildsvincent.hardy.beUNCONFIRMEDapp-crypt/eid-mw - misspelled metadata2012-10-15 11:09:16
438530ApplicationsmaksbotanUNCONFIRMEDx11-wm/awesome-3.4.13 USE=gnome - add application file for gdu-notification-daemon2013-02-06 12:31:57
438708ApplicationsroxUNCONFIRMED2012-10-17 14:29:58
438816Coredev-portageUNCONFIRMEDsys-apps/portage-2.1.11.9 : /var/tmp/portage/._unmerge_/ directory not cleaned up2012-10-18 17:51:53
438872ApplicationslackUNCONFIRMEDapp-admin/gkrellm - chart rendering bug2012-10-19 15:01:23
438930Ebuildspolynomial-cUNCONFIRMEDapp-emulation/virtualbox-4.2 USE=vnc - vnc module is built but not installed2012-12-21 18:07:10
438964OpenRCopenrcUNCONFIRMEDsys-apps/openrc-0.10.5 writes to /lib64/rc/console/2012-10-22 15:24:16
438986EbuildschutzpahUNCONFIRMEDapp-admin/salt-0.10.0 - error: file '.../work/impl_python3_2/salt-0.10.0/scripts/salt-master' does n2012-10-21 14:26:16
438996EbuildstoolchainUNCONFIRMEDsys-devel/binutils-2.23.51.0.x: gold/powerpc.cc:3255:1: error: prototype for 'typename elfcpp::Elf_t2012-12-29 21:25:21
439136OpenRCopenrcUNCONFIRMEDsys-apps/openrc beta testing2012-11-06 21:25:24
439164EbuildsultrabugUNCONFIRMED<=app-admin/rsyslog-5.8.12 USE=ssl undefined symbol: gcry_control2012-10-29 16:10:45
439280LibraryvadimkUNCONFIRMEDapp-emulation/vmware-modules-264.4 - missing return carriage in printk in VNetUserIfSetUplinkState()2012-10-23 10:12:15
439372Core systemjdhoreUNCONFIRMEDsys-apps/paludis[ruby-bindings] installs unslotted to latest ruby (actually 1.9) disregarding eselec2013-02-07 08:07:43
439406Ebuildsnet-p2pUNCONFIRMEDnet-p2p/amule - add epatch_user support2012-10-25 01:07:21
439540ApplicationscardoeUNCONFIRMEDapp-emulation/qemu fails to handle a usb serial port with a specific vendorid - qdev_prop_set: prope2013-02-10 17:43:13
439574SandboxsandboxUNCONFIRMEDsys-apps/sandbox-2.6 - sys-apps/coreutils-8.20 - (null)*(null) ../../sandbox-2.6/libsandbox/libsandb2012-12-21 23:38:54
439600Ebuildsmaintainer-wantedUNCONFIRMEDnet-print/cque - drivers and PPD files of CANON printers (CLC, ColorPASS, imagePASS, imagePRESS, ima2013-01-16 08:57:19
439614GNOMErobbat2UNCONFIRMEDsys-apps/vbetool-1.1: Failed Running automake2013-02-06 22:06:33
439676UnspecifiedvoyageurUNCONFIRMEDapp-i18n/ibus-qt-1.3.1 with clang 3.1 - qibusserializable.h:94:59: error: non-const lvalue reference2012-10-26 16:33:42
439700Ebuildsmaintainer-wantedUNCONFIRMEDapp-vim/evervim - a vim plugin for editing Evernote note's directly from vim2012-10-26 16:19:43
439702Core systembase-systemUNCONFIRMEDapp-admin/sudo - add USE=mail2013-01-03 04:09:16
439724ApplicationspythonUNCONFIRMED>app-editors/leo-4.9 USE =tk is not needed anymore2012-10-26 16:26:57
439754Ebuildsmaintainer-wantedUNCONFIRMEDsys-apps/inxi - A full featured system information script2012-11-19 17:19:20
439822Applicationsvserver-devsUNCONFIRMEDapp-backup/vzdump use "--rsyncable" gzip option2013-01-20 19:35:42
439844EbuildsaballierUNCONFIRMEDmedia-libs/stk-4.4.4 - In file included from RtAudio.cpp:6750:0: include/soundcard.h:106:28: fatal e2013-01-23 16:33:32
439894Applicationsapp-dictsUNCONFIRMEDapp-text/stardict - configure.ac:310: error: possibly undefined macro: AM_GCONF_SOURCE_22012-10-27 18:48:47
439912LiveCD/DVDlivecdUNCONFIRMEDapp-misc/livecd-tools-2.0.2: DHCP Broadcasting for IP not working2012-12-30 00:39:23
439920Core systemperlUNCONFIRMEDdev-lang/perl-5.12.4-r1 - pp.o: In function `Perl_pp_pow': pp.c:(.text+0x3a8a): undefined reference 2012-10-28 16:20:23
439964GNOMEgnomeUNCONFIRMED[gnome-overlay] app-text/evince: 3.7.1 version bump2012-10-28 16:08:13
439978Applicationsshell-toolsUNCONFIRMEDapp-shells/zsh-completion - please add additional completions for ebuild2012-10-29 03:50:21
440194Core systembase-systemUNCONFIRMEDsys-apps/microcode-data20120606_p2? (v2) version bump request2012-11-06 11:28:26
440286Ebuildsnet-fsUNCONFIRMEDnet-nds/rpcbind - add support for warm restarts of rpcbind daemon2013-01-10 20:33:08
440302EbuildsswegenerUNCONFIRMEDnet-irc/irssi - support static-libs and proxy USE flags2012-12-15 13:36:01
440414ApplicationsvimUNCONFIRMEDapp-editors/vim-7.3.409: some elog messages should only be shown right after the relevant use flag i2012-10-31 15:58:55
440420Toolsportage-utilsUNCONFIRMEDapp-portage/portage-utils-0.10: some elog messages should only be shown for the first install.2012-10-31 15:59:24
440426Applicationsmedia-opticalUNCONFIRMEDapp-cdr/dvd+rw-tools-7.1-r1: some elog messages should only be shown for the first install.2012-10-31 16:10:12
440428Applicationsshell-toolsUNCONFIRMEDapp-shells/bash-completion-1.3: some elog messages should only be shown for the first install.2012-10-31 16:10:30
440430Applicationsshell-toolsUNCONFIRMEDapp-shells/gentoo-bashcomp-20101217-r1: some elog messages should only be shown for the first instal2013-02-07 19:52:02
440440PrintingprintingUNCONFIRMEDapp-text/libpaper-1.1.24-r1: some elog messages should only be shown for the first install.2012-10-31 16:12:32
440454Applicationsx11UNCONFIRMEDx11-apps/xinit-1.3.2: some elog messages should only be shown for the first install.2012-10-31 16:14:56
440456Applicationsapp-dictsUNCONFIRMEDapp-text/aspell-0.60.6.1: some elog messages should only be shown for the first install.2012-10-31 16:15:12
440476Core systembase-systemUNCONFIRMEDapp-admin/sudo-1.8.5_p2: some elog messages should only be shown for the first install.2012-10-31 16:18:06
440532Applicationspolynomial-cUNCONFIRMEDapp-emulation/virtualbox-modules-4.1.22: some elog messages should only be shown when upgrading from2012-10-31 16:22:12
440542ApplicationsvimUNCONFIRMEDapp-editors/vim-core-7.3.409: some elog messages should only be shown when upgrading from an old eno2012-10-31 16:23:55
440556Core systembase-systemUNCONFIRMEDsys-apps/util-linux-2.21.2: some elog messages should only be shown when upgrading from an old enoug2012-10-31 16:24:34
440564ApplicationsvimUNCONFIRMEDapp-editors/vim-7.3.409: some elog messages should only be shown when upgrading from an old enough p2012-10-31 16:25:37
440566ApplicationsyngwinUNCONFIRMEDapp-vim/gentoo-syntax-20120109: some elog messages should only be shown when upgrading from an old e2012-10-31 16:25:57
440576ApplicationspatrickUNCONFIRMEDapp-benchmarks/phoronix-test-suite-4.0.1: some elog messages should only be shown when upgrading fro2012-10-31 16:26:55
440588ApplicationsswegenerUNCONFIRMEDapp-misc/screen-4.0.3-r5: some elog messages should only be shown when upgrading from an old enough 2012-10-31 16:28:30
441862ApplicationsalexxyUNCONFIRMEDsys-apps/gptfdisk-0.8.5 - In function `GPTPart::GetDescription()': gptpart.cc:(.text+0x179): undefin2013-02-12 11:55:19
441864ApplicationsvimUNCONFIRMEDapp-editors/vim-7.3.646 vim: stack smashing attack in function - terminated2012-11-05 13:04:29
441878LibraryyngwinUNCONFIRMEDx11-libs/cairo-1.12.6, 2013-01-11 18:30:33
441908Applicationsdev-zeroUNCONFIRMEDapp-emulation/spice-vdagent - add USE=selinux2012-11-05 18:59:35
442056Enhancement/Feature Requestsdev-portageUNCONFIRMEDAdditional checks for sanity of user-supplied *FLAGS variables in make.conf2012-11-06 16:12:29
442092ApplicationsspingUNCONFIRMEDmedia-gfx/gimp-9999 - Portage patch failed to apply (ltmain.sh version 2.4.2)!2012-11-10 00:24:49
442102genkernelgenkernelUNCONFIRMEDAdd bepo keymap support to genkernel2012-11-06 20:57:30
442220ApplicationsqtUNCONFIRMEDapp-editors/focuswriter - segmentation fault in Xfce42013-01-06 15:59:32
442294Ebuildsgnome-officeUNCONFIRMEDapp-office/dia-0.97.2 - Added support for >=gnome-3.002012-11-08 01:05:22
442388Ebuildsmaintainer-wantedUNCONFIRMEDapp-backup/storebackup - Storebackup is a backup suite that stores files on other disks.2012-11-08 23:28:56
442406Toolsportage-utilsUNCONFIRMEDapp-portage/portage-utils-0.10: 'qlop -c' should show current package order number2012-11-09 17:24:59
442534Ebuildsmaintainer-wantedUNCONFIRMEDapp-admin/puppetdb-1.0.2 ebuild request2012-11-10 22:53:28
442544Applicationsshell-toolsUNCONFIRMEDapp-shells/bash-completion-1.3 - No support for XZ compression with Okular.2012-11-11 16:23:59
442594OpenRCopenrcUNCONFIRMEDsys-apps/openrc-0.11.4: ifconfig module doesn't support ipv6 routes without explicit prefix2012-12-25 09:18:25
442610ServerhollowUNCONFIRMEDwww-servers/nginx - Feature support request for dav-ext-module.2012-11-26 20:05:19
442672Ebuildslu_zeroUNCONFIRMEDapp-emulation/qemu-user-9999 - Invalid git source.2012-11-11 17:11:10
442690baselayoutbase-systemUNCONFIRMEDsys-apps/baselayout - share.BSD/fstab device names have changed with FreeBSD 9.02012-11-12 22:39:21
442706ApplicationsultrabugUNCONFIRMEDapp-admin/rsyslog.service file does not work with newer sys-apps/systemd2012-11-22 08:33:40
442876Applicationspolynomial-cUNCONFIRMEDapp-emulation/virtualbox-4.2.4: after upgrade some VMs do not start anymore2013-01-02 19:55:58
442880EbuildssciUNCONFIRMED[science overlay] sci-libs/trilinos-10.12.2 - Version bump; install location fix; prefix support.2012-11-12 19:00:06
442984KDEkdeUNCONFIRMEDapp-office/calligra-l10n-2.5.3 does not compile.2012-11-15 14:52:36
443116Core systemjerUNCONFIRMEDsys-apps/lsb-release with sys-apps/baselayout-2.2 - /etc/os-release breaks lsb-release2013-01-10 17:47:52
443140EbuildscppUNCONFIRMEDdev-cpp/gccxml-0.9.0_pre20121114 version bump2012-11-14 21:10:19
443476Ebuildsmaintainer-wantedUNCONFIRMEDapp-admin/reprepro - Tool for creating a Debian APT repository with a pool structure2012-11-16 16:10:46
443480OpenRCopenrcUNCONFIRMEDsys-apps/openrc: iproute2 net module: add xfrm ( ipsec ) support2012-11-17 08:02:46
443498LibrarydilfridgeUNCONFIRMEDmedia-libs/opencv - python/src2/cv2.cpp:1: /usr/include/python2.7/pyport.h:849:2: ??????: #error "LO2013-02-04 22:23:56
443502EbuildssysadminUNCONFIRMEDnet-analyzer/nagios-plugins-1.4.16-r2 check_http Plugin does not support checking certificates2012-12-03 20:28:53
443534Applicationsx11UNCONFIRMEDx11-apps/xconsole-1.0.4 eats 100% CPU if -file option is used2012-11-16 18:57:33
443598Ebuildsweb-appsUNCONFIRMEDwww-apps/egroupware - Allow it to be build with PHP 5.4, it currently depends on php:5.3 through sql2013-02-16 21:35:19
443630ApplicationsselinuxUNCONFIRMEDSELinux + >app-emulation/libvirt-0.9.13-r1 - Segfault starting qemu domains.2013-02-16 18:03:09
443648ApplicationshannoUNCONFIRMEDapp-emulation/dosemu-1.4.1_pre20091009 hangs2012-11-17 18:49:41
443728EbuildshwoarangUNCONFIRMEDapp-laptop/prey-0.5.4-r1: /etc/init.d/prey-trigger is installed as invalid symlink, first run attemp2013-01-15 19:43:12
443744Toolstools-portageUNCONFIRMEDapp-portage/gentoolkit -- euse displays a lot of error messages on Gentoo/FreeBSD2012-11-19 09:11:08
443782HardenedhardenedUNCONFIRMEDapp-misc/cdrpager all versions buffer overflow2012-11-18 14:01:21
443804EbuildssystemdUNCONFIRMEDsys-apps/systemd should install python-systemd bindings2012-11-19 09:42:48
443910Ebuildsweb-appsUNCONFIRMEDwww-apps/dragonflycms-9.3.3.1 - download URL changed2012-11-19 11:41:01
443924ApplicationsfloppymUNCONFIRMEDnet-misc/remmina-1.0.0_p20121004 - When connecting to a RDP server, the icons appear white.2013-02-11 19:16:17
443932ApplicationsswegenerUNCONFIRMEDapp-misc/screen - add USE=static2012-11-19 19:43:25
443950Ebuildsgnome-mmUNCONFIRMEDdev-cpp/cairomm-1.10.0 USE="doc" installs documentation outside /usr/share/doc/$PF2012-11-19 20:31:56
444004Applicationsrobbat2UNCONFIRMEDapp-portage/g-cpan-0.16.4-r1 should use default $PORTDIR2013-02-15 13:12:08
444064Ebuildsx11UNCONFIRMEDvirtual/glu - sys-apps/paludis' cave fails to resolve a usable depset2012-11-20 18:00:08
444088Core systembase-systemUNCONFIRMEDsys-apps/texinfo-4.13 does hardcoded AR calls2012-11-20 19:10:56
444090Core systembase-systemUNCONFIRMEDsys-apps/sed-4.2.1 does hardcoded AR calls2012-11-20 19:11:18
444092Core systembase-systemUNCONFIRMEDsys-apps/groff-1.21 does hardcoded AR calls2012-11-20 19:11:37
444135Applicationsmaintainer-neededUNCONFIRMEDapp-misc/gpsdrive-2.11-r3 with boost-1.52.0-r3: /var/tmp/portage/app-misc/gpsdrive-2.11-r3/work/gpsd2013-01-11 19:10:30
444232Core systembase-systemUNCONFIRMEDsys-apps/coreutils: Add USE=hostname for those who do not want net-tools2012-11-27 05:09:49
444238Ebuildskernel-miscUNCONFIRMEDsys-kernel/linux-headers: Out of kernel builds seems not supported2012-11-23 04:59:46
444368Applicationsweb-appsUNCONFIRMEDwww-apps/lxr fails with current dev-db/mysql. Bump version to 1.0.0?2012-11-23 16:04:59
444394Core systemlu_zeroUNCONFIRMEDsys-apps/dtc-1.3.0-r1 - /usr/bin/install: cannot stat 'fdtdump': No such file or directory2012-12-21 15:58:17
444428Core systemppc64UNCONFIRMEDsys-devel/kgcc64: kill off usage for ppc systems2012-11-26 07:49:40
444448Third-Party Toolstools-portageUNCONFIRMEDapp-portage/genlop: 'genlop -i' should print last merge time too2012-11-23 15:57:18
444464Applicationspolynomial-cUNCONFIRMEDapp-emulation/virtualbox-4.1.22 - .../work/VirtualBox-4.1.22/src/VBox/Runtime/common/err/errmsg.sed 2012-12-23 18:15:49
444502ApplicationspatrickUNCONFIRMEDapp-benchmarks/phoronix-test-suite-4.0.1 - No matter what, it complains that PHP_TARGETS is empty2012-12-25 22:09:37
444524DevelopmentembeddedUNCONFIRMEDcrossdev: emerge-wrapper: arm-unknown-linux-gnueabi-emerge virtual/init fail becaus of missing USE-f2012-11-26 17:26:27
444564Applicationsdesktop-miscUNCONFIRMEDapp-misc/geoclue-0.12.99 should conditionally depend on dev-util/gtk-doc only if USE=doc2012-11-24 15:53:43
444602ApplicationsvirtualizationUNCONFIRMEDapp-emulation/virtinst-0.600.3 - Exception in thread Checking storage allocation2013-02-16 18:03:56
444610OpenRCopenrcUNCONFIRMEDsys-apps/openrc output is unfriendly on high resolution/wide monitors2012-11-24 19:46:03
444660Ebuildssci-geosciencesUNCONFIRMEDsci-geosciences/mapserver - add www-servers/nginx support(?)2012-12-02 12:31:33
444692ApplicationsxmwUNCONFIRMEDnet-misc/aiccu systemd support2012-12-27 21:50:10
444742ApplicationskernelUNCONFIRMEDnet-fs/autofs-5.0.6-r3 unable to mount NFS on HPPA: do_mount_indirect: path to be mounted is to long2013-02-06 04:36:10
444756Developmentmaintainer-wantedUNCONFIRMEDdev-ruby/rails-api - Rails for API only applications2012-11-26 19:00:29
444762Core systemtoolchainUNCONFIRMEDsys-devel/gcc-4.6.3: multilib libjava wants 32bit jack (app-emulation/emul-linux-x86-soundlibs)2013-01-02 01:03:40
444798Ebuildsdeb-toolsUNCONFIRMEDapp-arch/dpkg should create a /etc/dpkg/origins directory and appropriate files2013-02-20 19:39:52
444808Applicationsandreis.vinogradovsUNCONFIRMEDapp-misc/hivex-1.3.6-r2 USE=ruby - rake aborted! / / cannot load such file -- rake/rdoctask2012-12-05 04:45:09
444918FreeBSDbsdUNCONFIRMEDapp-arch/libarchive-3.0.4-r1 -- getvfsbyname failed error occurs, doesn't work in x86 chroot on amd62013-01-15 12:22:54
444932genkernelgenkernelUNCONFIRMEDsys-kernel/genkernel-3.4.45: no rtc support with newer kernels2013-02-20 03:36:21
444934genkernelgenkernelUNCONFIRMEDsys-kernel/genkernel-3.4.45: no support for iptables target LOG with gentoo-sources-3.5.72012-12-13 12:03:26
444936ApplicationsmatsuuUNCONFIRMEDwww-apps/redmine creates keepdir /var/run/redmine2012-12-10 13:49:46
445004Ebuildsmaintainer-wantedUNCONFIRMEDapp-text/sgml-base - SGML infrastructure and SGML catalog file support2012-11-27 22:29:18
445014Ebuildsmaintainer-wantedUNCONFIRMEDdev-libs/xml-core - XML catalog infrastructure support2012-11-30 22:13:51
445248Applicationstools-portageUNCONFIRMEDapp-portage/genlop-0.30.8-r2 - Package name comes too late.2012-11-30 12:00:23
445280Ebuildsmaintainer-wantedUNCONFIRMEDmedia-libs/avbin-bin - New package. - AVbin is a binary release of a cross-platform, thin wrapper ar2012-12-09 09:27:38
445298Ebuildsmaintainer-wantedUNCONFIRMEDapp-admin/kpcli-1.6.ebuild (New Package)2012-11-30 16:04:02
445370Ebuildsmaintainer-wantedUNCONFIRMEDapp-emacs/visual-basic-mode - VisualBasicMode2012-12-01 05:25:21
445396Ebuildsmaintainer-wantedUNCONFIRMEDapp-text/debiandoc-sgml - DebianDoc SGML DTD and formatting tools2012-12-04 21:26:44
445492ApplicationsnirbheekUNCONFIRMEDgnome-extra/nm-applet-0.9.6.4 leaks memory2012-12-01 16:22:15
445540ApplicationstomjbeUNCONFIRMED>=app-backup/bacula-5.0.3 - Upstream doesn't officially support SQLite.2012-12-03 05:48:57
445550ApplicationsalexxyUNCONFIRMEDwww-apps/rutorrent-3.4-r1: outputs garbage to Apache error.log if PHP is running in strict mode2012-12-02 06:13:37
445570Applicationsdesktop-wmUNCONFIRMEDx11-wm/icewm - Displays black instead of icons (for some apps).2012-12-03 06:01:49
445594Core systembluenessUNCONFIRMEDsys-apps/coreutils - FAIL: tests/cp/fiemap-FMR.sh - Fails src_test with -march=native : valgrind "un2013-02-12 03:34:41
445614Ebuildsmaintainer-wantedUNCONFIRMEDapp-editors/retext - New package. - Qt-based text-editor for Markdown written in Python2013-01-02 12:40:40
445712Libraryx11UNCONFIRMEDapp-emulation/emul-linux-x86-opengl-20121202 does not install /us/lib32/libGLU.so.12013-01-23 19:53:52
445744Core systembase-systemUNCONFIRMEDsys-apps/hprofile - Add patch for improving init file.2012-12-04 15:09:20
445820OpenRCopenrcUNCONFIRMEDsys-apps/openrc-0.11.6 don't populate /sys in Linux Container2013-02-18 19:02:42
445878ApplicationsfontsUNCONFIRMEDapp-i18n/unicode-data should not depend on Debian sources2012-12-04 15:39:11
445902Libraryx11UNCONFIRMEDapp-emulation/emul-linux-x86-opengl-20121202{,-r1} makes some wine programs very sluggish2013-01-11 11:54:06
445990Ebuildsmaintainer-wantedUNCONFIRMEDsys-apps/apt - Debian commandline package manager2012-12-05 04:14:13
446016LibrarypythonUNCONFIRMEDdev-python/python-gnutls-1.2.4 does not support >=net-libs/gnutls-32012-12-05 01:13:29
446204Core systemvapierUNCONFIRMEDsys-devel/crossdev: cross-emerge: support multiple parallel SYSROOTs for a single target2012-12-06 22:15:24
446275KDEkdeUNCONFIRMEDpython ABI deps support for system-config-printer-kde and printer-applet2012-12-11 14:07:52
446312ApplicationsxmwUNCONFIRMEDapp-shells/autojump-21.1.0 causes startDM.sh to segfault during system start2013-01-25 08:51:42
446344Core - Interface (emerge)dev-portageUNCONFIRMEDsys-apps/portage - `emerge --info' should include the rc_sys value of /etc/rc.conf2012-12-07 15:47:17
446424Applicationsmaintainer-neededUNCONFIRMEDapp-misc/gpsdrive-2.11-r3[mapnik] - In file included from ..., .../gpsdrive-2.11/src/mapnik.cpp:11: 2013-01-03 18:33:04
446498Core - Configurationdev-portageUNCONFIRMEDsys-apps/portage should handle typos in make.conf like those at the command line2012-12-08 17:10:05
446606OpenRCopenrcUNCONFIRMEDsys-apps/openrc: Routing policy rules need to be set before routes2013-01-15 20:33:29
446614ApplicationsvadimkUNCONFIRMEDapp-emulation/vmware-workstation-9.0.1.894247 - vmui| I120: SymBacktrace[0] 00007fff80c53fc0 rip=0002013-02-13 10:37:51
446680Ebuildsmaintainer-wantedUNCONFIRMEDsys-fs/snapper - a tool for managing btrfs snapshots2013-02-13 15:38:41
446682Applicationsamd64UNCONFIRMEDapp-emulation/emul-linux-x86* - new libraries for steam platform2013-02-20 22:44:38
446698LibrarytoolchainUNCONFIRMEDdev-libs/ppl-1.0 version bump request2013-02-05 08:27:08
446796ApplicationsprefixUNCONFIRMEDapp-misc/pax-utils: src_install tries to compile stuff2013-01-02 17:41:59
446828Applicationsrobbat2UNCONFIRMEDnet-analyzer/sslsniff-0.8-r1 - conftest.cpp:21:26: fatal error: boost/asio.hpp: No such file or dire2012-12-11 22:11:50
446892ApplicationsopenofficeUNCONFIRMEDapp-office/libreoffice-bin-3.6.3.2 - Conditional formatting in Calc cells disappears2013-01-02 06:17:09
446974Ebuildsmaintainer-wantedUNCONFIRMEDdev-libs/libpreludedb, app-admin/prelude-manager, net-analyzer/prewikka resurrection request2012-12-27 21:31:08
447006Enhancement/Feature Requestsportage-utilsUNCONFIRMEDapp-portage/portage-utils' "qgrep" should parse multiple args over entire file for broader search re2012-12-12 17:20:02
447064ApplicationssgmlUNCONFIRMEDapp-text/build-docbook-catalog - file:///etc/xml/docbook:1: parser error : Document is empty2012-12-13 16:31:25
447078ApplicationsforensicsUNCONFIRMEDapp-forensics/rkhunter should depend on sys-process/lsof[rpc]2012-12-13 16:25:01
447192Ebuildsmaintainer-wantedUNCONFIRMEDapp-admin/logstash - a tool for managing events and logs2013-02-02 04:42:43
447194Ebuildsmaintainer-wantedUNCONFIRMEDapp-misc/wiimotedev-1.4.0 - Wii Remote utilities2012-12-15 08:58:36
447246KDEkdeUNCONFIRMEDkde-misc/kolor-manager-0.99 crashes when media-libs/oyranos-0.9.1 is built against app-admin/elektra2013-02-10 22:35:46
447266Ebuildsmaintainer-wantedUNCONFIRMED=app-text/ghostpdl-9.06 - New package. - GhostPCL, GhostXPS, Ghostscript and GhostPDF Interpreters2012-12-14 23:49:32
447280HardenedhardenedUNCONFIRMEDsys-apps/haveged readd support2012-12-14 20:01:22
447302Applicationspolynomial-cUNCONFIRMEDapp-emulation/virtualbox-modules-4.2.4 with gentoo-sources-3.7.0 - Header files were moved and re-or2013-02-03 19:32:07
447352Unspecifiedmaintainer-neededUNCONFIRMEDapp-laptop/tp_smapi-0.41 with kernel 3.7 - modprobe: FATAL: Error inserting tp_smapi (/lib/modules/32013-01-02 20:30:53
447356Unspecifiedpolynomial-cUNCONFIRMEDapp-emulation/virtualbox-modules-4.2.4 with kernel 3.7 - modprobe: FATAL: Error inserting vboxdrv (/2013-02-14 10:04:16
447396ServerxmwUNCONFIRMEDapp-admin/bcfg2-1.2.3: missing RDEPEND on dev-python/nose2012-12-15 20:27:44
447408DevelopmentvoyageurUNCONFIRMEDsys-devel/llvm-3.1r2 - X86ELFWriterInfo.cpp:85:1: interner Compiler-Fehler: Speicherzugriffsfehler2012-12-22 12:30:47
447436Applicationstools-portageUNCONFIRMED=app-portage/genlop-0.30.8-r2 - Use of uninitialized value in concatenation (.) or string at /usr/b2012-12-17 07:12:11
447530Ebuildsbase-systemUNCONFIRMEDnet-firewall/iptables[netlink] - please add support for loading fingerprint definitions from pf.os f2013-02-16 14:09:37
447534Applicationspolynomial-cUNCONFIRMEDapp-emulation/virtualbox-4.1.22-r1 - VBox/Runtime/common/string/strformatrt.cpp:829:19: internal com2012-12-23 18:30:14
447538Toolstools-portageUNCONFIRMED=app-portage/gentoolkit-0.3.0.7: equery doesn't report package description2012-12-17 01:10:30
447548Core systemjlecUNCONFIRMEDsys-apps/kexec-tools-2.0.3-r1 - bashism in init.d script2012-12-17 18:54:55
447614Ebuildshd_brummyUNCONFIRMEDapp-misc/iguanaIR-1.0.3 version bump2012-12-17 18:53:44
447656KDEkdeUNCONFIRMEDxinput --map-to-output 10 (pointer device) VGA1 (crtc) text cursor disappears and doesn't reappear u2012-12-28 13:57:55
447678OpenRCopenrcUNCONFIRMEDsys-apps/openrc-0.11.8 - rm: cannot remove /run/openrc: Read-only file system2012-12-19 17:54:11
447796Prefix SupportprefixUNCONFIRMEDsys-apps/util-linux-2.20.1: fails to emerge2012-12-19 09:19:08
447812Keywording and Stabilizationmaintainer-neededUNCONFIRMEDapp-doc/gimp-help-2.6.1 stable request2013-02-16 13:26:25
447882Keywording and Stabilizationweb-appsUNCONFIRMEDKeyword request: Please add the sparc keyword to www-apps/gallery2012-12-20 14:52:24
447970Core systemsandboxUNCONFIRMEDsys-apps/sandbox makes autoconf's getcwd long path test take hours2013-01-31 14:19:12
448016Ebuildsmaintainer-wantedUNCONFIRMEDapp-misc/hardening-wrapper - New package. - Compiler wrapper to enable security hardening flags2012-12-26 21:51:22
448024Core systemtoolchainUNCONFIRMEDdev-libs/cloog-ppl-0.15.10 fails with >=dev-libs/ppl-1.02013-01-07 00:30:36
448062ApplicationswilliamhUNCONFIRMEDapp-accessibility/speech-dispatcher-0.7.1-r1 src_compile(): mv: cannot stat '.deps/spd_audio.Tpo': N2013-01-01 12:02:28
448098KDEx11UNCONFIRMEDx11-base/xorg-server-1.13 x11-apps/xinput - xinput --map-to-output 10 (keyboard related id) VGA1 (an2013-01-02 09:11:39
448130ApplicationsopenofficeUNCONFIRMEDapp-office/libreoffice-3.6.4.3 - /usr/lib64//libclucene-core.so: undefined reference to `std::__deta2012-12-27 07:54:58
448138Coredev-portageUNCONFIRMEDsys-apps/portage no longer works with dev-lang/python-2.52012-12-22 07:22:48
448152Applicationslu_zeroUNCONFIRMEDapp-emulation/qemu-user-1.0 should depend on sys-apps/usbredir[static-libs]2012-12-24 16:15:07
448206Core systemlu_zeroUNCONFIRMEDflag-o-matic.eclass: `CHOST=${CTARGET} strip-unsupported-flags` doesn't strip flags2013-01-07 17:18:12
448208EbuildsvoyageurUNCONFIRMEDsys-devel/{llvm,clang} support for C++11 (both), doxygen docs and python (clang) USE flags2013-02-02 22:02:57
448268Core systembase-systemUNCONFIRMEDsys-apps/less-457 should use elog instead of einfo2012-12-24 08:32:38
448294Applicationspolynomial-cUNCONFIRMEDapp-emulation/virtualbox-4.2.6: cannot open shared object libstdc++.so.62012-12-24 10:19:17
448316Ebuildsdev-zeroUNCONFIRMEDapp-emulation/spice: error BadMatch request X_SetInputFocus2012-12-25 16:38:18
448334Core systembase-systemUNCONFIRMEDsys-apps/hdparm: add support for disk id in /etc/init.d/hdparm2013-01-09 18:41:41
448342GNOMEgnomeUNCONFIRMED[gnome-overlay] =app-admin/gnome-system-tools-3.0.0: undefined reference to `g_thread_init'2012-12-23 23:45:59
448472ApplicationsvimUNCONFIRMEDapp-editors/gvim - segmentation fault when using clang_complete2012-12-25 15:39:05
448658ApplicationscjkUNCONFIRMEDapp-i18n/nabi-0.99.11 version bump2012-12-26 23:42:29
448742Ebuildsmaintainer-neededUNCONFIRMEDapp-misc/multimon-1.0-r3: fails to build2013-01-12 22:37:15
448764ApplicationsopenofficeUNCONFIRMEDapp-office/libreoffice-3.6.4.3 fails with dev-libs/boost-1.52.0-r5 (bug 425356 strikes again!)2012-12-27 05:37:52
448770GNOMEgnomeUNCONFIRMED[gnome overlay] app-accessibility/at-spi2-atk-9999 fails to build due to failed patch "at-spi2-atk-2012-12-27 05:56:05
448802OpenRCopenrcUNCONFIRMEDsys-apps/openrc-0.11.8 - udhcpc client should set "search" option in resolv.conf2012-12-27 21:21:17
448830LibraryqtUNCONFIRMEDx11-libs/qt-openvg-4.8.4 - qpaintengine_vg.cpp:3212:5: error: narrowing conversion of ‘d->QVGPaintEn2013-02-17 11:26:14
448874Applicationsgnome-officeUNCONFIRMEDapp-office/glabels-3.0.1: /usr/include/evolution-data-server-3.6/libebook/e-contact.h:10:2: error: #2013-02-16 20:05:55
448894DevelopmentgnomeUNCONFIRMEDapp-mobilephone/gnome-phone-manager-0.68 : Only should be included directly2012-12-27 23:08:41
448962EbuildselvanorUNCONFIRMEDx11-libs/hippo-canvas description should say "GTK+ 2" not "GTK+-2"2012-12-28 14:40:54
448988LibraryswaponUNCONFIRMEDnet-libs/gsoap should support USE=ntlm2012-12-28 14:47:42
449032Serverweb-appsUNCONFIRMEDwww-apps/ampache-3.5.* needs additional dependency < dev-lang/php-5.42012-12-28 21:06:13
449034Ebuildsmaintainer-wantedUNCONFIRMEDNew package: app-backup/insync-bin-0.9.32 - Advanced cross-platform Google Drive client2012-12-28 14:36:13
449042Applicationsx11UNCONFIRMEDxorg-server, tslib, xinput - Pointer reappears in lower right hand corner after touchscreen tap foll2013-01-03 06:09:45
449116EbuildsdanielpiUNCONFIRMEDapp-accessibility/julius::sunrise and sci-libs/fplll::sage-on-gentoo both install /usr/bin/generate2012-12-29 11:48:00
449132ApplicationschutzpahUNCONFIRMED>=app-admin/salt-0.11.0 does not install config template files2012-12-29 11:40:31
449166ApplicationscjkUNCONFIRMEDapp-i18n/ibus-table-1.4.99 version bump2013-02-12 09:54:43
449202Keywording and StabilizationaballierUNCONFIRMED=app-text/ps2pkm-1.5_p20120701: please stabilize2012-12-29 15:32:06
449212ApplicationstitanofoldUNCONFIRMEDapp-office/odeskteam-3.6.1 version bump2012-12-29 17:14:26
449298Keywording and StabilizationtexUNCONFIRMED=app-text/texlive-2012: please stabilize2013-01-21 17:21:51
449354ApplicationsqemuUNCONFIRMEDapp-emulation/qemu-guest-agent fails to shutdown the guest2013-01-01 20:32:37
449436Applicationspolynomial-cUNCONFIRMEDapp-emulation/virtualbox-4.1.22-r1 - Checking for Mesa / GLU: Mesa not found at -L/usr/X11R6/lib 2012-12-31 16:33:12
449470Core systemjdhoreUNCONFIRMEDsys-apps/lm_sensors-3.3.3-r1 init.d/sensord tries to run /usr/sbin/sensorsd instead of /usr/sbin/sen2013-02-02 12:22:54
449474Librarymaintainer-wantedUNCONFIRMEDdev-tex/fontpro - LaTeX support for Adobe's Pro opentype fonts2013-01-11 22:14:05
449512Third-Party ToolsdolsenUNCONFIRMEDapp-portage/porthole with python3 - File "/usr/lib/portage/pym/portage/__init__.py", line 224, in __2013-02-10 22:16:25
449720Core systemferringbUNCONFIRMEDsys-apps/pkgcore-0.8.6: SyntaxError during compilation of Python modules for Python 3.22013-01-02 10:12:25
449730Prefix SupportprefixUNCONFIRMEDapp-misc/fixdos: ~x64-macos and ~x86-linux prefix support2013-01-02 07:49:42
449732Prefix SupportprefixUNCONFIRMEDapp-misc/getopt: ~x86-linux prefix support2013-01-02 08:35:00
449776Serverldap-bugsUNCONFIRMEDnet-nds/openldap - add support for slapd-mdb backend2013-01-03 00:24:21
449780ApplicationssoundUNCONFIRMEDmedia-sound/exaile should support USE=dbus2013-01-03 00:19:45
449786Prefix SupportprefixUNCONFIRMEDPlease keyword dev-perl/Exporter-Lite and dev-perl/Sys-CPU on ~ppc-macos2013-01-02 17:26:29
449794Ebuildsmaintainer-wantedUNCONFIRMEDapp-emulation/tilem-2.0 - an emulator and debugger for Texas Instruments Z80-based graphing calculat2013-01-03 00:16:42
449822Third-Party Toolstools-portageUNCONFIRMEDapp-portage/genlop - genlop -itc shows two emerge jobs when it is only one2013-01-03 00:07:55
449888KDEkdeUNCONFIRMEDapp-text/poppler-0.20.4 - In file included from .../work/poppler-0.20.4/qt4/src/poppler-page.cc:36: 2013-01-17 13:59:17
449950Applicationsnet-dialupUNCONFIRMED=net-dialup/pptpd-1.3.4-r1 incorrect restart: no matching processes found2013-01-17 06:58:53
450068Ebuildsmaintainer-wantedUNCONFIRMEDsys-apps/evemu - Tools and bindings for kernel input event device emulation, data capture and replay2013-01-03 23:06:27
450076ApplicationsalexxyUNCONFIRMEDapp-text/fbreader build fails2013-01-15 00:43:45
450080ApplicationsprintingUNCONFIRMEDapp-text/pdftk-1.45 version bump2013-01-21 15:08:02
450248ApplicationsalonblUNCONFIRMEDapp-laptop/laptop-mode-tools-1.62: /usr/sbin/laptop_mode: line 239: .: /etc/laptop-mode/conf.d/board2013-02-10 19:55:43
450326OpenRCopenrcUNCONFIRMEDsys-apps/openrc has no support for DHCPv62013-01-22 22:12:52
450340GNOMEgnomeUNCONFIRMEDgnome-extra/hamster-applet-2.32.1 possibly has wrong RESTRICT_PYTHON_ABIS2013-01-06 22:38:36
450444EbuildsqtUNCONFIRMED[qt overlay] dev-util/gammaray - Tool to poke around in a Qt-application and also to manipulate the 2013-02-06 04:07:10
450512Prefix SupportprefixUNCONFIRMEDmedia-gfx/graphite2: Undefined symbols for architecture ppc2013-02-02 15:39:11
450536ServerhwoarangUNCONFIRMEDnet-ftp/vsftpd-3.0.2 prints warning: `vsftpd' uses 32-bit capabilities (legacy support in use) in ke2013-01-15 23:14:17
450664Applicationsx11UNCONFIRMEDapp-emulation/wine-1.4.1 with >=x11-base/xorg-server-1.11 - mouse behaves erratically2013-01-08 04:22:22
450680Serverweb-appsUNCONFIRMEDwww-apps/egroupware - insufficient dev-lang/php USE dependencies2013-02-16 21:29:53
450776HardenedhardenedUNCONFIRMEDapp-emulation/wine-1.5.21 - configure: checking for -lGL... ./conftest: error while loading shared l2013-02-11 21:23:57
450876ApplicationslxnayUNCONFIRMEDapp-admin/packagekit-base-0.7.4 should build verbosely2013-01-08 14:07:16
450946Ebuildsmaintainer-wantedUNCONFIRMEDapp-vim/syntastic - vim plugin: Syntastic is a syntax checking plugin that runs files through extern2013-01-08 20:07:20
451080Enhancement/Feature Requestsdev-portageUNCONFIRMEDsys-apps/portage emerge.log should record fetch time2013-01-10 17:15:32
451326Corelu_zeroUNCONFIRMEDapp-emulation/qemu-user-1.1.0-r1: "qemu: Unsupported syscall: 373" for epoll syscall inside arm chro2013-01-20 17:32:15
451340Ebuildsmaintainer-wantedUNCONFIRMEDapp-office/elyxer: a LyX to HTML converter2013-01-11 16:28:57
451400Applicationsapp-dictsUNCONFIRMEDapp-dicts/wordnet with dev-lang/tcl-8.6.0 - replace interp -> result by call to Tcl_SetResult() rout2013-02-01 06:55:10
451478Core systemrobbat2UNCONFIRMEDsys-fs/lvm2 - /etc/init.d/lvm should support multiple volume groups - Command failed with status cod2013-01-31 02:20:00
451582LibraryopenofficeUNCONFIRMEDdev-cpp/libcmis-0.3.0 and dev-cpp/libcmis-0.2.3-r1 collision: /usr/share/man/man1/cmis-client.1.xz2013-01-14 22:34:27
451584ApplicationscardoeUNCONFIRMEDapp-emulation/libvirt-1.0.1 - does not start LXC VM2013-02-05 17:25:51
451622Core systembase-systemUNCONFIRMEDsys-apps/man-db-2.6.3-r1[nls]: Translated manpages will not be installed if app-text/po4a is not ins2013-01-15 12:05:38
451700ApplicationsopenofficeUNCONFIRMEDapp-office/libreoffice-4.0.0.1 - .../work/libreoffice-4.0.0.1/workdir/unxlngx6.pro/CxxObject/writerf2013-01-15 17:25:30
451776ApplicationsopenofficeUNCONFIRMEDapp-office/libreoffice - add USE=lto2013-01-15 12:15:20
451966Applicationsrobbat2UNCONFIRMEDapp-misc/g15daemon start-stop-daemon: fopen `/var/run/g15daemon.pid': No such file or directory2013-01-15 12:27:28
451978ApplicationsnaotaUNCONFIRMEDmedia-video/v4l2loopback-0.6.2 - Version bump to support kernel 3.72013-01-14 22:49:56
451990LibraryemacsUNCONFIRMEDapp-emacs/python-mode-6.1.0 should install autopair2013-01-15 12:34:04
452178Core systemvapierUNCONFIRMEDapp-misc/pax-utils: w/python3: lddtree.py passes unicode buffers to pyelftools which expects byte bu2013-01-19 16:49:01
452608ApplicationspdaUNCONFIRMEDapp-pda/gtkpod-2.1.3-r1 with dev-util/anjuta-3.4.3 - In function ‘on_layout_lock_toggle’: anjuta-act2013-02-01 22:49:13
452630OpenRCbase-systemUNCONFIRMEDsys-apps/openrc - /etc/sysctl.conf not respected2013-02-16 23:07:26
452776OpenRCopenrcUNCONFIRMEDsys-apps/openrc-0.11.*: system fails to shutdown with automount+nfs2013-02-16 13:44:26
452800Ebuildsmaintainer-wantedUNCONFIRMEDapp-office/gnuaccounting - a Free Java cross-platform accounting and bookkeeping application2013-01-19 16:41:10
452828HardenedhardenedUNCONFIRMEDsys-apps/util-linux-2.21.2 - dmesg: *** glibc detected *** dmesg: double free or corruption (!prev):2013-01-18 16:31:50
452850Ebuildsmaintainer-wantedUNCONFIRMEDwww-apps/snorby - Ruby on Rails application for network security monitoring2013-01-18 17:12:00
452910Core systemsystemdUNCONFIRMEDsys-apps/systemd-196[python] needs dev-python/pygobject:3 - ImportError: No module named gi.reposito2013-01-20 17:07:04
453122ApplicationsperlUNCONFIRMEDPlease stabilize =app-text/po4a-0.42 (was: 0.38 misparses CDATA section)2013-02-19 20:59:42
453264All ISOreleaseUNCONFIRMEDFirewire hard drive support missing from Alpha install CD2013-01-21 01:54:43
453278Core systemsystemdUNCONFIRMEDsys-apps/systemd - please port netcfg from Arch Linux for easier network configuration2013-01-21 20:21:49
453418ApplicationsvimUNCONFIRMEDapp-editors/vim-core-7.3.762 Opened file gets modified when mapping g to some other value2013-01-22 02:03:25
453500ApplicationsbircophUNCONFIRMEDapp-doc/root-docs-5.34.03 - Error: Function Open(filename,"RECREATE") is not defined in current scop2013-02-19 19:12:58
453516ApplicationspatrickUNCONFIRMEDapp-emulation/virtualbox-bin-4.2.6 - can not use Bridged Adapter in network config2013-01-23 14:33:55
453584EbuildstoveUNCONFIRMEDapp-shells/zsh - prompt_gentoo_setup: replace globally declared variables with local variables2013-01-24 09:42:42
453614Core systemrobbat2UNCONFIRMEDsys-apps/linux-misc-apps-3.6-r1 installs two copies of cpupower2013-01-27 11:41:47
453658Ebuildsmaintainer-wantedUNCONFIRMEDdev-util/jenkins - application that monitors executions of repeated jobs, such as building a softwar2013-01-30 11:30:11
453674Third-Party Toolstools-portageUNCONFIRMEDapp-portage/ufed: Shortening/cleaning flag descriptions by eliminating "[Enables/Adds/Includes] Supp2013-01-23 13:44:40
453696GNOMEgnomeUNCONFIRMEDapp-text/evince-3.6.1 should depend on >=x11-libs/gtk+-3.4:32013-01-23 16:50:49
453774Third-Party Toolstools-portageUNCONFIRMEDapp-portage/genlop-9999: -u option does not filter2013-01-24 08:29:43
453802Keywording and StabilizationwineUNCONFIRMEDapp-emulation/winetricks stable request2013-01-24 15:05:15
453834Unclassifieddev-portageUNCONFIRMEDsys-apps/portage-2.1.11.xy - (anger at) handling of dir symlinks2013-01-24 20:23:11
453894ApplicationsflameeyesUNCONFIRMEDnet-misc/lksctp-tools-1.0.12 - src/apps/sctp_darn.c:1870: undefined reference to `sctp_connectx'2013-01-26 01:40:32
453918ApplicationsxmwUNCONFIRMED=app-admin/conkyforecast-2.24 with conky-1.9.0-r1 - `conkyForecastWU --datatype=WI` - conkyForecastW2013-02-10 16:49:05
453954DevelopmentpythonUNCONFIRMEDdev-python/psycopg - add python 3.3 support2013-01-26 15:33:56
453964ApplicationsyngwinUNCONFIRMEDapp-admin/eselect-lcdfilter fails to remove symlink /etc/env.d/99lcdfilter@ upon removal.2013-01-26 15:34:37
453966ApplicationsmatsuuUNCONFIRMEDwww-apps/redmine-2.2.0 should depend on dev-ruby/fastercsv2013-01-30 10:10:19
454062Applicationsshell-toolsUNCONFIRMEDapp-misc/byobu-5.27 - create window failed: /bin/bash no such file or directory2013-02-06 16:13:05
454120OpenRCopenrcUNCONFIRMEDsys-apps/openrc-0.11.8: Service XY stop makes other services stop, but consequent start of XY leaves2013-01-26 09:43:51
454196Core systembase-systemUNCONFIRMEDsys-apps/groff-1.22.1 installs broken symbolic link - /usr/share/doc/groff-1.22.1/pdf/mom-pdf.pdf: b2013-01-26 18:20:42
454208LibraryyngwinUNCONFIRMEDx11-libs/cairo-1.12.10 - breaks claws-mail (still applies for -r1,-r2)2013-02-07 00:31:58
454266Keywording and Stabilizationrobbat2UNCONFIRMEDsys-apps/linux-misc-apps-3.6-r1 stabilization request2013-01-28 12:11:50
454322UnspecifiedsoundUNCONFIRMEDmedia-sound/lame-3.99.5 - console.o: In function `get_termcap_{string,number},apply_termcap_settings2013-01-28 18:33:17
454346Ebuildsmaintainer-wantedUNCONFIRMEDEbuild request: app-misc/elasticsearch - Open Source, Distributed, RESTful, Search Engine2013-01-28 18:47:24
454354Applicationsidella4UNCONFIRMEDapp-emulation/xen-tools-4.2.1 - Fails to compile with KeyError: '.text.asm.out/../src/smp.c.68'2013-02-01 21:20:22
454362Core systemkernel-miscUNCONFIRMEDsys-fs/jfsutils-1.1.15 - Fails to build with +static if sys-apps/util-linux is built without +static2013-01-28 02:04:19
454396Ebuildsmaintainer-wantedUNCONFIRMEDNew ebuild: gnome-extra/proxy_applet-0.2 - GNOME applet for changing network proxy configuration fro2013-01-28 08:58:55
454418Unspecifiedamd64UNCONFIRMEDapp-emulation/emul-linux-x86-soundlibs: pulseaudio version mismatch2013-01-28 19:22:58
454462Core systemsystemdUNCONFIRMEDsys-apps/dbus-1.6.8-r1[systemd] <--> sys-apps/systemd circular dependency2013-02-03 10:59:34
454466Applicationsmedia-tvUNCONFIRMEDapp-misc/lirc-9.0-r2 - irexec init script uses deprecated --chuid2013-01-29 14:50:41
454478SELinuxselinuxUNCONFIRMEDsys-apps/busybox-1.20.2 fails to merge on selinux profile with USE="static"2013-02-17 09:37:40
454492Toolstools-portageUNCONFIRMEDapp-portage/gentoolkit-0.3.0.7 - eclean-dist: UnboundLocalError: local variable 'cleaner' referenced2013-01-29 17:40:16
454564ApplicationsultrabugUNCONFIRMEDapp-admin/rsyslog-7.2.5 - In file included from dnscache.c:30: /usr/include/bits/sched.h:132:20: err2013-02-09 15:08:04
454572Applicationsweb-appsUNCONFIRMEDwww-apps/phpsysinfo-3.1.0: .htaccess file syntax error for apache-2.4.32013-01-30 05:35:22
454596ApplicationsalexxyUNCONFIRMEDwww-apps/rutorrent-3.4-r1 - ebuild fault: file '/usr/share/webapps/rutorrent/3.4-r1/htdocs/share/set2013-01-29 23:02:40
454604Third-Party ToolsdolsenUNCONFIRMEDapp-portage/layman feature requests2013-01-30 02:01:26
454608JavajavaUNCONFIRMEDdev-java/rxtx patches to build on ppc642013-01-30 05:47:24
454618Applicationsmedia-opticalUNCONFIRMEDapp-cdr/kcdemu-0.5.0 version bump2013-01-30 14:05:54
454652StagesreleaseUNCONFIRMEDcurrent stage3-amd64-nomultilib has an immediate block between sys-apps/module-init-tools and sys-ap2013-01-30 14:46:25
454746Core systemrobbat2UNCONFIRMEDsys-fs/lvm2-2.02.97-r1, sys-fs/udev-197-r4: /dev/mapper entries absent for dm-crypt partitions mount2013-02-04 01:37:50
454914OpenRCopenrcUNCONFIRMEDsys-apps/openrc: Feature Request: Open logfile before chuid option2013-01-31 23:56:37
454916DevelopmenthwoarangUNCONFIRMEDdev-util/qt-creator: apply patch to make ~arm work2013-02-17 11:25:06
455048Eclasses and ProfilesmgornyUNCONFIRMED[git-2.eclass] Add support for submodules in non-bare clones.2013-02-02 21:35:22
455082OpenRCopenrcUNCONFIRMEDsys-apps/openrc-0.11.8: Sometimes iwconfig.sh appends "enc open" to the key_SSID string2013-02-02 02:14:03
455120Core systemjdhoreUNCONFIRMEDsys-apps/lm_sensors-3.3.3-r2 sensord init script does not pass arguments2013-02-04 02:30:17
455134Applicationsgnome-officeUNCONFIRMEDapp=office/gnucash with dev-db/libdbi - "The library "libdbi" installed on your system doesn't corre2013-02-12 19:39:30
455164[RU]docs-teamUNCONFIRMEDHPPA Handbook translation2013-02-02 16:03:46
455222GNOMEgnomeUNCONFIRMEDnet-libs/webkit-gtk - add support for XT PaX marking2013-02-09 20:41:04
455234KDEkdeUNCONFIRMEDkmix: dbuscontrolwrapper.cpp:(.text+0x169): undefined reference to `vtable for DBusControlWrapper'2013-02-03 07:06:26
455276DevelopmentvapierUNCONFIRMEDdev-cpp/gmock-1.6.9 with python3 fails to execute test suite2013-02-05 11:28:28
455282LibrarytitanofoldUNCONFIRMEDdev-libs/libpqxx-4.0.1 with python 3.x - TypeError: 'str' does not support the buffer interface2013-02-19 08:19:43
455372Keywording and StabilizationgnomeUNCONFIRMEDapp-text/rarian-0.8.1-r2 stable request2013-02-04 12:47:50
455458OpenRCopenrcUNCONFIRMEDsys-apps/openrc - netmount fuser timeout - stopping the netmount script on shutdown. cifs shares won2013-02-06 12:18:47
455468Unspecifiedx11UNCONFIRMED>x11-base/xorg-server-1.12.1 non-functional on PPC2013-02-04 21:33:52
455470Applicationsnet-dialupUNCONFIRMEDnet-dialup/pptpclient-1.7.2-r2: applied patch hardcodes wrong ip path2013-02-04 18:47:35
455480ApplicationsvimUNCONFIRMEDapp-editors/vim-7.3.762 - Symlinks to gz manpages are dangling because my system uses bzip2 manpages2013-02-04 19:35:50
455518genkernelgenkernelUNCONFIRMEDsys-kernel/genkernel does not suppert hex numbers in root= kernel commandline2013-02-05 12:30:20
455632ApplicationsjdhoreUNCONFIRMEDsys-apps/lm_sensors: should support systemd2013-02-05 19:45:47
455634KDEkdeUNCONFIRMEDkde-base/systemsettings kde-base/powerdevil and other kde apps have automagical media-sound/pulseaud2013-02-06 07:13:02
455636ApplicationscardoeUNCONFIRMEDapp-emulation/libvirt-1.0.2 USE=-libvirtd - node_device/node_device_udev.c:1608:37: error: unknown t2013-02-05 21:55:17
455790Applicationsmedia-opticalUNCONFIRMEDapp-cdr/pburn-3.7.14 version bump2013-02-06 13:41:07
455816Librarynet-p2pUNCONFIRMEDnet-libs/gupnp-igd - src_prepare(): libgupnp-igd/Makefile.am:64: HAVE_INTROSPECTION does not appear 2013-02-06 13:54:26
455818Applicationsford_prefectUNCONFIRMEDmedia-sound/pulseaudio USE=xen should depend on app-emulation/xen-tools not app-emulation/xen2013-02-06 13:55:31
455830Developmentdev-embeddedUNCONFIRMEDadd support for atxmega16a4u / atxmega32a4u2013-02-08 05:48:56
455912OpenRCopenrcUNCONFIRMEDsys-apps/openrc-0.11.8 with sys-libs/ncurses[tinfo] - ../libeinfo/libeinfo.so: undefined reference t2013-02-14 14:13:57
455914ApplicationsvimUNCONFIRMEDapp-editors/{g,}vim-7.3.806 version bump2013-02-07 03:13:05
455956ApplicationswxwidgetsUNCONFIRMEDapp-editors/wxhexeditor-0.21 version bump2013-02-07 11:28:22
455986ApplicationsvoyageurUNCONFIRMEDnet-misc/gogoc - Introduce warning when bridge support is missing in kernel2013-02-07 11:47:29
455990Applicationsbase-systemUNCONFIRMEDapp-shells/bash=4.2_p37 - segfault when script aborted - *** glibc detected *** double free or corru2013-02-08 23:10:35
456090Applicationsapp-dictsUNCONFIRMEDapp-text/aspell-0.60.6.1 ebuild missing HU and HY languages2013-02-10 14:35:50
456120Applicationscron-bugsUNCONFIRMEDsys-process/vixie-cron with app-admin/logrotate - cron cannot handle cron.daily file with a dot in i2013-02-15 08:38:29
456230KDEkdeUNCONFIRMEDapp-cdr/k3b-2.0.2-r4: complains about "process can't started. Calling of In/Output module not possib2013-02-10 15:13:30
456354Applicationspolynomial-cUNCONFIRMEDapp-emulation/virtualbox-4.2.6-r1 fails to build. kmk_builtin_mv shows options help. kmk error 642013-02-11 17:25:35
456364HardenedhardenedUNCONFIRMEDsys-kernel/hardened-sources-3.7.5 ppc64 xics-common.c fails with "assignment of member 'cause_ipi' i2013-02-10 01:31:44
456394KDEkdeUNCONFIRMEDkde-base/ksmserver-4.10.0:4: Screen always locks (requires password) even if not supposed to2013-02-10 16:12:50
456650OpenRCopenrcUNCONFIRMEDsys-apps/openrc - enhance /etc/local.d/README2013-02-20 17:30:26
456666ApplicationsopenofficeUNCONFIRMEDapp-office/libreoffice-4.0.0.3 splash image not as cool as usual2013-02-13 02:15:46
456668ApplicationssuseUNCONFIRMEDdev-util/hxtools-20121125-r1 should DEPEND on sys-libs/libcap and sys-apps/pciutils2013-02-12 14:57:27
456696ApplicationslxnayUNCONFIRMED[sabayon overlay] app-text/gimagereader-0.9: complains: Could not load sane or twain, scanning will 2013-02-13 13:59:47
456722EbuildschithanhUNCONFIRMEDapp-misc/dvtm-9999.ebuild: added this ebuild2013-02-11 18:29:42
456814EbuildsqemuUNCONFIRMEDapp-emulation/qemu-1.2.2-r3[ncurses] fails configure with sys-libs/ncurses[tinfo]2013-02-14 14:14:03
456846ApplicationscardoeUNCONFIRMEDapp-emulation/libvirt-1.0.2-r1 has broken python bindings2013-02-12 22:17:07
456970Applicationshardened-kernelUNCONFIRMEDapp-editors/emacs-24.2 failed to emerge with a segmentation fault on hardened-sources-3.7.4-r12013-02-12 22:17:52
456980ApplicationsopenofficeUNCONFIRMEDapp-office/libreoffice-4.0.0.3 - inserting movie or sound in impress fails with "The format of the s2013-02-13 19:08:21
456984ServerjsbronderUNCONFIRMEDsys-cluster/mpich2-1.5 should not DEPEND on sys-apps/hwloc2013-02-14 15:14:18
457032Keywording and StabilizationtexUNCONFIRMEDStabilize app-text/djview-4.92013-02-16 13:35:05
457080EbuildsgraphicsUNCONFIRMEDmedia-gfx/cellwriter-1.3.5 - version bump request and please move it to app-accessibility/2013-02-13 18:34:41
457096Ebuildsmaintainer-wantedUNCONFIRMEDapp-admin/isohost-tools-0.1 - isoho.st remote management tools2013-02-15 15:04:21
457126Libraryamd64UNCONFIRMEDapp-emulation/emul-linux-x86-qtlibs-20121202 should install libQtSvg2013-02-14 07:14:29
457504EbuildstomjbeUNCONFIRMEDapp-backup/bacula-5.2.12: add support for installing examples into docdir2013-02-14 15:48:10
457518PrintingprintingUNCONFIRMEDapp-text/gsview 5.0 version bump2013-02-14 14:02:47
457546Ebuildsmaintainer-wantedUNCONFIRMEDNew ebuild: dev-db/torndb-0.1 - A lightweight wrapper around MySQLdb. Originally part of the Tornado2013-02-14 15:34:22
457556Applicationsbase-systemUNCONFIRMEDsys-apps/texinfo-4.13-r2 fails with ncurses[tinfo]2013-02-14 18:19:20
457562ApplicationsneurogeekUNCONFIRMEDapp-accessibility/speech-tools-2.1-r2 fails with ncurses[tinfo]2013-02-14 18:21:15
457564ApplicationsvimUNCONFIRMEDapp-editors/vim-core-7.3.762 fails with ncurses[tinfo]2013-02-14 18:18:53
457570ApplicationstoveUNCONFIRMEDapp-shells/zsh fails to compile with ncurses[tinfo]2013-02-14 19:59:26
457624GNOMEgnomeUNCONFIRMEDgnome-extra/gnome-system-monitor-3.6.1 has incorrect dependency on dev-cpp/glibmm2013-02-14 21:52:35
457642Applicationsfreedesktop-bugsUNCONFIRMEDapp-misc/tracker-0.14.4 with media-libs/giflib-5 - add NULL as second argument to DGifOpenFileHandle2013-02-15 15:43:43
457708Core systemhardened-kernelUNCONFIRMEDapp-emulation/virtualbox-4.{1.22,2.6}-r1 on sys-kernel/hardened-sources - Can't start virtual machin2013-02-16 21:53:53
457726Third-Party Toolstools-portageUNCONFIRMEDapp-portage/layman-2.0.0 - buggy quiet mode2013-02-15 16:56:10
457768Core systembase-systemUNCONFIRMEDeselect-sh should be pulled in by @system or virtual/shell or app-shells/* or (...)2013-02-18 05:52:51
457798ApplicationsbillieUNCONFIRMEDapp-portage/pfl-2.3-r2: cron-script doesn't run since 'python2' is not supported.2013-02-20 18:57:15
457934Eclasses and ProfileskdeUNCONFIRMEDAdd app-arch/unzip natspec to KDE profiles package.use2013-02-17 17:00:46
457968Third-Party ToolsmpaganoUNCONFIRMEDapp-portage/portpeek overlooks some(?) package atom(s)2013-02-17 17:03:04
458056ApplicationsaidecoeUNCONFIRMEDapp-admin/hddtemp submission for Samsung 840 Series SSD2013-02-18 13:22:13
458074OpenRCopenrcUNCONFIRMEDsys-apps/openrc-0.11.8 doesn't parse correctly options contained two words abreast self2013-02-18 13:35:38
458082OpenRCopenrcUNCONFIRMEDsys-apps/openrc-0.11.8 can't set address using "apipa"2013-02-18 13:34:42
458090OpenRCopenrcUNCONFIRMEDsys-apps/openrc-0.11.8 can't set address using "arping"2013-02-18 13:35:16
458104PrintingprintingUNCONFIRMEDapp-text/acroread-9.5.1-r1 - acroread creates $HOME/fontconfig directory on startup2013-02-18 13:45:46
458152Ebuildsmaintainer-wantedUNCONFIRMEDdev-db/odb-2.2.0 - C++ Object-Relational Mapping (ORM) implemented as a gcc plugin2013-02-19 22:42:42
458156OpenRCopenrcUNCONFIRMEDsys-apps/openrc-0.11.8 creates /etc/runlevels/sysinit/udev with wrong target when ROOT is not /2013-02-19 09:30:05
458160Applicationsidella4UNCONFIRMEDapp-emulation/xen-4.2.0-r1 - x86_64-pc-linux-gnu-ld: unrecognized option '--subsystem=10'2013-02-21 12:48:18
458176DevelopmentcalchanUNCONFIRMEDdev-lang/R - USE=X should not manage both X11 driver support and HTTP-Help support2013-02-21 06:57:03
458184Keywording and StabilizationyngwinUNCONFIRMEDapp-arch/lrzip-0.614 stable request2013-02-19 16:17:49
458190Keywording and Stabilizationmaintainer-neededUNCONFIRMEDsys-apps/i2c-tools stable request2013-02-19 10:48:36
458196Keywording and Stabilizationkernel-miscUNCONFIRMEDsys-fs/ecryptfs-utils-101 ppc64 keyword request2013-02-20 02:09:24
458218Ebuildsmaintainer-wantedUNCONFIRMEDapp-admin/amdoverdrivectrl-1.2.1 - control the frequency and fan settings of your AMD/ATI video card2013-02-19 20:28:02
458254ApplicationsvoyageurUNCONFIRMEDapp-cdr/cdrtools-3.01_alpha12 with sys-devel/clang-3.2 - sha2.c:1006:2: error: call to 'SHA384Pad' i2013-02-21 02:51:12
458284Core - Dependenciesdev-portageUNCONFIRMEDsys-apps/portage-2.1.11.52: 'emerge --depclean' does not remove old gentoo-sources2013-02-20 11:35:04
458288Applicationsrobbat2UNCONFIRMEDsys-apps/hwinfo stack smashing detected2013-02-19 20:31:17
458290Core systembase-systemUNCONFIRMEDsys-apps/groff-1.21, sys-apps/man-1.6g: Japanese manpages illegible2013-02-21 02:51:56
458346Ebuildsmaintainer-wantedUNCONFIRMEDdev-db/libodb-boost - ODB boost support library (dependency of dev-db/odb)2013-02-19 22:10:48
458350LibraryemacsUNCONFIRMEDapp-emacs/sml-mode-6.3 version bump2013-02-19 20:27:12
458360Keywording and StabilizationsystemdUNCONFIRMED=sys-apps/systemd-197-r1 ppc64 keyword request2013-02-20 14:36:41
458366Ebuildsmaintainer-wantedUNCONFIRMEDdev-db/libodb-qt - ODB Qt support library (dependency of dev-db/odb)2013-02-20 13:24:27
458380LibraryphosphanUNCONFIRMEDmedia-libs/jasper: ebuild patch for multilib support2013-02-20 21:19:41
458386ApplicationsbugsUNCONFIRMEDapp-admin/collectd-5.2.0 - Assert error in VSM_n_Arg(), [...]/work/varnish-3.0.3/lib/libvarnishapi/v2013-02-20 14:29:22
458394ApplicationschromiumUNCONFIRMEDwww-client/chromium-26.0.1410.5 audio skipping2013-02-20 03:20:40
458416ApplicationsangelosUNCONFIRMEDnet-wireless/ndiswrapper-1.58_rc1 with sys-kernel/vanilla-sources-3.8.0 - [...]/work/ndiswrapper-1.52013-02-20 14:35:53
458440ApplicationspatrickUNCONFIRMEDapp-office/openerp-6.1.1-r1 USE=-postgres - sed: can't read /var/tmp/portage/app-office/openerp-6.1.2013-02-20 15:16:18
458464Core - Interface (emerge)dev-portageUNCONFIRMEDsys-apps/portage-2.1.11.50: no way to JUST DAMN INSTALL a package2013-02-21 04:04:32
458468ApplicationssoundUNCONFIRMEDmedia-sound/easytag-2.1.8-r1 with experimental gtk3 support2013-02-20 15:11:47
458480Core systemvserver-devsUNCONFIRMEDsys-cluster/util-vserver with sys-apps/openrc - conflict in cgroups management2013-02-20 16:30:03
458496Core systembase-systemUNCONFIRMEDsys-apps/util-linux-2.22.2 install fails with: unable to read SONAME from libmount.so2013-02-20 20:32:45
458528ApplicationscjkUNCONFIRMEDapp-emacs/navi2ch - DESCRIPTION improvement2013-02-21 03:10:32
458548Unspecifiedbug-wranglersUNCONFIRMED=sys-apps/shadow-4.1.5.1-r1 failing sed in ebuild2013-02-21 08:10:22
458568Applicationsbug-wranglersUNCONFIRMEDUdisks2 fails to mount flash drive when ACL isn't supported in kernel2013-02-21 13:23:05
458570FreeBSDbsdUNCONFIRMEDfreebsd.eclass: please add svn ebuild support2013-02-21 11:37:52
458576Applicationsbug-wranglersUNCONFIRMEDapp-emulation/xen-tools should depend on dev-libs/yajl2013-02-21 12:22:28
458578Applicationsbug-wranglersUNCONFIRMEDapp-misc/geneweb-5.02: Fatal error: OCaml and preprocessor have incompatible versions2013-02-21 12:27:58


back



Support us on Content Nation

New Packages

- as rdf newsfeed
- as rss newsfeed
- as Atom newsfeed
2024-07-23
aspell - 0.60.8.1-r1
Ebuild name:

app-text/aspell-0.60.8.1-r1

Description

Free and Open Source spell checker designed to replace Ispell

Added to portage

2024-07-23

awscli - 1.33.28
Ebuild name:

app-admin/awscli-1.33.28

Description

Universal Command Line Environment for AWS

Added to portage

2024-07-23

bcrypt - 4.2.0
Ebuild name:

dev-python/bcrypt-4.2.0

Description

Modern password hashing for software and servers

Added to portage

2024-07-23

boto3 - 1.34.146
Ebuild name:

dev-python/boto3-1.34.146

Description

The AWS SDK for Python

Added to portage

2024-07-23

botocore - 1.34.146
Ebuild name:

dev-python/botocore-1.34.146

Description

Low-level, data-driven core of boto 3

Added to portage

2024-07-23

cgal - 6.0_beta1
Ebuild name:

sci-mathematics/cgal-6.0_beta1

Description

C++ library for geometric algorithms and data structures

Added to portage

2024-07-23

discord - 0.0.61
Ebuild name:

net-im/discord-0.0.61

Description

All-in-one voice and text chat for gamers

Added to portage

2024-07-23

faker - 3.4.2
Ebuild name:

dev-ruby/faker-3.4.2

Description

A library for generating fake data such as names, addresses, and phone numbers

Added to portage

2024-07-23

fastfetch - 2.19.1
Ebuild name:

app-misc/fastfetch-2.19.1

Description

Fast neofetch-like system information tool

Added to portage

2024-07-23

gnome-tweaks - 46.1-r1
Ebuild name:

gnome-extra/gnome-tweaks-46.1-r1

Description

Customize advanced GNOME options

Added to portage

2024-07-23

hypothesis - 6.108.4
Ebuild name:

dev-python/hypothesis-6.108.4

Description

A library for property based testing

Added to portage

2024-07-23

krb5 - 0.6.0
Ebuild name:

dev-python/krb5-0.6.0

Description

Kerberos API bindings for Python

Added to portage

2024-07-23

liquid - 5.5.1
Ebuild name:

dev-ruby/liquid-5.5.1

Description

Template engine for Ruby

Added to portage

2024-07-23

mocha - 2.4.3
Ebuild name:

dev-ruby/mocha-2.4.3

Description

Mocking and stubbing using a syntax like that of JMock and SchMock

Added to portage

2024-07-23

noise-suppression-for-voice - 1.10
Ebuild name:

media-libs/noise-suppression-for-voice-1.10

Description

A real-time noise suppression plugin for voice

Added to portage

2024-07-23

pudb - 2024.1.2
Ebuild name:

dev-python/pudb-2024.1.2

Description

A full-screen, console-based Python debugger

Added to portage

2024-07-23

pytest-lazy-fixtures - 1.1.1
Ebuild name:

dev-python/pytest-lazy-fixtures-1.1.1

Description

Allows you to use fixtures in @pytest.mark.parametrize

Added to portage

2024-07-23

quassel - 0.14.0-r3
Ebuild name:

net-irc/quassel-0.14.0-r3

Description

Qt/KDE IRC client supporting a remote daemon for 24/7 connectivity

Added to portage

2024-07-23

rescript-mode - 0.1.0_p20220613
Ebuild name:

app-emacs/rescript-mode-0.1.0_p20220613

Description

Emacs major mode for ReScript

Added to portage

2024-07-23

types-setuptools - 71.1.0.20240723
Ebuild name:

dev-python/types-setuptools-71.1.0.20240723

Description

Typing stubs for setuptools

Added to portage

2024-07-23

wcslib - 8.3
Ebuild name:

sci-astronomy/wcslib-8.3

Description

Astronomical World Coordinate System transformations library

Added to portage

2024-07-23

2024-07-22
Nuitka - 2.4.1
Ebuild name:

dev-python/Nuitka-2.4.1

Description

Python to native compiler

Added to portage

2024-07-22

aclock - 0.4.0-r2
Ebuild name:

gnustep-apps/aclock-0.4.0-r2

Description

Analog dockapp clock for GNUstep

Added to portage

2024-07-22

aiostream - 0.6.2
Ebuild name:

dev-python/aiostream-0.6.2

Description

Generator-based operators for asynchronous iteration

Added to portage

2024-07-22

astroid - 3.2.4
Ebuild name:

dev-python/astroid-3.2.4

Description

Abstract Syntax Tree for logilab packages

Added to portage

2024-07-22

audit - 4.0.1
Ebuild name:

sys-process/audit-4.0.1

Description

Userspace utilities for storing and processing auditing records

Added to portage

2024-07-22

calibre - 5.44.0-r4
Ebuild name:

app-text/calibre-5.44.0-r4

Description

Ebook management application

Added to portage

2024-07-22

calibre - 7.15.0
Ebuild name:

app-text/calibre-7.15.0

Description

Ebook management application

Added to portage

2024-07-22

certifi - 3024.7.22
Ebuild name:

dev-python/certifi-3024.7.22

Description

A certifi hack to use system trust store on Linux/FreeBSD

Added to portage

2024-07-22

cryptography - 43.0.0
Ebuild name:

dev-python/cryptography-43.0.0

Description

Library providing cryptographic recipes and primitives

Added to portage

2024-07-22

dep-logic - 0.4.4
Ebuild name:

dev-python/dep-logic-0.4.4

Description

Python dependency specifications supporting logical operations

Added to portage

2024-07-22

dotnet-runtime-nugets - 6.0.32
Ebuild name:

dev-dotnet/dotnet-runtime-nugets-6.0.32

Description

.NET runtime nugets

Added to portage

2024-07-22

dotnet-runtime-nugets - 8.0.7
Ebuild name:

dev-dotnet/dotnet-runtime-nugets-8.0.7

Description

.NET runtime nugets

Added to portage

2024-07-22

dotnet-sdk-bin - 8.0.107
Ebuild name:

dev-dotnet/dotnet-sdk-bin-8.0.107

Description

.NET is a free, cross-platform, open-source developer platform

Added to portage

2024-07-22

dotnet-sdk-bin - 8.0.303
Ebuild name:

dev-dotnet/dotnet-sdk-bin-8.0.303

Description

.NET is a free, cross-platform, open-source developer platform

Added to portage

2024-07-22

ensurepip-setuptools - 71.1.0
Ebuild name:

dev-python/ensurepip-setuptools-71.1.0

Description

Shared setuptools wheel for ensurepip Python module

Added to portage

2024-07-22

fisicalab - 0.4.0
Ebuild name:

gnustep-apps/fisicalab-0.4.0

Description

educational application to solve physics problems

Added to portage

2024-07-22

fzf - 0.54.1
Ebuild name:

app-shells/fzf-0.54.1

Description

General-purpose command-line fuzzy finder, written in Golang

Added to portage

2024-07-22

gcc - 15.0.0_pre20240721
Ebuild name:

sys-devel/gcc-15.0.0_pre20240721

Description

The GNU Compiler Collection

Added to portage

2024-07-22

glibc - 2.40
Ebuild name:

sys-libs/glibc-2.40

Description

GNU libc C library

Added to portage

2024-07-22

gmpy - 2.2.1
Ebuild name:

dev-python/gmpy-2.2.1

Description

Python bindings for GMP, MPC, MPFR and MPIR libraries

Added to portage

2024-07-22

gnustep-back - 0.31.0
Ebuild name:

virtual/gnustep-back-0.31.0

Description

Virtual for back-end component for the GNUstep GUI Library

Added to portage

2024-07-22

gnustep-back-art - 0.31.0
Ebuild name:

gnustep-base/gnustep-back-art-0.31.0

Description

Libart_lgpl back-end component for the GNUstep GUI Library

Added to portage

2024-07-22

gnustep-back-cairo - 0.31.0
Ebuild name:

gnustep-base/gnustep-back-cairo-0.31.0

Description

Cairo back-end component for the GNUstep GUI Library

Added to portage

2024-07-22

gnustep-back-xlib - 0.31.0
Ebuild name:

gnustep-base/gnustep-back-xlib-0.31.0

Description

Default X11 back-end component for the GNUstep GUI Library

Added to portage

2024-07-22

gnustep-base - 1.30.0
Ebuild name:

gnustep-base/gnustep-base-1.30.0

Description

A library of general-purpose, non-graphical Objective C objects

Added to portage

2024-07-22

gnustep-gui - 0.31.1
Ebuild name:

gnustep-base/gnustep-gui-0.31.1

Description

Library of GUI classes written in Obj-C

Added to portage

2024-07-22

gnustep-make - 2.9.2
Ebuild name:

gnustep-base/gnustep-make-2.9.2

Description

GNUstep Makefile Package

Added to portage

2024-07-22

gnutls - 3.8.6-r1
Ebuild name:

net-libs/gnutls-3.8.6-r1

Description

A secure communications library implementing the SSL, TLS and DTLS protoco

Added to portage

2024-07-22

gorm - 1.4.0
Ebuild name:

gnustep-apps/gorm-1.4.0

Description

A clone of the NeXTstep Interface Builder application for GNUstep

Added to portage

2024-07-22

howdoi - 2.0.20-r2
Ebuild name:

dev-util/howdoi-2.0.20-r2

Description

A code search tool

Added to portage

2024-07-22

intel-compute-runtime - 24.22.29735.21-r1
Ebuild name:

dev-libs/intel-compute-runtime-24.22.29735.21-r1

Description

Intel Graphics Compute Runtime for oneAPI Level Ze

Added to portage

2024-07-22

jellyfin-bin - 10.9.8
Ebuild name:

www-apps/jellyfin-bin-10.9.8

Description

Jellyfin puts you in control of managing and streaming your media

Added to portage

2024-07-22

libfmt - 11.0.2
Ebuild name:

dev-libs/libfmt-11.0.2

Description

Small, safe and fast formatting library

Added to portage

2024-07-22

libobjc2 - 2.2.1
Ebuild name:

gnustep-base/libobjc2-2.2.1

Description

GNUstep Objective-C runtime

Added to portage

2024-07-22

librime - 1.11.2
Ebuild name:

app-i18n/librime-1.11.2

Description

RIME (Rime Input Method Engine) core library

Added to portage

2024-07-22

libwacom - 2.12.2
Ebuild name:

dev-libs/libwacom-2.12.2

Description

Library for identifying Wacom tablets and their model-specific features

Added to portage

2024-07-22

lidarr-bin - 2.5.0.4277
Ebuild name:

www-apps/lidarr-bin-2.5.0.4277

Description

Looks and smells like Sonarr but made for music

Added to portage

2024-07-22

lz4 - 1.10.0
Ebuild name:

app-arch/lz4-1.10.0

Description

Extremely Fast Compression algorithm

Added to portage

2024-07-22

lz4 - 1.10.0-r1
Ebuild name:

app-arch/lz4-1.10.0-r1

Description

Extremely Fast Compression algorithm

Added to portage

2024-07-22

miniupnpc - 2.2.8-r1
Ebuild name:

dev-python/miniupnpc-2.2.8-r1

Description

Python bindings for UPnP client library

Added to portage

2024-07-22

numpy - 2.0.1
Ebuild name:

dev-python/numpy-2.0.1

Description

Fast array and numerical python library

Added to portage

2024-07-22

pcsx2 - 2.0.2
Ebuild name:

games-emulation/pcsx2-2.0.2

Description

PlayStation 2 emulator

Added to portage

2024-07-22

pcsx2_patches - 0_p20240714
Ebuild name:

games-emulation/pcsx2_patches-0_p20240714

Description

Collection of game patches for use with PCSX2 (e.g. wides

Added to portage

2024-07-22

prowlarr-bin - 1.21.1.4631
Ebuild name:

www-apps/prowlarr-bin-1.21.1.4631

Description

An indexer manager/proxy to integrate with your various PVR apps

Added to portage

2024-07-22

pylint - 3.2.6
Ebuild name:

dev-python/pylint-3.2.6

Description

Python code static checker

Added to portage

2024-07-22

pymountboot - 0.2.3-r2
Ebuild name:

dev-python/pymountboot-0.2.3-r2

Description

Python extension module to (re)mount /boot

Added to portage

2024-07-22

pyopenssl - 24.2.1
Ebuild name:

dev-python/pyopenssl-24.2.1

Description

Python interface to the OpenSSL library

Added to portage

2024-07-22

pypdf - 4.3.1
Ebuild name:

dev-python/pypdf-4.3.1

Description

Python library to work with PDF files

Added to portage

2024-07-22

pytest-httpserver - 1.0.12
Ebuild name:

dev-python/pytest-httpserver-1.0.12

Description

HTTP server for pytest to test HTTP clients

Added to portage

2024-07-22

radarr-bin - 5.8.3.8933
Ebuild name:

www-apps/radarr-bin-5.8.3.8933

Description

A fork of Sonarr to work with movies a la Couchpotato

Added to portage

2024-07-22

readarr-bin - 0.3.32.2587
Ebuild name:

www-apps/readarr-bin-0.3.32.2587

Description

An ebook and audiobook collection manager for Usenet and BitTorren

Added to portage

2024-07-22

recog - 3.1.9
Ebuild name:

dev-ruby/recog-3.1.9

Description

Pattern recognition for hosts, services, and content

Added to portage

2024-07-22

rescript-mode - 0.1.0_p20220613
Ebuild name:

app-emacs/rescript-mode-0.1.0_p20220613

Description

Emacs major mode for ReScript

Added to portage

2024-07-22

restclient - 0_p20220426
Ebuild name:

app-emacs/restclient-0_p20220426

Description

HTTP REST client tool for GNU Emacs

Added to portage

2024-07-22

rmg - 0.6.5
Ebuild name:

games-emulation/rmg-0.6.5

Description

Rosalie's Mupen GUI

Added to portage

2024-07-22

rmg - 9999
Ebuild name:

games-emulation/rmg-9999

Description

Rosalie's Mupen GUI

Added to portage

2024-07-22

ruff - 0.5.4
Ebuild name:

dev-util/ruff-0.5.4

Description

An extremely fast Python linter, written in Rust

Added to portage

2024-07-22

ruffle - 0_p20240722
Ebuild name:

app-emulation/ruffle-0_p20240722

Description

Flash Player emulator written in Rust

Added to portage

2024-07-22

setuptools - 71.1.0
Ebuild name:

dev-python/setuptools-71.1.0

Description

Collection of extensions to Distutils

Added to portage

2024-07-22

sphinx-gallery - 0.17.0
Ebuild name:

dev-python/sphinx-gallery-0.17.0

Description

Sphinx extension to automatically generate an examples gallery

Added to portage

2024-07-22

tifffile - 2024.7.21
Ebuild name:

dev-python/tifffile-2024.7.21

Description

Read and write TIFF files

Added to portage

2024-07-22

ugrd - 1.16.0
Ebuild name:

sys-kernel/ugrd-1.16.0

Description

Python based initramfs generator with TOML defintions

Added to portage

2024-07-22

wmclockmon - 1.0.0
Ebuild name:

x11-plugins/wmclockmon-1.0.0

Description

A nice digital clock with 7 different styles either in LCD or LED styl

Added to portage

2024-07-22

zenlib - 2.2.0
Ebuild name:

dev-python/zenlib-2.2.0

Description

Useful python decorators and utilities

Added to portage

2024-07-22

zenlib - 9999
Ebuild name:

dev-python/zenlib-9999

Description

Useful python decorators and utilities

Added to portage

2024-07-22

rdf newsfeed | rss newsfeed | Atom newsfeed
- Powered by LeopardCMS - Running on Gentoo -
Copyright 2004-2020 Sascha Nitsch Unternehmensberatung GmbH
Valid XHTML1.1 : Valid CSS : buttonmaker
- Level Triple-A Conformance to Web Content Accessibility Guidelines 1.0 -
- Copyright and legal notices -
Time to create this page: 31.1 ms