from small one page howto to huge articles all in one place
 

search text in:




Other .linuxhowtos.org sites: www.linuxhowtos.org
toolsntoys.linuxhowtos.org



Last additions:
How to make X listen on port 6000

How to make X listen on port 6000

words:

34

views:

63815

userrating:

average rating: 1.5 (4 votes) (1=very good 6=terrible)


May, 25th 2007:
April, 26th 2007:
Apr, 10th. 2007:
Druckversion . pdf icon
You are here: Portage


Details of x11-terms/st:

Description: Simple terminal implementation for X
Homepage:
https://st.suckless.org/

available versions:

releasesalphaamd64armhppaia64mipsppcppc64ppc macoss390shsparcx86USE-Flagsdependenciesebuild warnings
st-9999 -------------none
show
show
st-0.9 -------------none
show
show
st-0.8.5 -------------none
show
show
st-0.8.4-r1 -~~~---~----~savedconfig
show
show
st-0.8.4 -+~~---+----+savedconfig
show
show
Legend:
+ stable
~ testing
- not available
some ebuild warning depend on specific use-flags or architectures, all ebuild-warnings are shown.

Known bugs:
bug IDcomponentassigned tostatusdescriptionlast change
146951Core systemalphaUNCONFIRMEDsys-fs/quota - value too large for defined data type on Alpha systems2011-12-02 19:03:44
209617OpenRCopenrcUNCONFIRMEDsys-apps/openrc-0.8.2-r1: user should be able to interrupt service start/stop pressing Ctrl+C2013-02-18 09:41:51
281522VulnerabilitiessecurityUNCONFIRMEDmedia-video/vlc Stack-based buffer overflows via smb:// URLs2012-09-19 13:03:24
307401ApplicationspachoUNCONFIRMEDmedia-gfx/xsane crashes during startup if xinerama is enabled2012-03-02 11:17:03
339725EbuildsaballierUNCONFIRMEDmedia-sound/lmms fails to build remote_vst_plugin: winebuild: as --32 failed with status 12011-04-19 16:10:52
364495Keywording and Stabilizationgnu_andrewUNCONFIRMEDPlease stabilize dev-java/icedtea-6.1.10.4 and dev-java/icedtea-web-1.1.12012-11-27 04:46:18
365043GNOMEgstreamerUNCONFIRMEDmedia-plugins/gst-plugins-v4l2-0.10.28-r1: v4l2src is not working with ffmpegcolorspace (gst-plugins2011-07-07 12:30:25
365131Ebuildsmaintainer-wantedUNCONFIRMED[ebuild request] net-voip/blink2012-12-16 23:52:01
365207Ebuildsmaintainer-wantedUNCONFIRMEDchdkptp ebuild request2011-04-30 18:28:29
365245Ebuildsmaintainer-wantedUNCONFIRMEDEbuild request app-dicts/stardict-freedict-fra-eng2012-01-22 22:08:04
365249Ebuildsmaintainer-wantedUNCONFIRMEDEbuild request app-dicts/stardict-xmlittre2012-01-22 22:08:08
365501Applicationsnet-p2pUNCONFIRMEDnet-p2p/frostwire-4.20.9 should RDEPEND on dev-java/junit2011-07-31 12:15:23
365561EbuildshannoUNCONFIRMEDsci-geosciences/viking-1.1 - should install or RDEPEND on "gcget"2011-10-04 04:13:34
365589HardenedhardenedUNCONFIRMEDdev-db/mysql: Doesn't starting.2012-02-02 03:06:50
365643Ebuildspolynomial-cUNCONFIRMEDapp-emulation/virtualbox-additions-4.* License wrongly stated as PUEL2012-07-18 02:27:12
365665Ebuildsx11UNCONFIRMEDx11-base/xorg-server-1.9.5 CONFIGURE_OPTIONS are deprecated, use XORG_CONFIGURE_OPTIONS instead2011-11-19 01:13:08
365713ApplicationsclusterUNCONFIRMEDsys-cluster/maui-3.3.1 - mismatching spool dir in different files2011-05-08 19:17:50
365933Ebuildsmaintainer-wantedUNCONFIRMEDNew Ebuild, plug-0.7: Linux software for Fender Mustang amplifiers2011-05-07 04:30:11
365967EbuildssoundUNCONFIRMEDmedia-sound/qarecord-0.5.0 should install icon and desktop file2011-05-06 16:34:07
366051Ebuildsmaintainer-wantedUNCONFIRMEDAdd ebuild for NOC, Operation Support System (OSS) and Enterprise Network Operation Centers.2012-09-01 12:24:51
366147Ebuildsgentoo-perlUNCONFIRMEDdev-perl/Fuse version bump request2011-05-06 21:14:01
366219Ebuildsmaintainer-wantedUNCONFIRMEDHandlerSocket-Plugin-for-MySQL ebuild request2011-05-10 21:04:37
366231LibrarycppUNCONFIRMEDdev-libs/ace doesn't build static libraries2011-07-20 15:29:14
366395Keywording and StabilizationrafaelmartinsUNCONFIRMED>=dev-lang/luajit-2.0.0_beta7 needs arm and ppc testing2012-05-31 17:47:27
366509Applicationsrobbat2UNCONFIRMEDdev-db/libdbi-drivers-0.8.3: uses incorrect query for listing tables on PostgreSQL database2011-05-12 18:58:07
366513Unclassifieddev-portageUNCONFIRMEDportage-2.1.9.48 fails to install after successfull build.2011-05-09 07:41:30
366535EbuildslackUNCONFIRMEDnet-dns/openresolv-3.5.3 - stabilize2013-02-08 20:29:01
366709Applicationsmaintainer-wantedUNCONFIRMEDPackage request: Cryptodev for Linux and cryptodev use flag for OpenSSL2012-11-08 18:25:53
366739Applicationsrich0UNCONFIRMEDdev-util/android-sdk-update-manager should install desktop entries2013-01-19 22:10:35
366809Serveridl0rUNCONFIRMEDwww-apache/mod_perl-2.0.5 fails tests2011-05-12 23:01:20
366885Prefix SupportprefixUNCONFIRMEDx11-misc/xdg-user-dirs-0.13: build fails because of missing -liconv and _strndup on Darwin2011-05-11 14:09:14
366891OpenRCopenrcUNCONFIRMEDsys-apps/openrc-0.8.2-r1 will not restart over a broken NFS share.2011-12-19 18:01:59
366975ApplicationssciUNCONFIRMED[science overlay] sci-biology/gbrowse-2.33 fails to install, due to ACCESS VIOLATION2012-01-04 08:07:11
366999InstallCDreleaseUNCONFIRMEDHostname should be relatively unique on each boot2011-05-12 16:56:32
367319Applicationsx11UNCONFIRMEDx11-base/xorg-server: After a change my keyboard to USB model, no X-programs starts and Xorg log con2011-05-16 08:42:50
367325Eclasses and Profilesbase-systemUNCONFIRMEDInconsist save/restore path in savedconfig.eclass2013-01-24 16:21:26
367375EbuildsnetmonUNCONFIRMEDnet-analyzer/ndoutils-1.4_beta9: "db/" directory from source code is not installed to system2012-02-09 10:57:19
367443Ebuildspolynomial-cUNCONFIRMEDapp-emulation/virtualbox-9999 sets RPATH to /opt/VirtualBox but is installed to /usr/lib/virtualbox2011-05-17 17:41:46
367553Core systembase-systemUNCONFIRMEDnet-misc/openssh - sshd sessions don't get killed when system goes down or reboots2013-02-11 16:00:41
367717OpenRCopenrcUNCONFIRMEDsys-apps/openrc: services which need net aren't starting on boot2011-06-29 16:46:02
367787GamesgamesUNCONFIRMEDrevenge-of-the-titans-1.80.12 doesn't support humble bundle installation files.2012-12-27 10:32:12
367799ApplicationsvadimkUNCONFIRMEDapp-emulation/vmware-player doesn't install thnuclnt (thinprint), so virtual printers do not work (b2011-05-18 00:14:08
367925Keywording and StabilizationtexUNCONFIRMEDPlease stabilize =dev-tex/tipa-1.32011-05-18 16:02:25
368001Applicationsrobbat2UNCONFIRMEDapp-portage/g-cpan fails to install Sys::Filesystem2011-05-19 16:12:27
368161Applicationsx11UNCONFIRMEDx11-apps/xinit w/ sys-apps/openrc-0.8.2-r1 start-stop-daemon ignores PAM settings for user root2011-05-24 18:46:56
368205JavajavaUNCONFIRMEDjava-vm-2.eclass:pkg_prerm could mention eselect java-vm instead.2012-12-30 15:53:24
368251EbuildsevermindUNCONFIRMED[pro-audio overlay] media-libs/armstrong-9999 ebuild needs updating: distutils.eclass2011-05-23 08:42:25
368399Other documentsdocs-teamUNCONFIRMEDnvidia guide suggestions2011-05-22 22:09:25
368731ApplicationsgnomeUNCONFIRMEDx11-libs/gdk-pixbuf-2.22.1: parallel install fails sometimes2012-01-30 10:16:01
368835Core systembase-systemUNCONFIRMEDapp-admin/sysklogd - no way to disable startup of klogd when sysklogd is used in a vserver2011-05-31 23:48:08
368845Ebuildsmaintainer-wantedUNCONFIRMEDnet-proxy/ZAP ebuild request2011-05-27 08:47:55
368847Ebuildsmaintainer-wantedUNCONFIRMEDnet-proxy/andiparos ebuild request2011-05-27 08:47:21
368849Ebuildsmaintainer-wantedUNCONFIRMEDJBroFuzz ebuild request2011-05-27 08:48:52
368997Ebuildsarmin76UNCONFIRMEDnet-misc/tightvnc: /etc/ini.d/vnc failes to start when media-fonts/font-misc-misc is installed with 2012-06-23 17:45:55
369159Servernet-mailUNCONFIRMEDmail-filter/postgrey init script fails startup under sys-apps/openrc-0.8.2-r12013-01-14 07:23:32
369225Applicationsportage-utilsUNCONFIRMEDapp-portage/portage-utils: Request for atom support in qatom/qlist2011-10-03 00:54:56
369489Ebuildsmaintainer-wantedUNCONFIRMEDsys-fs/boxfs-0.7.ebuild - A FUSE filesystem to access files on box.net accounts2011-06-06 00:29:16
369811ApplicationsopenrcUNCONFIRMEDsys-apps/openrc: Patch to measure time required for starting daemons (was: delay to sys-auth/console2012-05-20 13:25:32
369851ApplicationsnxUNCONFIRMEDnet-misc/nx-3.4.0-r3 *** stack smashing detected ***: nxagent - terminated2012-07-12 06:06:30
369855Ebuildsmaintainer-wantedUNCONFIRMED[media-video(?)/]freeseer - a video capture utility capable of capturing and streaming video2012-03-16 04:22:13
370151Javamaintainer-wantedUNCONFIRMEDNew package: dev-java/stax2-api2011-06-07 21:13:04
370199Core systemcron-bugsUNCONFIRMEDsys-process/anacron-2.3-r2 should use elog instead of einfo in pkg_postinst()2011-06-06 01:56:38
370223Applicationsrobbat2UNCONFIRMEDg-cpan crashes on install AnyEvent::Feed2011-06-09 08:02:55
370287Applicationsmedia-tvUNCONFIRMEDapp-misc/lirc-0.9.0 fails to emerge, because 'struct i2c_adapter’ has no member named ‘id’2012-07-17 20:40:06
370483Ebuildsmaintainer-wantedUNCONFIRMEDebuild request brother mfc-j265w lpr & cupswrapper ebuilds2012-04-08 14:01:44
370631Ebuildsmaintainer-wantedUNCONFIRMEDdev-php/php-smarty-framework-plugin ebuild request2013-02-04 12:40:03
370703Applicationsmysql-bugsUNCONFIRMEDdev-db/myodbc-5.1.6 - emerge --config fails: odbcinst: SQLWritePrivateProfileString failed with Gene2011-06-10 02:05:40
370711Serverproxy-maintUNCONFIRMEDmedia-sound/teamspeak-server-bin-3.0.0_beta30: Crashes when starting from stock init script - Virtua2012-11-18 10:17:00
370785Ebuildsmaintainer-wantedUNCONFIRMEDsteadyflow-0.1.7 - a GTK+ based download manager that aims for minimalism, ease of use, and a clean,2013-02-06 11:25:50
371369Applicationsmysql-bugsUNCONFIRMEDmod-auth-mysql-4.3.9: LoadModule statement is wrong (with solution)2012-11-27 19:59:19
371707Ebuildsmaintainer-wantedUNCONFIRMEDdev-libs/librets - a Real Estate Transaction Standard (RETS) client library2013-01-15 00:37:53
371729Prefix SupportprefixUNCONFIRMEDBootstrapping tar fails on SUSE Enterprise 11 SP02011-06-15 14:17:54
371773Ebuildsmaintainer-wantedUNCONFIRMEDmedia-sound/umurmur-0.2.8 - Minimalistic Murmur (Mumble server)2012-12-25 19:00:18
371785Prefix SupportprefixUNCONFIRMEDBootstrapping gcc fails on SUSE Enterprise 11 SP02011-06-15 15:13:04
371841Libraryx11UNCONFIRMEDx11-libs/libdrm-2.4.25 assertion failure triggered by sci-astronomy/stellarium-0.10.62011-06-17 09:33:02
371869UnspecifiedgstreamerUNCONFIRMEDgst-plugins-bad-0.10.21: Regression in playback of avi with multiple ac3 audio tracks2011-10-22 06:53:58
371911Otherinfra-bugsUNCONFIRMEDrequesting an A record for contest.gentoo.org2012-05-05 18:33:49
371955EbuildsgstreamerUNCONFIRMEDmedia-libs/gstreamer should interactively install requested plugins2011-06-16 23:08:35
372049Applicationstools-portageUNCONFIRMEDRequest for app-portage/gentoolkit to show (for a use flag) status of the flag in installed packages2012-12-25 01:55:20
372475Ebuildspolynomial-cUNCONFIRMEDRename app-emulation/virtualbox-additions to app-emulation/virtualbox-[guest-]additions[-bin]2012-04-08 19:23:25
372693Keywording and StabilizationarmUNCONFIRMEDapp-emulation/lxc ~arm keyword request2012-06-18 10:54:01
372703UnspecifiedjmbsvicettoUNCONFIRMEDnet-misc/vde service script unloads module when it is still needed2012-06-08 13:14:11
372893EbuildshannoUNCONFIRMED[hanno-overlay] net-im/gajim-9999 don't install all necessary packages2012-02-21 16:39:03
373179Ebuildsmaintainer-wantedUNCONFIRMEDPackage Request: Mozilla Mobile2012-02-03 16:13:16
373207Applicationsmaintainer-wantedUNCONFIRMEDebuild request for app-cdr/mktoc2011-06-30 08:33:46
373283ApplicationsnetmonUNCONFIRMEDnet-analyzer/netcat-110-r9: -c does execve() instead of system()2011-07-03 17:35:12
373295UnspecifiedtoolchainUNCONFIRMEDsys-libs/glibc-2.12.2: building glibc interrupted in OpenVZ container, also tried rebuilding system2011-12-22 22:40:58
373519EbuildsgraphicsUNCONFIRMEDmedia-gfx/yafray-9999 ebuild REQUEST for blender 2.5x or blender-svn2011-08-12 02:07:29
373561UnspecifiedjavaUNCONFIRMED[java-overlay] dev-java/testng-5.2 fails to download testng-5.2.zip2012-07-10 09:51:53
373635Ebuildsnet-dialupUNCONFIRMEDnet-dialup/ppp: add postinst message for break compatibility with dependent packages2011-07-01 01:38:55
373795Applicationsrobbat2UNCONFIRMEDapp-text/convmv-1.10 fails tests2012-11-07 11:19:40
373847ApplicationshannoUNCONFIRMEDmedia-gfx/gimp-2.6.11-r1: crash on startup with error GLib-WARNING ignoring no-arg, optional-arg or 2011-10-22 18:15:20
373891EbuildsramerethUNCONFIRMEDnet-misc/stunnel build fails: #error OpenSSL library compiled without thread support2012-12-25 04:27:10
373923LibraryjsbronderUNCONFIRMEDsys-cluster/openmpi-1.5.3-r1: mpirun hangs or fails with Segmentation faults2012-02-06 19:20:57
374043ApplicationsgstreamerUNCONFIRMEDmedia-plugins/gst-plugins-ffmpeg-0.10.11-r1 does not compile on x86 with mstackrealign CFLAG and gcc2011-07-10 10:04:50
374081Ebuildsmaintainer-wantedUNCONFIRMEDRequest for Firefox Add-on SDK ebuild2011-08-03 21:09:49
374101Ebuildsmaintainer-wantedUNCONFIRMEDEbuild for gnome-shell-extensions-gpaste2012-02-03 11:05:41
374137EbuildsgraphicsUNCONFIRMEDmedia-libs/openjpeg-9999.ebuild request2012-01-08 00:10:08
374149DevelopmentperlUNCONFIRMEDMoose-2.1.0 conflicts with all existent versions of File-ChangeNotify, MooseX-Params-Validate, and M2011-07-10 03:47:03
374289ApplicationshardenedUNCONFIRMEDwww-clients/firefox-5.0-r2 mmap loog on PaX&hardened system2012-01-21 01:27:05
374377Ebuildsmaintainer-wantedUNCONFIRMED[ebuild request] www-clients/qtweb ebuild - lightweight, html5 compliant qt-based web-browser2011-07-10 17:26:58
374471LibrarycppUNCONFIRMEDdev-libs/Ice-3.4.1 failed to install2011-07-09 03:07:07
374475GamesgamesUNCONFIRMEDnwn-data downloads 1.5GB of files only to tell me i need USE=cdinstall in order to proceed2012-10-07 11:42:43
374505ApplicationsbluenessUNCONFIRMEDdev-util/gperf-3.0.4: compile error collect2: ld returned 1 exit status2012-02-04 01:23:02
374699ApplicationsbinkiUNCONFIRMEDdev-libs/lzo need LDFLAGS -no-undefined to build DLL for CHOST *-*-mingw322011-12-02 03:19:46
374789Ebuildsmaintainer-wantedUNCONFIRMEDebuild request: chiliproject - a community fork of redmine2013-02-13 20:47:13
374839Mailing Listsinfra-bugsUNCONFIRMEDList-Id: is not very fine configured2011-07-11 12:05:40
374849Ebuildsmaintainer-wantedUNCONFIRMEDnet-wireless/kismon ebuild request2011-07-11 15:49:17
374871Ebuildsmaintainer-wantedUNCONFIRMEDebuild request - pyload Download Manager2012-12-05 17:09:05
374925ApplicationsperlUNCONFIRMEDmail-filter/spamassassin-3.3.2-r1 fails test spamd_ssl_v2.t2012-04-27 08:36:13
374949BugzillabugzillaUNCONFIRMEDSubmitting bugs with attachments without method to determine content type causes error but still cre2011-10-30 23:16:37
375089Ebuildsmaintainer-neededUNCONFIRMED=x11-wm/stumpwm-9999 bump request (ebuild included)2011-07-28 23:45:14
375183GamesgamesUNCONFIRMEDgames-strategy/freecnc-20041219: version bump request2011-07-14 15:27:59
375237GamesgamesUNCONFIRMEDgames-strategy/netpanzer-0.8.4: version bump request2012-01-24 03:19:29
375311Toolstools-portageUNCONFIRMEDequery list - does not show status for packages in /etc/portage/package.keywords2012-12-25 01:55:50
375359ApplicationsschemeUNCONFIRMEDdev-scheme/slib ebuild scripts cannot find installed drscheme2013-02-06 06:05:35
375717Ebuildsmaintainer-wantedUNCONFIRMEDpash - powershell for mono ebuild request2011-07-22 12:20:31
375783EbuildsgrozinUNCONFIRMEDmedia-gfx/fotoxx-11.07 ~ppc keyword request2011-07-21 11:28:06
375825Applicationsmaintainer-neededUNCONFIRMEDapp-admin/ulogd-2.0.0_beta4 fails to build with +doc USE flag if latex is not installed2012-09-16 09:14:45
376123Ebuildsmaintainer-wantedUNCONFIRMEDCppUTest-2.3.ebuild (New Package)2011-07-25 09:15:02
376125Applicationsbase-systemUNCONFIRMEDnet-misc/keychain-2.7.1 does not store gpg keys2012-09-19 20:23:16
376153EselecteselectUNCONFIRMEDRequest: eselect module for managing /etc/init.d/net.* symlinks2011-07-26 10:41:35
376237ApplicationssciUNCONFIRMEDsci-misc/boinc-6.12.33: boinc is missing menu when connecting to localhost2012-06-27 10:06:22
376435Prefix SupportprefixUNCONFIRMEDnet-libs/libpcap-1.1.1-r1 - ./pcap-usb-linux.c:228: error: storage size of 'ctrl' isn't known2011-12-19 02:04:51
376767Ebuildsrobbat2UNCONFIRMEDapp-portage/g-cpan-0.16.4 creates non-existent categories file without newline (inconsistent)2011-08-03 01:16:53
377177ApplicationsfuzzyrayUNCONFIRMEDapp-portage/elogviewer-0.6.2-r1 - elogviewer fails to start for ordinary user in the portage group2011-08-27 17:52:02
377265Ebuildsmaintainer-wantedUNCONFIRMEDClonezilla ebuild request2011-08-02 11:26:50
377281ApplicationsforensicsUNCONFIRMEDapp-forensics/aide-0.15.1 will not run correctly when built statically.2013-02-03 13:02:19
377285Applicationspolynomial-cUNCONFIRMEDapp-emulation/virtualbox-4.0.12 - Windows guest has USB disk woes2012-10-18 13:10:29
377339EbuildsroxUNCONFIRMEDNew Version rox-base/zeroinstall-injector-1.22011-08-02 10:52:56
377641Applicationsmedia-tvUNCONFIRMEDapp-misc/lirc-0.9.0 doesn't work with most keys in imon_pad2012-04-27 12:09:04
377747Ebuildsmaintainer-wantedUNCONFIRMEDmedia-gfx/sK1 is an open-source illustration program2011-08-05 21:49:02
377841Prefix SupportprefixUNCONFIRMEDXemake requires Xvfb from the host, but end users don't know that2011-08-05 02:05:43
377925DevelopmentpythonUNCONFIRMEDdev-python/docutils-0.[78]: TypeError: can't use a bytes pattern on a string-like object2011-10-07 21:22:24
377939Applicationsqmail-bugsUNCONFIRMEDnet-mail/vpopmail - added PostgreSQL support and USE flag2012-04-11 04:19:05
378067ApplicationsforensicsUNCONFIRMEDapp-forensics/aide-0.14.2 - aide fails if non-standard paths are used2013-02-03 13:02:31
378125Unspecifiedmaintainer-neededUNCONFIRMEDmedia-gfx/bootsplash-themes - Suggestion: per-resolution USE flags etc.2013-01-20 10:18:16
378559Applicationsdev-portageUNCONFIRMEDsys-apps/portage-2.1.10.10 add support for stripping PE322011-08-11 07:34:53
378633Core systemopenrcUNCONFIRMEDrestarting one interface complains that dhcpcd is already running, even if in fact it is not (race c2011-08-13 14:26:13
378711Applicationsmaintainer-neededUNCONFIRMEDdev-libs/dietlibc-0.33_pre20110403 - allow to install in proper place when cross-compiling2013-01-03 20:15:43
379441Applicationsx11UNCONFIRMEDx11-apps/xinit: startx leaks .serverauth.???? files2011-10-27 13:53:49
379475Applicationsmaintainer-neededUNCONFIRMEDwww-apache/mod_dnssd - Avahi: "invalid host name" error, always uses "localhost" no matter what2013-01-01 20:35:50
379499ApplicationsmlUNCONFIRMEDnet-misc/unison-2.27.57-r1 stack smashing detected2011-08-19 00:43:25
379625Ebuildscommon-lispUNCONFIRMED[lisp overlay] dev-lisp/restas web framework ebuild request2011-08-21 16:19:10
380015Ebuildsmaintainer-wantedUNCONFIRMEDrequesting an ebuild for ubuntuone-client2012-07-27 12:59:34
380379DevmanualqaUNCONFIRMEDQuickstart ebuild guide is outdated re: emake2011-08-23 15:27:47
380451Ebuildsmaintainer-wantedUNCONFIRMEDEbuild request ganeti-webmgr2012-01-24 21:40:14
380795Core systembase-systemUNCONFIRMEDsys-fs/cryptsetup: dm-crypt-start.sh: get keys via custom pipe2011-09-23 15:26:00
380857Applicationsapp-dictsUNCONFIRMEDapp-dicts/duali-data-0.1b -doins: stemsdb does not exist2011-10-23 14:29:09
380889Applicationsnet-imUNCONFIRMEDnet-im/sendxmpp-1.20 does not work when dev-perl/XML-Stream-1.22 is installed (1.23 needed)2011-09-01 19:39:25
381001UnspecifiedcppUNCONFIRMEDdev-libs/boost-1.46.1-r1 failes to build on arm2012-10-31 16:41:29
381201ApplicationsvmwareUNCONFIRMEDapp-emulation/vmware-player and app-emulation/vmware-workstation: verify if we can drop libsexy depe2011-08-31 12:14:50
381333ApplicationsjerUNCONFIRMEDx11-terms/rxvt-unicode feature request (disable underline and cursor behaviour)2012-02-26 18:39:51
381451ApplicationsswegenerUNCONFIRMEDAdd an init script to run multiple instances of app-misc/screen as a system service2011-09-08 12:17:13
381647Ebuildsmaintainer-wantedUNCONFIRMEDapp-vim/vst - Vim reStructured Text support2011-09-06 02:47:15
381693ServerjavaUNCONFIRMEDtomcat-6 init fails when CATALINA_TMPDIR does not exist2011-10-24 21:05:19
381711ApplicationsperlUNCONFIRMEDdev-perl/IO-Tty-1.100.0 fails tests on amd642011-09-04 07:54:02
381759Ebuildssci-geosciencesUNCONFIRMEDsci-geosciences/grass-6.4.1 wxwidgets GUI does not start with Python32013-01-24 22:56:15
381959Ebuildsmaintainer-wantedUNCONFIRMED[ebuild request] dev-perl/mail-alias2011-09-06 20:52:31
382099Ebuildsmaintainer-wantedUNCONFIRMEDmedia-gfx/mitsuba - An extensible rendering framework written in portable C++ (ebuild request)2011-09-07 04:01:42
382121Otherdocs-teamUNCONFIRMEDThe Suggestion of the new Korean translation for the related documentation2011-09-07 07:25:44
382169Keywording and StabilizationgamesUNCONFIRMEDPlease stabilize =games-util/ucon64-2.0.02012-09-20 15:39:11
382195Keywording and StabilizationgamesUNCONFIRMEDPlease stabilize =games-fps/quake4-bin-1.4.22012-09-20 19:48:29
382211LibraryjdhoreUNCONFIRMEDdev-libs/libmcs-0.7.2 - ld: mcs_getconfval.o: relocation R_X86_64_32 against `.rodata.str1.1' can no2012-02-03 06:39:29
382339Ebuildsmaintainer-wantedUNCONFIRMED[ebuild request] app-office/dunnart - constraint-based diagram editor2011-09-09 07:53:17
382413Prefix SupportprefixUNCONFIRMEDx11-lib/qt-webkit fails to link against media-libs/phonon on Mac OS X (framework is missing)2011-09-09 18:29:43
382463DevelopmentgrozinUNCONFIRMEDdev-lisp/cmucl-20b_p001 fails to install due to (I think) a broken sed script.2012-05-07 02:56:52
382629Ebuildsmaintainer-wantedUNCONFIRMEDNew ebuild: dev-perl/HTML-StripScripts2011-09-13 20:32:49
382631Ebuildsmaintainer-wantedUNCONFIRMEDNew ebuild: dev-perl/HTML-StripScripts-Parser2011-09-13 20:33:24
383097Ebuildsmaintainer-wantedUNCONFIRMEDsys-kernel/libre-sources with Freedo logo new request2011-09-16 14:42:35
383169Ebuildsmaintainer-wantedUNCONFIRMEDwww-apps/statusnet ebuild request2012-06-19 10:49:02
383299Ebuildsmaintainer-wantedUNCONFIRMED[ebuild request] degate - IC digital logic reverse engineering tool2011-09-17 10:44:18
383339Applicationsbase-systemUNCONFIRMEDapp-admin/syslog-ng-3.2.4: init script fails to start with ethernet bonding2011-09-19 10:38:08
383447PrintingprintingUNCONFIRMEDapp-text/ghostscript-gpl-9.05 fails to build2012-02-20 00:09:31
383455Ebuildsmaintainer-wantedUNCONFIRMEDapp-misc/openplacos/openplacos-0.3.0.ebuild New ebuild, latest stable releases on x86 and amd642012-10-11 17:25:44
383493baselayoutopenrcUNCONFIRMEDsys-apps/openrc-0.9.3-r1, net-firewall/ipset, net-firewall/iptables: Circular Dependency with custom2011-09-20 13:06:03
383513Applicationsmedia-videoUNCONFIRMED>media-video/transcode-1.0.7 can handle only the first audio track when transcoding from media-video2011-12-06 10:16:57
383581Core systemtoolchainUNCONFIRMED[Request] sys-devel/gcc-4.x: Re-add support for the D language2012-07-15 05:58:15
383985Librarybase-systemUNCONFIRMEDdev-libs/libpcre-8.13-r1 fails test RunTest2012-12-02 15:46:18
383995ApplicationsgstreamerUNCONFIRMEDmedia-plugins/gst-plugins-ffmpeg-0.10.12 fails test2012-09-06 23:05:53
384137EbuildsperlUNCONFIRMEDdev-perl/Inline-0.480.0: fails tests with parallel make2011-09-27 16:26:48
384311ApplicationsgregkhUNCONFIRMEDnet-misc/bti add patch to allow compilation on non-GNU systems2012-09-23 09:36:41
384313Applicationsmedia-videoUNCONFIRMEDmedia-video/vlc vlc-cache-gen Segmentation fault on hardened system2012-09-19 13:08:49
384371Ebuildsx11UNCONFIRMEDx11-apps/xdm drop stict x11-libs/libXinerama dependency2011-09-25 06:54:17
384581Mac OSXprefixUNCONFIRMEDapp-editors/emacs-23.3-r2: emerge failed with error unexec: my_endbss_static is not in section __bss2011-10-31 03:04:33
384603Core systempam-bugsUNCONFIRMEDsys-auth/pam_ssh-1.97-r2 (and r3) forgets to set gids in session start2011-10-09 03:06:42
384617EbuildschainsawUNCONFIRMEDapp-emulation/dynamips fails to compile (w/ can't find a register in class 'GENERAL_REGS')2011-10-31 10:29:49
384731Core systembase-systemUNCONFIRMEDsys-devel/libtool-2.4-r3 fails tests 42, 84, 112 on hardened2011-11-21 22:32:49
384883Applicationsnet-dialupUNCONFIRMEDnet-dialup/ppp: with net-dns/openresolv /etc/ppp/ip-up.d/50-initd.sh stomps /etc/ppp/ip-up.d/40-dns.2011-10-01 02:49:50
384925EbuildsrubyUNCONFIRMEDdev-ruby/knife-{ec2,rackspace,openstack}: ebuild request2012-05-29 04:47:03
384941DevmanualdevmanualUNCONFIRMEDdevmanual does not mention that there are recursive versions of the do* install functions2013-01-19 10:18:09
385087GCC PortingtoolchainUNCONFIRMEDsys-devel/gcc-4.4.5: gcj seem to not install needed ca-certificates (/usr/lib/security/cacerts)2012-09-24 06:08:56
385121ApplicationsbilllUNCONFIRMEDmedia-video/ogmrip refuses to install due to "poor programming practices"2011-11-12 17:23:29
385557GamesgamesUNCONFIRMEDgames-strategy/frozensynapse - New ebuild for Frozen Synapse2012-06-18 04:40:37
385601Other documentsdocs-teamUNCONFIRMEDVirtual Mail Howto: MySQL Script Varies From Instructions2012-07-08 23:24:50
385739Applicationsmaintainer-wantedUNCONFIRMEDQaquarelle ebuild request2011-10-05 16:40:34
385741Applicationsfreedesktop-bugsUNCONFIRMEDsys-power/pm-utils-1.4.1-r2: delay upon starting xsession resulting in harddrive error2011-10-14 00:25:12
385761Applicationsshell-toolsUNCONFIRMEDdev-util/colorgcc: please submit gentoo patches to upstream at github2011-10-10 14:45:07
386125Applicationsdev-zeroUNCONFIRMEDx11-drivers/xf86-video-vmware does not install with reason bad programming practice2013-01-31 11:11:18
386227ApplicationsjlecUNCONFIRMEDsci-libs/cgcode-1.0.ebuild doesn't install (shared object symlink issue)2011-11-21 16:34:36
386467Applicationsx11UNCONFIRMEDmedia-libs/mesa-7.11 causes X to fail to start2011-10-11 00:34:59
386621ApplicationsnetmonUNCONFIRMEDnet-analyzer/metasploit SLOT correction request2012-03-26 03:21:46
386843DevelopmentvoyageurUNCONFIRMEDsys-devel/clang-2.9-r1 fails test PCH/cxx-typeid.cpp2011-10-16 03:36:44
387001Applicationsnet-proxyUNCONFIRMEDnet-proxy/tsocks segfaults if /etc/tsocks/tsocks.conf does not exist2011-10-18 16:36:02
387109Ebuildsmaintainer-wantedUNCONFIRMEDNew Ebuild: dev-python/lazr-restfulclient2011-10-21 07:15:05
387115ApplicationstomjbeUNCONFIRMEDapp-backup/bacula init script kills all bacula-fd clients instead only one2013-01-30 18:13:20
387213Applicationstools-portageUNCONFIRMEDapp-portage/gentoolkit-0.3.0.4-r4 - revdep-rebuild: replace "requires" with "was linked against"2011-10-18 16:20:34
387487Ebuildsmaintainer-wantedUNCONFIRMEDEbuild Request: mate-base/mate-2011.10.7 - Mate Desktop Environment2012-09-15 08:58:56
387567ApplicationsjlecUNCONFIRMEDx11-terms/terminator-0.96: Segmentation fault when starting2011-10-24 05:16:07
387803Core systemvadimkUNCONFIRMEDProcesses start hanging in "D" state on Gentoo guest under vmware host2011-10-26 00:12:42
388121Ebuildsmaintainer-wantedUNCONFIRMEDHaguichi-1.0.2 ebuild request2011-10-24 13:09:38
388425ApplicationswineUNCONFIRMEDapp-emulation/wine-1.3.30 sound not working, several apps stopped working.2012-03-22 12:19:51
388441Gamesmaintainer-wantedUNCONFIRMEDEbuild request games-strategy/liquidwar62012-03-30 21:32:48
388575Ebuildsmaintainer-wantedUNCONFIRMEDatem-0.3.2.ebuild - Fast command line tool that converts MetaStock financial binary data to CSV/text2011-11-03 18:46:04
388647Eclasses and ProfilesmozillaUNCONFIRMEDmozextension.eclass: Add new function for installing extensions in new standard install location2012-05-23 18:22:51
388931ApplicationspatrickUNCONFIRMEDapp-benchmarks/phoronix-test-suite-3.2.1: lspci command not found on first run2012-01-08 15:46:15
389021Ebuildsmaintainer-wantedUNCONFIRMED[net-misc?]/dlan-linux - Find and configure your devolo (Ethernet via existing electrical wiring) dL2012-01-12 10:14:40
389027Ebuildsmaintainer-wantedUNCONFIRMEDnet-misc/qpid-cpp - cross-platform Enterprise Messaging system which implements the Advanced Message2012-08-31 06:30:43
389029Ebuildsmaintainer-wantedUNCONFIRMEDsys-libs/libuser - implements a standardized interface for manipulating and administering user and g2011-11-01 15:42:13
389129Gamesmaintainer-wantedUNCONFIRMEDgames-action/voxatron - game set in a world completely made of tiny cubes that can be blasted to smi2012-06-03 22:42:56
389151Ebuildsmaintainer-wantedUNCONFIRMEDnet-misc/justwifiindicator-0.1 - Simple WiFi signal strength tray indicator2011-11-20 12:10:03
389359Ebuildsmaintainer-wantedUNCONFIRMEDenhancement request for trinity desktop2012-05-12 16:21:06
389361Core systemgenkernelUNCONFIRMEDsys-kernel/genkernel-3.4.16 dmraid advises user to install obsolete device-mapper package2012-01-31 02:42:48
389533Applicationsdesktop-wmUNCONFIRMEDx11-wm/icewm-1.3.7 - src_test(): iceview.cc:480:38: error: no matching function for call to ‘TextVie2012-07-05 11:48:34
389647Applicationstools-portageUNCONFIRMEDapp-portage/gentoolkit: revdep-rebuild does not understand symlinks2011-12-20 14:54:27
389775Core systemgenkernelUNCONFIRMEDsys-kernel/gentoo-sources: install fails with FIRMWARE_IN_KERNEL = y2012-10-27 18:39:39
389837Ebuildsmaintainer-wantedUNCONFIRMEDebuild request x86_energy_perf_policy(8)2011-11-08 21:27:01
389843Coredev-portageUNCONFIRMEDemerge --skipfirst without --resume tries to emerge wrong packages with portage 2.2.0_alpha722011-11-08 01:14:55
389861ApplicationsgnustepUNCONFIRMEDgnustep-base/gnustep-make-2.6.1-r1[doc] - mkdir: cannot create directory `gnustep-howto.t2d': File e2011-11-08 15:59:39
389905EbuildsRicardo.CordeiroUNCONFIRMEDnet-p2p/btpd-0.15: btpd can't start if BTPDUSER is "root"2011-11-08 21:44:58
390045Keywording and StabilizationjavaUNCONFIRMEDdev-java/antlr : ~arm keyword request2011-11-10 10:47:31
390233Ebuildsmedia-tvUNCONFIRMEDmedia-tv/tvtime : request for patch merge (for wide monitors)2011-11-15 00:33:44
390245Core systembase-systemUNCONFIRMEDsys-fs/mtools-4.0.15 - mcd fails to mount SD memory card (with all available (tested) card readers)2011-11-20 07:19:18
390363Core systemhardened-kernelUNCONFIRMEDsys-kernel/hardened-sources-2.6.32-r42/r68/r73 - Problem with support OCFS2 filesystems2011-12-24 02:47:23
390399JavajavaUNCONFIRMEDicedtea-bin-1.10.4 always redownloads web start application2011-12-05 12:55:11
390751Ebuildsmaintainer-wantedUNCONFIRMEDRequest to add meego-packaging-tools ebuild2011-11-17 12:28:33
390757Core systemsciUNCONFIRMEDsci-mathematics/mcsim: pkg should not be installing /usr/include/random.h (breaks random packages)2011-11-18 19:22:47
390931Libraryx11UNCONFIRMEDmedia-libs/mesa-7.11: /usr/lib/dri/swrast_dri.so: undefined symbol: _glapi_tls_Context2012-04-27 07:05:34
391185UnspecifiedpythonUNCONFIRMED=dev-python/utidylib-0.2-r1 - src_test(): Segmentation fault in trial2012-02-18 20:19:49
391317Enhancement/Feature Requestsdev-portageUNCONFIRMEDsys-apps/portage: Multiple, consistent verbosity levels for emerge2011-11-22 13:28:07
391339EbuildshsggebhardtUNCONFIRMED[systemd overlay] sys-apps/systemd-units kdm.service long stopping2013-02-07 20:46:36
391721Applicationslu_zeroUNCONFIRMEDapp-emulation/qemu-user-0.12.2 USE=static - lib64/libc.a(elf-init.o): In function `__libc_csu_irel':2012-01-16 15:48:56
391767Ebuildsmaintainer-wantedUNCONFIRMED[EBuild Request] QDjango2011-12-10 07:31:25
391793Core systemtoolchainUNCONFIRMEDsys-devel/binutils-2.22 fails tests2013-01-15 14:18:56
391809Core systembase-systemUNCONFIRMEDSystem fails to reboot/halt when root is on iSCSI2012-08-21 07:24:59
392061Ebuildssci-chemistryUNCONFIRMEDsci-chemistry/platon-20110126 checksum failure - version bump ?2011-11-29 15:58:48
392349VulnerabilitiessecurityUNCONFIRMEDsys-devel/gdb Loads untrusted files with possible arbitrary code execution (CVE-2011-4355)2011-12-30 07:19:51
392379ApplicationsvmwareUNCONFIRMEDapp-emulation/vmware-modules-238.5: vmmon-only/linux/hostif.c:2749:4: error: implicit declaration of2012-03-26 11:36:37
392681Core systemclusterUNCONFIRMEDsys-devel/distcc[avahi] init script needs to depend on dbus for zeroconf2013-02-03 13:13:16
392767Ebuildsx11UNCONFIRMEDmedia-libs/mesa: Bad string substitution in mesa-7.11.2.ebuild (when doing a prefix build with 'dri'2011-12-04 13:02:37
392769ApplicationspatrickUNCONFIRMEDapp-emulation/virtualbox-guest-additions-4.1.6-r1 fails to build from /etc/kernel/postinst.d - make[2012-03-14 22:38:37
393159Core systemtoolchainUNCONFIRMEDsys-libs/glibc-2.13-r4: fails tests2012-08-14 16:22:49
393497GNOMEgnomeUNCONFIRMEDgnome-base/gnome-applets-3.2.1 fails to install if sys-apps/linux-misc-apps is installed2012-08-07 17:34:06
394605Core systembase-systemUNCONFIRMEDsys-process/lsof does not list libraries anymore2012-01-01 13:05:31
394625GamesgamesUNCONFIRMEDgames-action/cavestory+ (new ebuild)2013-01-03 05:34:18
394771Server Problemmirror-adminUNCONFIRMEDChanges to Gentoo Mirror of Star Studio, UESTC2012-07-02 08:20:51
394849GamesgamesUNCONFIRMEDgames-action/shank - A side scrolling beat 'em up with a comic book art style2012-09-23 17:44:45
394957UnspecifiedtexUNCONFIRMED=dev-tex/chktex-1.6.4 fails tests2012-07-07 13:07:17
395095genkernelgenkernelUNCONFIRMEDgenkernel add support for custom location of boot config file2011-12-17 22:26:49
395209Ebuildsrobbat2UNCONFIRMEDnet-misc/memcached-1.4.10 doesn't installs systemd service file2012-12-27 21:45:17
395387Librarymedia-videoUNCONFIRMEDmedia-libs/x264-0.0.20111218 - fatal: ambiguous argument 'origin/master': unknown revision or path n2012-02-04 20:00:18
395397KDEkdeUNCONFIRMEDkde-base/systemsettings-4.7.3: kdm settings->Theme "Get new theme" button doesn't work2012-04-14 08:21:23
395433Core systemdev-portageUNCONFIRMEDdev-libs/libiconv - static archives (*.a) and libtool library files (*.la) do not belong in /2011-12-22 00:37:10
395475Core systembase-systemUNCONFIRMEDsys-devel/libtool-2.4.2 fails tests: 8 failed (5 expected failures).2012-05-23 17:17:13
395481Core systemtoolchainUNCONFIRMEDsys-libs/glibc-2.14.1-r1: stdlib/tst-putenv.out test failure2012-08-14 16:23:11
395491Core systemtoolchainUNCONFIRMEDdev-util/dejagnu-1.5 failed (test phase)2013-01-23 05:24:15
395495ApplicationspythonUNCONFIRMEDdev-lang/python-3.2.2 failed (test phase)2011-12-22 08:56:37
395537Core systembase-systemUNCONFIRMEDsys-process/procps doesn't prints cgroups correctly (systemd releated)2012-01-24 20:57:29
395711KernelsecurityUNCONFIRMEDkernel: tight loop and no preemption can cause system stall (CVE-2011-4621)2011-12-22 19:16:12
395817ApplicationssoundUNCONFIRMEDmedia-libs/libsndfile-1.0.25: fails tests with python-32012-01-18 16:03:11
395929EbuildsroxUNCONFIRMEDrox-base/mime-editor-0.6: uses still python_mod_optimize()2011-12-24 20:01:06
395939Ebuildsmaintainer-wantedUNCONFIRMEDHypertable 0.9.5.4 : ebuild request2012-11-15 17:27:46
395967EbuildssciUNCONFIRMED[science-overlay] embassy-structure-0.1.0-r5 fails to fetch embassy-structure-0.1.0-r5.tar.gz2012-02-20 14:34:07
396045Ebuildsnet-dialupUNCONFIRMEDnet-dialup/gnuradius should install startup files2011-12-26 23:56:22
396131Ebuildsmaintainer-wantedUNCONFIRMEDEbuild Request: sys-apps/tuned2011-12-26 22:41:41
396247Ebuildsmaintainer-wantedUNCONFIRMEDx11-misc/xcompmgr-dana - Dana Jansens's fork of the X Composisting Manager2011-12-28 18:12:36
396351Ebuildsfreedesktop-bugsUNCONFIRMEDsys-power/pm-utils-1.4.1-r2 installs duplicate documents2011-12-29 10:57:28
396431ApplicationsvadimkUNCONFIRMEDapp-emulation/vmware-workstation-8.0.1.528992-r2 - segfault in libnvidia-glcore.so2011-12-29 18:43:30
396467NetbootreleaseUNCONFIRMEDInstall gentoo via PXE (integrated squashfs.image + init patch)2012-08-24 16:17:54
396561ServerhannoUNCONFIRMEDnet-mail/mailman-2.1.14 installs CGIs non-world-readable, breaks under lighttpd2011-12-31 09:30:28
396571ApplicationsziapannocchiaUNCONFIRMEDapp-misc/cwiid - udev-rule for uinput use non exitsting group plugdev2012-08-14 23:26:07
396583ApplicationsgstreamerUNCONFIRMEDmedia-plugins/gst-plugins-ffmpeg-0.10.13-r1 - libavcodec/x86/h264_deblock_10bit.asm:421: error: inva2012-02-29 20:47:12
397355ServersambaUNCONFIRMEDnet-fs/samba cluster flags wrong config file /etc/ctdb/functions2012-01-16 23:57:57
397391ApplicationshwoarangUNCONFIRMEDx11-misc/lightdm doesn't work properly with gnome-base/gdm installed.2013-01-22 22:35:59
397517ServernetmonUNCONFIRMEDapp-admin/sshguard-1.5 add attack signatures for net-misc/asterisk2012-08-19 01:00:03
397863EbuildsdjcUNCONFIRMEDnet-misc/openvpn: add /var/run/openvpn to be ok with selinux and openvpn-status.log file2012-01-29 16:29:33
398167GamesgamesUNCONFIRMEDNew ebuild - games-arcade/steelstorm-br2012-06-07 01:47:17
398253Applicationsandrej.filipcicUNCONFIRMEDnet-fs/openafs-1.6.1_pre1/1.6.1 does not build against 3.1.6/3.2.0-r1 kernel and heimdal-1.5.1-r1/12012-10-29 15:36:44
398295StagesreleaseUNCONFIRMEDstage3-amd64-20120105 has PAGER=/usr/bin/less set but sys-apps/less not installed2013-02-12 19:10:42
398399ApplicationsvimUNCONFIRMEDapp-editors/vim-7.3.393 - if_perl.c:1102:1: error: static declaration of 'XS_VIM_Msg' follows non-st2012-09-29 14:38:20
398491Ebuildsmaintainer-wantedUNCONFIRMEDmedia-sound/qloud-0.30 - Tool to measure loudspeaker frequency and step response, distortions' SPL a2012-01-11 17:10:33
398631EbuildsultrabugUNCONFIRMEDvirtual/logger should rdepend also on >=sys-apps/systemd-382013-01-26 22:46:00
398731Ebuildsmaintainer-wantedUNCONFIRMEDnet-analyzer/slowhttptest-1.3.ebuild Application Layer DoS attack simulator2012-01-13 14:35:35
398755ApplicationspatrickUNCONFIRMEDnet-misc/elliptics-2.11.0.12 - a fault tolerant key/value storage2012-12-25 19:11:17
399009Ebuildsmaintainer-wantedUNCONFIRMEDnet-im/myagent-im - Instant messenger that implements Mail.ru protocol2012-01-17 03:58:52
399011ApplicationsultrabugUNCONFIRMEDapp-admin/rsyslog-5.8.6 logrotate config not working with systemd service2012-10-29 16:10:27
399087ApplicationstexUNCONFIRMEDdev-tex/pgf-2.10: Undefined control sequence "\pgf@test"2012-01-17 04:11:17
399199Ebuildsmaintainer-wantedUNCONFIRMEDmedia-sound/acoustid-fingerprinter - GUI application for submitting audio fingerprints to Acoustid2012-01-17 21:28:50
399265genkernelgenkernelUNCONFIRMEDgenkernel should use menu.lst as default for GRUB_CONF2012-04-13 05:44:28
399333Applicationsmaintainer-wantedUNCONFIRMEDgames-util/wiithon Request for ebuild (bzr)2012-01-19 05:27:59
399339Applicationsmaintainer-wantedUNCONFIRMEDRequest for ebuild of Wii Backup Fusion2012-01-19 15:12:29
399353ApplicationsjerUNCONFIRMEDapp-admin/sysstat-10.0.3 generated daily report file will be truncated by cron.daily (sys-process/vi2012-05-10 14:40:15
399417ServerpythonUNCONFIRMED2013-02-07 19:28:02
399443Developmentrobbat2UNCONFIRMEDapp-portage/g-cpan-0.16.2 refuses to install LWP::UserAgent2012-04-05 01:19:58
399471JavajavaUNCONFIRMEDdev-java/ibm-jre-bin-1.6.0.9_p2-r1: error while loading shared libraries: libstdc++.so.5: cannot op2012-01-27 02:05:35
399491Core systembase-systemUNCONFIRMEDsys-devel/automake-1.11.2-r1 - fails py-compile-basic.test py-compile-basic2.test py-compile-basedir2012-02-06 11:51:29
399619EbuildslackUNCONFIRMEDx11-plugins/gkrellstock-0.5.1 version bump2012-01-22 15:05:17
399711Ebuildsmaintainer-wantedUNCONFIRMED[ebuild request] sys-process/ulatencyd - monitors the system and categorizes the running processes i2012-04-09 14:20:31
399747Ebuildsmaintainer-neededUNCONFIRMEDnet-wireless/broadcom-sta floods logs with "could not get rate/rssi"2013-02-03 13:03:07
399839EbuildsfauliUNCONFIRMEDapp-admin/tmpwatch reports "Cannot stat file" with --fuser on sufficiently loaded system2012-02-17 15:33:53
399843UnspecifiedrafaelmartinsUNCONFIRMEDg-octave/optiminterp-0.3.2 fails to install package database2012-01-25 13:24:50
399867GamesgamesUNCONFIRMEDnew ebuilds: games-action/minetest games-action/minetest_game2013-02-20 16:12:41
400547DevelopmentvoyageurUNCONFIRMEDdev-libs/STLport-5.2.1 does not compile using clang++ due to error in stlport/stl/_locale.h2012-01-25 13:51:23
400585ApplicationsvimUNCONFIRMEDapp-editors/vim-7.3: broken unicode while copy/paste with X PRIMARY and CLIPBOARD2012-01-25 13:56:18
400601ApplicationsgraphicsUNCONFIRMEDmedia-gfx/enblend-4.0 USE=doc - ./auxmac.tex:1: I can't find file `thumbpdf.sty'.2012-01-25 13:59:04
400701GCC PortingadaUNCONFIRMEDdev-lang/gnat-gcc-4.4.5 cannot find system.ads2012-01-25 15:19:05
400763Toolstools-portageUNCONFIRMEDglsa-check list only affected versions2012-01-25 15:50:55
400771EbuildsclusterUNCONFIRMEDsys-cluster/onesis-2.0.3 version bump2012-01-25 19:13:16
400919Unspecifiedfreedesktop-bugsUNCONFIRMEDnet-libs/libproxy-0.4.7 is linking against gnome-base/gconf2012-01-30 07:57:00
400927Core systemwschlichUNCONFIRMEDsys-block/megarc-1.11-r1 needs fetch restriction2012-04-15 19:43:17
400951HardenedhardenedUNCONFIRMEDJava does not run properly on non-root with Grsecurity Hardened Gentoo [workstation] level2012-01-26 19:28:36
400997Ebuildsmaintainer-wantedUNCONFIRMEDnet-analyzer/httest - Http Test Tool2012-10-25 13:52:31
401317ApplicationsbluenessUNCONFIRMEDnet-misc/curl-7.24.0: test cases failed: 1007 1009 1049 1093 1094 10992012-03-24 18:04:32
401475Core - Ebuild Supporttools-portageUNCONFIRMEDgentoolkit.query throws exceptions on close sys.stdin2012-01-30 13:28:31
401503Enhancement/Feature Requestsdev-portageUNCONFIRMEDemerge please ad short option to autounmask-write, -w suggested2012-01-30 17:48:55
401523Applicationsx11UNCONFIRMEDx11-apps/xdm-1.1.11: does not start from within a chrooted environment if LiveDVD was booted with no2012-01-31 19:37:14
401823Applicationspolynomial-cUNCONFIRMEDseamonkey desktop file lists unhandled mimetype associations2012-02-16 12:48:55
401849Keywording and Stabilizationbase-systemUNCONFIRMEDPlease stabilize =sys-libs/libraw1394-2.0.72012-04-16 06:43:02
401943Applicationssci-biologyUNCONFIRMEDsci-biology/transfac-3.2 - tfextract segmentation fault in 0x00007f5df6cc4487 in ajStrDel (Pstr=0x72012-02-04 17:26:44
402023KernelsecurityUNCONFIRMEDThe Linux kernel, when using IPv6, allows remote attackers to determine whether a host is sniffing t2012-02-03 04:38:20
402027EbuildspythonUNCONFIRMEDdev-python/django-1.3.1 with dev-python/psycopg-2.4.2 fails app/project tests2012-04-28 20:35:29
402057Core systembase-systemUNCONFIRMEDsys-power/apcupsd-3.14.10-r1 - daemon fails to stop during shutdown2012-08-03 19:38:52
402067Ebuildsmaintainer-wantedUNCONFIRMEDdev-utils/statifier - creates one file from dynamically linked executables and all its libraries2012-04-09 15:46:20
402101Applicationsmaintainer-wantedUNCONFIRMEDmedia-video/mplayer-vaapi live ebuild request2012-11-12 21:03:16
402245Core systembase-systemUNCONFIRMEDsys-fs/dosfstools-3.0.12 dosfslabel does not work if long file names are used in partition2013-01-23 19:12:35
402347OpenRCopenrcUNCONFIRMEDnet.wlan0 fails to auto-start with 2013-02-03 08:30:09
402355Applicationspam-bugsUNCONFIRMEDsys-auth/pam_keystore HOMEPAGE outdated (404)2012-02-06 20:31:29
402411Ebuildsmaintainer-wantedUNCONFIRMEDGitauth ( ebuild request )2012-02-14 10:57:23
402493ApplicationsadaUNCONFIRMEDdev-ada/adasockets-1.8.4.7 - gnatmake: "listener.adb" compilation error2012-02-07 17:45:08
402627Ebuildsmaintainer-wantedUNCONFIRMEDnet-mail/iredmail ebuild request2012-02-08 06:54:28
402645Developmentrobbat2UNCONFIRMEDapp-portage/g-cpan-0.16.4 fails to install Spreadsheet::XLSX due to "[in]correct package syntax"2012-02-13 21:18:27
402741GamesgamesUNCONFIRMEDNew ebuild: games-rpg/analogue-demo - Analogue: A Hate Story2012-02-08 19:14:06
402763EbuildsgstreamerUNCONFIRMEDmedia-plugins/gst-plugins-ffmpeg-0.10.13-r1 - libavcodec/arm/dsputil_vfp.S:45: Error: selected proce2012-02-09 01:08:01
402817Portage Documentationbase-systemUNCONFIRMEDapp-arch/tar: Man page does not list that -p is default for superuser2012-02-09 08:30:53
402835Applicationssci-biologyUNCONFIRMEDsci-biology/ucsc-genome-browser: add -fPIC to CFLAGS and USE=+static-libs2013-02-17 08:24:19
402925Ebuildsrobbat2UNCONFIRMEDdev-libs/yaz-3.0.50 with dev-libs/libgpg-error-1.10-r1[-static-libs] - libtool: grep: /usr/lib/libgp2012-02-10 18:05:02
403123Unspecifiedshell-toolsUNCONFIRMEDapp-shells/gentoo-bashcomp - Add ebuild(1) --skip-manifest completion support2012-02-13 17:23:49
403135ApplicationsclusterUNCONFIRMEDsys-cluster/ipvsadm - libipvs does not report ipvs-backup-threads2012-02-14 17:09:34
403249Core systembase-systemUNCONFIRMEDsys-apps/coreutils-8.14: Fails test-parse-datetime (exit: 134)2012-03-29 07:20:53
403279Core systembase-systemUNCONFIRMED=sys-apps/coreutils-8.15 fails FEATURES=test2012-02-18 16:37:27
403301Applicationsx11UNCONFIRMEDx11-apps/intel-gpu-tools-1.1 - work/intel-gpu-tools-1.1/tests/testdisplay.c:760:38: error: storage s2012-02-14 18:04:33
403317EbuildssystemdUNCONFIRMEDsys-apps/pcsc-lite - Add a systemd unit2012-12-27 21:50:11
403325Prefix SupportprefixUNCONFIRMEDbootstrap: bzip2 links against non-existent $EPREFIX/usr/lib/libbz2.1.dylib2012-08-10 09:44:45
403407ApplicationspythonUNCONFIRMEDdev-python/rst2pdf - Add SVG support (IUSE=svg)2012-02-15 16:25:10
403471ApplicationsproaudioUNCONFIRMEDmedia-sound/rezound-0.12.3_beta-r2 - work/rezound-0.12.3beta/src/frontend_fox/../../src/PoolFile/TSt2012-02-14 18:25:30
403473Applicationsidl0rUNCONFIRMEDmedia-plugins/vdr-xineliboutput-1.0.5-r1 - xine_post_audiochannel.c:97:7: error: ‘post_audio_port_t’2012-09-27 15:47:31
403551OtheraltUNCONFIRMEDCompilation of gcc-4.5.3-r1 fails with "configure: error: Link tests are not allowed after GCC_NO_EX2012-02-14 10:57:13
403649Applicationssci-chemistryUNCONFIRMEDsci-chemistry/gperiodic-2.0.10-r2 doesn't honor LINGUAS for locale files2012-02-23 21:47:07
403761Prefix SupportclusterUNCONFIRMED[science overlay] sys-cluster/hpl-2.0-r1 build failure2012-02-15 03:59:25
403953ServerpatrickUNCONFIRMEDwww-servers/apache-2.2.21 - CONNECT does not work over existing SSL connection2013-02-16 14:06:13
404157Coredev-portageUNCONFIRMEDsys-apps/portage : die in pkg_pretend() stops --keep-going from working2012-03-19 16:35:13
404273Ebuildsmaintainer-wantedUNCONFIRMEDx11-misc/dunst-9999 - (new ebuild) lightweight notification system with the looks of dmenu2012-07-02 10:02:30
404389Core systembase-systemUNCONFIRMED=sys-process/procps-3.3.3 fails tests2013-01-12 11:43:39
404423Unspecifiedcommon-lispUNCONFIRMEDdev-lisp/ecls-12.2.1 fails to run tests - An error occurred during initialization: Module error: Don2013-02-02 10:15:50
404427HardenedhardenedUNCONFIRMEDdev-python/cvxopt-1.1.4-r1 test suite triggers ssp2012-02-18 17:56:36
404439Ebuildsmaintainer-wantedUNCONFIRMEDapp-backup/rear - Fully automated disaster Recovery for GNU/Linux2013-01-18 12:20:52
404503Core systemvserver-devsUNCONFIRMEDsys-cluster/vzctl - add_ip.sh should add IPv6 default route2013-02-16 13:28:07
404589GamesgamesUNCONFIRMEDgames-arcade/jamestown: new ebuild2012-05-01 02:25:47
405151ApplicationspatrickUNCONFIRMEDapp-emulation/virtualbox-guest-additions-4.1.4-r1: Failure to build with 3.2 kernel2012-04-02 07:44:24
405183ApplicationspythonUNCONFIRMEDdev-python/reportlab should not depend on media-fonts/ttf-bitstream-vera2012-02-22 18:19:40
405195ApplicationsbazaarUNCONFIRMEDdev-vcs/bzr-2.4.2 fails tests (test_btree_index)2012-09-18 11:45:46
405277ServerclusterUNCONFIRMEDsys-cluster/maui-3.3.1-r2 build time secret key configuration2012-05-05 21:15:46
405325Core systemtoolchainUNCONFIRMEDsys-devel/autogen-5.11.2: src_test left an orphan process running in the background2012-03-22 14:50:16
405407Ebuildsmaintainer-wantedUNCONFIRMEDwww-misc/ppastats - a command line tool which retrieve statistics of a PPA and generates HTML pages.2012-02-23 22:08:20
405437ServerclusterUNCONFIRMEDsys-cluster/maui-3.3.1-r2 should CONFIG_PROTECT its configuration files2012-05-05 21:12:02
405461Ebuildsmaintainer-wantedUNCONFIRMEDapp-editors/sublime-text - a sophisticated text editor for code, html and prose2012-11-18 12:37:09
405483Ebuildsdesktop-miscUNCONFIRMEDx11-misc/xautolock should install an init.d script2012-02-24 05:08:34
405549LibrarysrinclanUNCONFIRMEDdev-python/pywebkitgtk-1.1.8 crashes at start when using Pax/Hardened2012-06-10 01:24:13
405643Ebuildsmaintainer-wantedUNCONFIRMEDapp-misc/stackapplet-1.5.1 - a small application that uses the new AppIndicator framework to display2012-02-26 17:22:22
405649Ebuildssci-geosciencesUNCONFIRMEDsci-geosciences/openstreetmap-icons-20110601 does not compile2012-03-16 09:50:52
405813Ebuildsmedia-videoUNCONFIRMEDmedia-libs/libvpx-1.0.0 USE=ssse3 - x86_systemdependent.c:(.text+0x263): undefined reference to `vp82013-01-15 22:37:22
405843Ebuildsmaintainer-wantedUNCONFIRMED=mail-client/bower-9999 - A curses client for the Notmuch email system2012-02-27 01:29:23
406255Sandboxmaintainer-neededUNCONFIRMEDdev-libs/apr-1.4.6 failed test: testlfs : \/bin/bash: line 2: 3428 Segmentation fault (core d2012-12-29 17:08:08
406333ApplicationshannoUNCONFIRMEDmedia-gfx/gimp-2.6.12 - Black and yellow striped rectangle on zoom2012-04-02 22:14:48
406583ApplicationschithanhUNCONFIRMEDwww-plugins/lightspark-0.5.4.1-r1 build fails - error regarding some ffmpeg stuff (?)2012-03-03 01:49:39
406685Ebuildsnet-p2pUNCONFIRMEDapp-arch/torrentzip-0.9 version bump request2012-12-30 07:20:56
406723Core systembase-systemUNCONFIRMEDsys-devel/autoconf-2.13: Fails test AC_FUNC_GETLOADAVG2013-01-16 01:39:00
406773Keywording and Stabilizationsci-mathematicsUNCONFIRMED=sci-mathematics/maxima-5.28.0: Please stabilize2013-01-14 12:35:08
406779Keywording and Stabilizationsci-mathematicsUNCONFIRMED=sci-mathematics/wxmaxima-12.09.0: Please stabilize.2012-11-11 04:21:47
406811Coredev-portageUNCONFIRMEDFeature request: enhance portage with "buildsrcpkg" that captures all source files for GPL complianc2012-03-04 07:20:32
406855EbuildsjsbronderUNCONFIRMEDsys-cluster/ganglia: Install gmetad-python.2013-02-15 17:46:20
406865Ebuildsmaintainer-wantedUNCONFIRMEDwww-servers/distcache - Distributed session caching2012-03-05 20:17:46
406937Ebuildsmaintainer-wantedUNCONFIRMEDdev-libs/rapidxml-1.13 - an attempt to create the fastest XML parser possible2012-03-05 20:41:21
407077Core systemtoolchainUNCONFIRMEDsys-devel/autogen-5.12: Fails cond.test.2012-03-06 17:01:37
407155UnspecifiedjsbronderUNCONFIRMEDsys-cluster/openmpi - Rmpi fails to install under dev-lang/R-2.14.2 due to undefined symbol: mca_bas2012-05-11 12:13:24
407173ApplicationsclusterUNCONFIRMEDsys-devel/icecream: distributed jobs fail because of missing libraries2012-06-27 00:00:39
407227baselayoutnet-dialupUNCONFIRMEDnet-dialup/ppp - /etc/init.d/net.ppp0 goes into endless loop after openvpn was stopped2012-04-22 20:16:25
407277Core systemsystemdUNCONFIRMEDsys-fs/mdadm - add support for systemd2013-02-04 15:19:48
407329Keywording and Stabilizationbase-systemUNCONFIRMEDplease stabilize sys-process/runit-2.*2012-03-07 20:54:07
407349Ebuildsmaintainer-wantedUNCONFIRMEDapp-misc/mpdlcd - Display MPD status on a lcdproc server2012-03-08 21:41:55
407471Applicationsmaintainer-wantedUNCONFIRMEDsys-cluster/blcr: a checkpoint and restart kernel support2012-03-09 15:14:37
407589Ebuildsmaintainer-wantedUNCONFIRMEDdev-python/factory_boy : A versatile test fixtures replacement2012-03-12 12:07:45
407627Applicationsrobbat2UNCONFIRMEDsys-power/pmtools-20110323 turbostat.c:857:2: error: PIC register clobbered by ‘ebx’ in ‘asm’2012-10-07 09:44:42
407667Ebuildsmaintainer-neededUNCONFIRMEDnet-wireless/broadcom-sta-5.100.82.112-r2 has broken multicast patch2013-02-03 13:03:15
407791Applicationsweb-appsUNCONFIRMEDwww-apps/drupal-7.12 Shows "Illegal string offset" Warning2012-03-13 11:22:43
407813EbuildspythonUNCONFIRMEDPlease stabilize dev-python/fabric-1.2.22012-11-09 18:32:51
407841ApplicationsperlUNCONFIRMED=dev-lang/perl-5.14.2[build] is missing feature.pm, required by aclocal (during stage building)2012-05-27 02:40:44
407983GamesgamesUNCONFIRMEDsave/restore bug on games-roguelike/rogue-5.4.42012-08-27 09:29:55
408047Core systembase-systemUNCONFIRMEDsys-fs/cryptsetup-1.4.1 fails 4 tests : password-hash-test loopaes-test compat-test api-test2013-01-20 10:26:44
408089Keywording and Stabilizationrobbat2UNCONFIRMEDsys-power/pmtools-20110323: stabilize any version providing turbostat utility2012-10-07 09:45:03
408151LibraryperlUNCONFIRMEDdev-perl/Cairo-1.90.0 with dev-lang/perl-5.14.2 - Failed 1/8 test programs. 6/270 subtests failed.2012-04-03 19:32:36
408153ApplicationsgnustepUNCONFIRMED[gnustep overlay] gnustep-apps/sogo-1.3.14 and 2.0.0rc1 version bumps2012-11-22 15:43:06
408157ApplicationselvanorUNCONFIRMEDnet-voip/sflphone-1.0.1 should install addressbook plugin2012-03-14 18:10:03
408263ApplicationsnetmonUNCONFIRMED=net-analyzer/fail2ban-0.8.6 iptables bans lost on restart2012-03-15 15:16:00
408349Applicationsmaintainer-wantedUNCONFIRMEDEbuild request: sys-block/xnbd, another much more advanced NBD server2012-03-15 15:11:46
408729Ebuildsmaintainer-wantedUNCONFIRMEDapp-misc/shelr - console screencasting tool2012-06-03 20:50:21
408825ApplicationsnetmonUNCONFIRMEDnet-analyzer/ntop-4.1.0 No interface has been configured. Please configure ntop first.2012-08-11 18:16:20
409011Applicationsrobbat2UNCONFIRMEDapp-portage/g-cpan-0.16.4 'g-cpan -u' fails with Invalid ebuild name: /var/lib/cpan/perl-gcpan/Best/2012-03-23 07:38:06
409041Core systemtoolchainUNCONFIRMEDcross-x86_64-linux-uclibc/gcc-4.6.2: fails on gcc-stage1 - work/gcc-4.6.2/libgcc/generic-morestack-t2012-03-20 21:02:01
409119ApplicationscppUNCONFIRMEDdev-libs/STLport-5.2.1 - Fatal error: can't create obj/gcc/so/dll_main.o: No such file or directory2012-03-21 09:41:23
409181Applicationsrobbat2UNCONFIRMEDapp-misc/g15stats - script does not parse extra options2013-01-31 19:03:48
409189EbuildsflameeyesUNCONFIRMEDapp-emulation/lxc-0.8.0_rc2-r1 : add {pre,post}{up,down} capabilities to init script [patch]2012-10-02 07:36:42
409385baselayoutbase-systemUNCONFIRMEDsys-apps/baselayout should be init agnostic2012-05-17 19:52:52
409555Applicationsnet-imUNCONFIRMEDnet-im/gg-transport-2.2.4 segmentation fault in local_translate (str=0x34eb52fbcac "\203=\365\377\062012-12-16 14:28:04
409653Core systemxmwUNCONFIRMEDsys-power/suspend-0.8-r1 - Hibernate freezes on "Snapshotting system..." when firefox is working2012-03-26 19:00:56
409787OpenRCopenrcUNCONFIRMEDsys-apps/openrc-0.9.9.3: "rc-status -a" doesn't display all started services2012-11-07 15:40:11
409915Ebuildsmaintainer-wantedUNCONFIRMEDx11-themes/dmz-cursor-theme-0.4.3 - Style neutral, scalable cursor theme2012-03-28 00:20:23
409943EbuildshannoUNCONFIRMEDmail-mta/courier installs esmtpd with bad permissions2012-06-28 11:34:17
410017Ebuildsnet-imUNCONFIRMEDnet-im/ejabberd - add patch for remote roster2013-01-24 10:41:29
410033Core systemmaintainer-neededUNCONFIRMEDsys-power/cpufreqd crashes on AC transition or startup with ACPI battery support2012-11-18 12:15:37
410293Keywording and StabilizationchutzpahUNCONFIRMEDStable request for www-plugins/mozplugger-1.14.32013-02-21 08:38:30
410327Ebuildsmaintainer-wantedUNCONFIRMEDsys-power/powerpanel - Software for CyberPower Systems UPS devices2012-04-02 01:53:22
410343Ebuildsmaintainer-neededUNCONFIRMEDnet-wireless/broadcom-sta - modprobe wl: ERROR: could not insert 'wl': No such file or directory2013-02-03 13:03:43
410371ApplicationslackUNCONFIRMEDwww-plugins/adobe-flash-11.2.202.228 segmentation fault in mozalloc_abort(char const*) () from /usr/2012-12-15 19:35:06
410389ApplicationstomjbeUNCONFIRMEDmedia-radio/fldigi segfaults at start up2012-04-07 22:14:10
410395Ebuildsalsa-bugsUNCONFIRMEDmedia-sound/alsa-firmware always installs hdsp/hdspm firmware2012-04-02 02:24:32
410453Ebuildsidl0rUNCONFIRMEDwww-apache/mod_perl does not build against www-servers/apache2-2.4.1-r22012-11-27 18:54:34
410477ApplicationsbluenessUNCONFIRMEDnet-p2p/bitcoind-0.5* - init.d script's stop action fails to stop daemon2013-01-25 18:58:34
410553UnspecifiedswaponUNCONFIRMEDx11-drivers/xf86-video-virtualbox / app-emulation/virtualbox-guest-additions fail to cross-compile2012-04-03 15:23:22
410585Applicationsmedia-videoUNCONFIRMEDInconsistent flag name in some packages - webm and vpx2012-04-07 16:33:55
410595Ebuildsmaintainer-wantedUNCONFIRMEDsys-apps/fwts Firmware Test Suite2013-02-09 20:17:55
410605Core systembase-systemUNCONFIRMEDsys-apps/util-linux-2.20-r1: fsck complains about checking file systems mounted ro2013-02-05 14:52:10
410663Applicationsford_prefectUNCONFIRMEDmedia-sound/pulseaudio - without "flat-volumes = no" in daemon.conf pulseaudio doesn't restore mixer2012-04-04 07:10:48
410677Ebuildsdev-embeddedUNCONFIRMEDdev-embedded/libftdi-9999.1.0: install docs from cmake build directory2012-04-03 20:37:04
410679Ebuildsdev-embeddedUNCONFIRMEDdev-embedded/libftdi-9999.1.0: add ability to install ftdi_eeprom utility2013-02-06 04:19:56
410699ApplicationspatrickUNCONFIRMEDwww-servers/apache-2.4.1-r2 /etc/init.d/apache2 start complains about Config variable ${SVN_REPOS_LO2013-02-16 13:32:09
410727ApplicationsgnustepUNCONFIRMEDgnustep-base/gnustep-back-xlib-0.18.0 - sandbox violation in /root/var by plmerge libgnustep-back-012012-05-02 06:36:52
410829Applicationsmr_bones_UNCONFIRMEDapp-admin/syslog-ng use "dbi" use flag instead of "sql"2012-04-05 02:44:56
410923Core systemkernel-miscUNCONFIRMEDsys-kernel/module-rebuild - command line options are consistent (should be "module-rebuild --action"2012-04-06 14:44:25
411087Core systemmaintainer-wantedUNCONFIRMEDsys-fs/ddumbfs-1.0.11 - An inline data deduplicating filesystem designed with backup in mind2012-04-07 14:35:41
411171GNOMEgnomeUNCONFIRMEDgnome-base/gnome-shell crashes when LIBGL_ALWAYS_INDIRECT=1 ist set2012-04-07 22:21:10
411173Ebuildsmaintainer-wantedUNCONFIRMEDsys-cluster/orangefs-2.8.5 - a branch of the PVFS2 cluster filesystem2012-04-09 18:51:41
411367EbuildsevermindUNCONFIRMED[pro-audio overlay] media-sound/glashctl-0.4.[2|3] - lashserverinterface.cpp: In constructor 'LASHSe2012-04-11 01:40:34
411461OpenRCopenrcUNCONFIRMEDsys-apps/openrc-0.9.8.4: services fail to start at boot because of "stalled" deptree cache2012-04-10 12:21:07
411619Ebuildsmaintainer-wantedUNCONFIRMEDmedia-sound/rockbox-utility - Graphical utility for automating Rockbox firmware installation and man2012-11-07 20:02:26
411643ApplicationsfontsUNCONFIRMEDapp-arch/cabextract - consistent USE flag naming? - rename USE2012-04-12 01:14:50
411815OpenRCopenrcUNCONFIRMEDsys-apps/openrc-0.9.8.4 does not install ethtool_ring and txqueuelen params for network cards in bon2012-05-05 17:48:36
411901EbuildsvadimkUNCONFIRMEDapp-emulation/vmware-workstation-8* - Add system.d service2012-09-09 03:55:17
411973Ebuildsmaintainer-wantedUNCONFIRMEDapp-bacup/burp - Backup client/server for Unix and Windows systems2012-04-16 10:29:51
412119Ebuildsandrej.filipcicUNCONFIRMEDnet-fs/openafs-1.6.1 should install user-friendly docs (and not docbook files)2012-09-24 06:59:46
412135PrintingreavertmUNCONFIRMEDapp-text/poppler-0.16.7 and 0.20.2: pdftops creates postscript files which don't print on Brother MF2012-11-25 21:17:48
412273Developmentdev-embeddedUNCONFIRMEDdev-embedded/avr-libc-1.8.0 probable preprocessor mistake in inttypes.h2012-04-17 15:26:21
412303ApplicationsjlecUNCONFIRMEDsci-chemistry/gsim[opengl] segfaults2012-04-17 17:28:23
412493Ebuildsmaintainer-wantedUNCONFIRMEDmedia-tv/mumudvb - (Multi Multicast DVB) is a program for streaming TV over a network originally bas2012-04-18 17:40:58
412551Applicationshardened-kernelUNCONFIRMEDsys-kernel/hardened-sources-3.2.12 + qemu-kvm: rcu_shed detected stall on CPU2012-08-06 00:30:12
412909EbuildsembeddedUNCONFIRMEDx11/libxcb: xcb-proto should be RDEPEND instead of DEPEND or cross compiling fail2012-05-10 03:29:04
413041ApplicationssciUNCONFIRMEDsci-misc/boinc fails(?) when ntpdate (/etc/init.d/ntp-client) is used to abruptly change the system 2012-04-24 20:13:47
413191VulnerabilitiessecurityUNCONFIRMEDapp-portage/pfl - /usr/bin/e-file is too trusting of HTTP response.2012-06-18 06:04:49
413197DefaultdevrelUNCONFIRMEDcardoe's revoked gpg key on active dev list2012-09-07 20:23:54
413203DefaultdevrelUNCONFIRMEDcedk's revoked gpg key on active dev list2012-08-15 21:44:38
413217DefaultdevrelUNCONFIRMEDnirbheek's revoked gpg key on active dev list2012-08-09 10:43:08
413263Keywording and StabilizationperlUNCONFIRMEDPlease stabilize =perl-core/MIME-Base64-3.130.0 and virtual/perl-MIME-Base64-3.130.0-r22012-11-01 08:46:25
413389Ebuildsmaintainer-wantedUNCONFIRMEDmedia-fonts/prosto-1 - New font for project of free fonts www.jovanny.ru / / Font has multilanguage 2012-04-24 19:51:59
413417EbuildsalexxyUNCONFIRMEDsys-cluster/glusterfs - Stopping glusterd init script should not kill the glusterfsd processes2012-12-07 13:08:00
413451Ebuildsweb-appsUNCONFIRMEDwww-apps/mantisbt uses system adodb, breaks Mantis' SOAP API2013-02-16 14:07:26
413457Applicationsmedia-tvUNCONFIRMEDmedia-tv/dvbstreamer-2.1.0 version bump2012-04-29 13:11:46
413489ApplicationsgnustepUNCONFIRMEDgnustep-base/gnustep-gui-0.22.0 - ld: warning: libicuuc.so.48, needed by /usr/lib64/libgnustep-gui.s2012-05-05 21:04:42
413621Core systembase-systemUNCONFIRMEDsys-apps/coreutils-8.15 - src_test(): errors setting up rm/deep-2 and du/long-from-unreadable2012-11-20 03:30:47
413661Librarymedia-videoUNCONFIRMEDmedia-libs/x264-0.0.20111220 on x86 enables SSE even on non-SSE host2012-04-27 15:27:08
413695Unspecifiedppc64UNCONFIRMEDinstall-powerpc-minimal-20120415.iso is not bootable2012-04-27 15:05:40
413793ApplicationsvadimkUNCONFIRMEDapp-emulation/vmware-workstation-8.0.2.591240 should tell users to be in vmware group2012-05-01 22:10:58
413981Core systemx11UNCONFIRMEDsys-kernel/gentoo-sources-3.2.12: i915 driver sets strange resolution 1922x1080 on HDMI2012-05-01 05:35:57
414593PrintingprintingUNCONFIRMEDapp-text/ghostscript-gpl 9.05-r1 - ld: error in ./sobin/libgs.so(.eh_frame); no .eh_frame_hdr table 2012-12-19 23:42:44
414621Keywording and Stabilizationweb-appsUNCONFIRMEDPlease stabilize >=www-apps/bugzilla-3.6.92012-10-09 19:32:34
414623Core systemjsbronderUNCONFIRMEDsys-cluster/torque-4.0.1 version bump2012-05-04 21:38:17
414697EbuildshannoUNCONFIRMEDnet-analyzer/greenbone-security-assistant-3.0.3 version bump2012-10-10 19:39:05
414793Core systemclusterUNCONFIRMEDsys-cluster/maui-3.3.1-r2 - ERROR: cannot setpgrp, errno: 1 (Operation not permitted)2012-08-06 03:49:46
414811PMS/EAPIpms-bugsUNCONFIRMED[Future EAPI] globstar shell option enabled by default2013-02-07 19:03:35
414817PMS/EAPIpms-bugsUNCONFIRMED[Future EAPI] Support for make.defaults, use.force, use.stable.force, use.mask, use.stable.mask, pac2013-01-12 13:13:11
414829Applicationseric.joshua.martinUNCONFIRMEDwww-apps/rt-4.0.5: Generated.pm configured directories point to /usr/share/webapps instaed of webapp2012-05-06 22:45:45
415073Applicationsmaintainer-neededUNCONFIRMEDmedia-gfx/freecad-0.12.5284-r2 fails multilib-strict2012-08-24 18:17:55
415209Enhancement/Feature Requestsdev-portageUNCONFIRMEDcross-emerge into alternative root does not install build time dependencies in alternative root2012-05-09 19:26:34
415221Core systemtoolchainUNCONFIRMEDcross-i686-pc-mingw32/gcc-4.5.3-r2 g++ can't link programs with STL2012-06-29 20:29:50
415305EbuildssoundUNCONFIRMEDmedia-sound/shoutcast-server-bin - update HOMEPAGE so that pkg_nofetch() is more helpful2012-10-28 04:33:12
415359Core systemhsggebhardtUNCONFIRMED[systemd overlay] sys-apps/systemd-units: Support kexec2012-05-10 23:45:09
415399EbuildsfauliUNCONFIRMEDapp-portage/g-ctan-2011.1 does not list pgfplots in CTAN database2012-12-16 13:13:12
415443Ebuildsmaintainer-wantedUNCONFIRMEDnet-fs/junglediskworkgroup-3.16 - Networked storage/backup using Amazon's S3 service2012-07-28 23:06:49
415457Ebuildssci-electronicsUNCONFIRMEDsci-electronics/systemc-2.2.0-r2 is broken2012-05-11 15:07:47
415607ApplicationslxnayUNCONFIRMEDx11-apps/ardesia-1.0 version bump request2012-05-12 19:55:08
415685ApplicationsforensicsUNCONFIRMEDapp-forensics/magicrescue-1.1.9 installs broken dupemap2012-05-15 14:28:47
415699Core systemclusterUNCONFIRMEDsys-cluster/maui-3.3.1-r2: showstats segfaults2012-10-05 16:06:37
415701Core systemjsbronderUNCONFIRMEDsys-cluster/torque-3.x[cpusets] fails on 3.2.x kernels2012-11-02 17:51:04
415705EbuildsmozillaUNCONFIRMEDdev-libs/nspr-4.9: native-nsinstall: cannot access nspr-config (error installations by cross compila2013-01-05 13:03:46
415789ApplicationsjlecUNCONFIRMEDapp-arch/p7zip-9.20.1-r1 fails tests2012-05-30 19:15:06
415799Core systembase-systemUNCONFIRMEDsys-devel/autoconf-2.69 fails test Go2012-05-15 14:45:53
415801GNOMEgnomeUNCONFIRMEDwww-client/epiphany-3.4.1 fails test test-ephy-embed-single2012-09-16 08:52:40
415829Ebuildsmaintainer-wantedUNCONFIRMEDsci-chemistry/cclib-1.0.1 - Library for parsing and interpreting the results of computational chemis2012-05-15 15:01:01
416047ApplicationsmozillaUNCONFIRMEDdev-libs/nss-3.13.{3,4} - die "Failed to detect whether your arch is 64bits or 32bits, disable distc2012-05-16 02:51:26
416147Prefix SupportprefixUNCONFIRMEDeix-0.25.4 fails to install with chown: invalid user: ‘portage:portage’2012-05-22 16:31:08
416161EbuildslackUNCONFIRMEDx11-misc/nts-82 version bump request2012-05-16 03:08:43
416199EbuildsgraphicsUNCONFIRMEDmedia-gfx/sxiv-9999: live ebuild request2012-05-16 11:41:18
416211Keywording and StabilizationgamesUNCONFIRMEDPlease stabilize app-emulation/vice-2.3 for PPC2012-05-16 11:36:08
416361Core systembase-systemUNCONFIRMEDapp-arch/dump-0.4.44-r1 restore crashes restoring UNIX-domain socket with very long name2012-05-18 14:49:10
416829Applicationsgnome-officeUNCONFIRMEDapp-office/abiword-2.8.6-r2: USE=gnome is misleading, suggesting USE=goffice2012-07-07 13:04:16
416903ApplicationslivecdUNCONFIRMEDsys-block/parted-3.1 fails tests [t8001-loop-blkpg.sh t2100-zerolen.sh]2012-05-21 14:59:50
417161Ebuildsmaintainer-wantedUNCONFIRMEDsys-fs/csvfs - file system representation of CSV data2012-06-10 03:48:18
417175EbuildshardenedUNCONFIRMEDapp-admin/bastille-3.0.9: homepage is not correct2012-05-22 21:45:41
417187GamesgamesUNCONFIRMEDgames-puzzle/world-of-goo installs 32-bit binary on 64-bit system, causing shadow dependency on emul2012-06-03 13:44:16
417263EbuildsembeddedUNCONFIRMEDsys-apps/busybox - USE=make-symlinks should not overwrite existing files2012-06-28 04:01:46
417295Ebuildsmaintainer-wantedUNCONFIRMEDmedia-video/sview-12.05 - a universal stereoscopic player which supports image viewing and movie pla2012-10-14 10:12:17
417313Unspecifiedkernel-miscUNCONFIRMEDsys-fs/avfs-1.0.0 ecompressdir stumbles over an symlink2012-05-24 14:13:30
417395ApplicationsproaudioUNCONFIRMEDmedia-plugins/ir_lv2 - make & install "convert4chan"-tool2012-05-24 16:48:34
417429ApplicationssoundUNCONFIRMEDmedia-sound/jack-3.1.1 - src_install(): SyntaxError: ('invalid syntax', ('/usr/lib64/python2.7/site-2013-01-27 12:28:16
417561GamesgamesUNCONFIRMEDgames-rpg/monsterrpg2: new ebuild2012-10-19 04:48:30
417597Repomandev-portageUNCONFIRMEDsys-apps/portage: repoman: Improve description of {P,R}DEPEND.suspect (rename .suspect to .blacklist2012-05-26 11:26:14
417639DevelopmentswegenerUNCONFIRMEDdev-util/systemtap-1.7: error: gettext infrastructure mismatch: using a Makefile.in.in from gettext 2012-12-15 13:34:09
417661ApplicationsjlecUNCONFIRMEDgnome-extra/zeitgeist-datasources[bzr] dev-vcs/bzr-gtk file collision: /usr/share/pixmaps/bzr-icon-62012-05-28 00:01:10
417687ApplicationsmozillaUNCONFIRMEDmail-client/thunderbird www-client/seamonkey segfault at startup if nss_ldap/openldap are installed2012-10-22 16:13:48
417711ApplicationsgraphicsUNCONFIRMEDmedia-gfx/graphviz-2.26.3-r4 + distcc - iffe: x86_64-pc-linux-gnu-gcc : not a C compiler: should not2012-06-05 19:48:49
417755Conceptual/Abstract Ideasdev-portageUNCONFIRMEDRecord emerge stages.2012-05-27 22:45:12
417875ApplicationsradhermitUNCONFIRMEDmedia-gfx/wkhtmltopdf should install man page2012-05-28 11:33:37
417895JavajavaUNCONFIRMEDdev-java/stringtemplate-4.0.6 released2012-12-07 19:10:27
418115ApplicationsmozillaUNCONFIRMEDwww-client/firefox-12.0-r2 ignores ccache when both ccache and distcc are enabled2012-07-15 05:38:36
418161Hardenedx11UNCONFIRMEDmedia-libs/mesa-8.0.3 test causes buffer overflow2012-06-02 19:02:24
418195Ebuildsmaintainer-wantedUNCONFIRMEDsci-misc/hets - the Heterogeneous Tool Set, a parsing, static analysis and proof management tool2012-05-30 12:49:44
418199ApplicationsgrozinUNCONFIRMEDsci-libs/mathgl-1.11.2 install phase - ln: failed to create symbolic link './mathgl-1.11.2/ChangeLog2012-06-04 09:41:36
418209Core systemtoolchainUNCONFIRMEDcross-armv7m-none-eabi/gcc-4.5.3 stage1 cross-compiler fails2012-11-06 07:23:57
418317Applicationsmr_bones_UNCONFIRMEDapp-admin/syslog-ng-3.3.5 - add systemd support2013-01-31 20:52:53
419167Ebuildsmaintainer-wantedUNCONFIRMEDgames-rpg/bastion-20120529-r2 - an original action role-playing game set in a lush imaginative world2012-09-25 08:31:15
419415Applicationsnet-imUNCONFIRMEDnet-im/pidgin: Freeze on startup2012-06-16 22:36:00
419427GamesgamesUNCONFIRMEDgames-strategy/darwinia-1.43 update2012-06-03 04:25:52
419441GamesgamesUNCONFIRMEDgames-strategy/defcon-1.6 update2012-06-03 04:29:47
419515FreeBSDbsdUNCONFIRMED[keywordreq] dev-util/catalyst and deps compile on amd64-fbsd2012-06-19 23:44:29
419529Applicationsbase-systemUNCONFIRMEDsys-libs/db-4.8.30 fails tests with no space left on device2012-06-04 10:55:39
419545GamesgamesUNCONFIRMEDgames-puzzle/chocolate-castle new ebuild2012-06-04 19:50:10
419755GamesgamesUNCONFIRMEDSupport amd64 for games-strategy/heroes32012-09-04 02:13:09
419773genkernelgenkernelUNCONFIRMEDearly bind mounts are listed twice in the mount table2012-06-05 14:14:06
419787PrintingprintingUNCONFIRMEDnet-print/foo2zjs-99999999 with app-text/ghostscript-gpl-9.05-r1 fails tests2012-10-09 09:27:44
419793Prefix SupportprefixUNCONFIRMEDapp-emulation/hercules-3.07: install failed due to chown root2012-08-25 06:35:42
419847Ebuildsmaintainer-wantedUNCONFIRMEDmedia-plugins/gst-editing-services - a high-level library for facilitating the creation of audio/vi2012-07-08 08:53:36
419943Applicationsmaintainer-wantedUNCONFIRMEDEbuild request: dev-vcs/git-flow2012-10-27 01:30:32
419955Applicationsmedia-videoUNCONFIRMEDmedia-video/vlc-2.0.1 - src_test(): srtp-test-aes / srtp-test-recv: Libgcrypt warning: missing initi2012-09-19 13:11:08
419995ApplicationssciUNCONFIRMED[science overlay] media-gfx/librecad-9999 - fix for changed directory structure2012-07-19 04:53:04
420033DevelopmentperlUNCONFIRMEDdev-perl/MooseX-Types-DateTimeX fails tests with MooseX-Types-DateTime-ButMaintained-0.140.02012-06-07 09:09:11
420073EbuildshaskellUNCONFIRMED=ghc-7.4.12012-11-18 14:29:00
420095Applicationsrobbat2UNCONFIRMEDsci-mathematics/glpk-4.47 USE=mysql with dev-db/mariadb:5.5 - /usr/include/mysql/m_string.h:177:14: 2012-12-12 19:59:28
420271ApplicationspythonUNCONFIRMED=dev-python/twisted-11.0.0: fails test wrt twisted.test.test_udp.Server2012-06-11 10:59:36
420451JavajavaUNCONFIRMEDdev-java/jnr-netdb:0: Use dev-java/jnr-ffi:0.5 instead of dev-java/jaffl2012-06-10 00:57:49
420453Keywording and Stabilizationrobbat2UNCONFIRMED=dev-util/checkbashisms-2.0.0.5 stable request2012-12-06 09:16:14
420459Enhancement/Feature Requestsdev-portageUNCONFIRMEDemerge --keep-going should leave behind --resume state for skipped/failed builds2012-09-07 04:13:06
420473ApplicationsnetmonUNCONFIRMEDnet-analyzer/fail2ban-0.8.6 violates Date-Mailheader standards when using sendmail*-actions and havi2012-12-17 11:17:57
420521ApplicationsfauliUNCONFIRMEDapp-portage/g-ctan does not allow to install all packages2012-11-29 14:49:37
420573UnspecifiedhaskellUNCONFIRMEDhaskell-updater wrongly identifies packages as not installed by package manager2012-06-12 18:40:25
420611GamesgamesUNCONFIRMEDgames-strategy/gratuitous-space-battles - new ebuild2012-06-11 00:31:04
420627Ebuildsmaintainer-wantedUNCONFIRMEDgames-strategy/multiwinia - new ebuild2012-06-11 07:42:45
420641PrintingprintingUNCONFIRMEDapp-text/ghostscript-gpl-9.05-r1 - libgs.so gets built with _start etc2012-10-24 09:21:47
420675ApplicationstuponeUNCONFIRMEDapp-misc/geneweb-5.02 - File "srcfile.ml", line 195, characters 4-56: Error: Unbound constructor Std2013-02-21 12:35:28
420733Applicationsx11UNCONFIRMEDx11-drivers/ati-drivers-12.4 - fgrlx module crash on startx2012-06-13 09:46:44
420939ApplicationswltUNCONFIRMEDFirebird-2.5.1.26351.0 with use xinetd implies superclassic patch and cannot build/install fb_inet_s2012-06-13 07:50:17
421021FreeBSDbsdUNCONFIRMEDsys-libs/e2fsprogs-libs-1.42.3 fails to install because of include 2012-07-15 22:52:36
421223JavajavaUNCONFIRMEDdev-java/gnu-classpath should make installing /usr/gnu-classpath-*/bin scripts optional2012-06-15 11:06:00
421353Core - Interface (emerge)dev-portageUNCONFIRMED'The following REQUIRED_USE flag constraints are unsatisfied:' is not specific enough2013-01-14 09:02:15
421363Applicationsx11UNCONFIRMEDx11-apps/xinput_calibrator-0.7.5[-gtk] installs incorrect desktop entry2012-06-19 11:43:59
421435Unspecifiedrobbat2UNCONFIRMEDg-cpan fails to install perl-gcpan/Cv-0.12 after perl to 5.16.0 upgrade to and opencv upgrade to 2.42012-06-29 16:39:10
421459Applicationssci-geosciencesUNCONFIRMEDsci-geosciences/grass-6.4.2, strange Exec entries in /usr/share/applications/grass64-grass.desktop2012-11-21 18:48:02
421503JavajavaUNCONFIRMEDdev-java/groovy-{1.8.8,2.0.6,2.1.0} version bump request2013-01-29 00:25:12
421513Ebuildscommon-lispUNCONFIRMEDdev-lisp/asdf-2.24 version bump request2012-09-08 23:37:14
421677JavajavaUNCONFIRMEDdev-java/ant-commons-net-1.8.4 - *** Semantic Error: The abstract method "int compareTo(java.lang.Ob2012-06-19 02:39:45
421687Keywording and StabilizationpythonUNCONFIRMEDdev-python/pylint-0.25.1 - please stabilize2012-06-18 18:27:14
421741Developmentrobbat2UNCONFIRMEDdev-vcs/git-1.7.3.4-r1: test t7508-status.sh failed with FEATURES="sandbox -userpriv"2012-06-19 15:11:50
421821PrintingprintingUNCONFIRMEDapp-text/libpaper-1.1.24-r1 bad postinst message2013-02-14 02:27:35
421829ApplicationsgstreamerUNCONFIRMEDmedia-plugins/gst-plugins-ffmpeg-0.10.13-r1 with ABI=x32 - libswscale/x86/swscale_template.c:998: Er2012-09-11 06:15:09
421849UnspecifiedramerethUNCONFIRMEDdev-vcs/gitolite and dev-vcs/gitolite-gentoo - gl-setup fails:Unsuccessful stat on filename containi2012-06-28 20:12:53
421897ApplicationsxfceUNCONFIRMEDxfce-base/xfce4-panel-4.10.0 - adding system action icon to panel breaks auto-hide2012-07-06 05:45:28
422121Core systemvoyageurUNCONFIRMEDsys-devel/llvm should properly install binutils plugins for LTO to work2012-07-16 08:22:40
422459Applicationsphp-bugsUNCONFIRMEDdev-php/smarty-2.6.26 version bump request2013-01-21 18:16:37
422483ApplicationsjdhoreUNCONFIRMEDdev-lang/pike-7.8.352-r2 multilib-strict check failed!2012-12-21 03:51:15
422491Coredev-portageUNCONFIRMEDemerging updates to nfs-mounted file systems can cause running programs to segfault2012-06-21 02:59:59
422643ApplicationsgraphicsUNCONFIRMEDmedia-gfx/graphviz-2.28.0 sci-biology/phrap-1.080812 - file collision in /usr/bin/cluster2012-06-21 14:28:59
422707EbuildsgstreamerUNCONFIRMEDmedia-plugins/gst-plugins-ffmpeg-0.10.13-r2 blocking, conflicts ffmpeg and libav2012-09-03 18:03:01
422877Core systembase-systemUNCONFIRMEDnet-firewall/iptables: ip6tables "state" test fails; will not jump to ACCEPT on ESTABLISHED,RELATED 2013-02-16 13:31:38
422909ApplicationsgnomeUNCONFIRMEDmail-client/evolution-3.2.3-r1 lost configuration information - (evolution:11395): evolution-network2012-06-23 07:38:20
423245PMS/EAPIpms-bugsUNCONFIRMED[Future EAPI] dohtml: Extend default list of extensions2012-09-11 19:45:13
423313Toolstools-portageUNCONFIRMEDrevdep-rebuild does not fix /usr/lib/libstartup-notification-1.so.0 // www-client/firefox-10.0.5 - l2012-08-03 11:54:41
423399EbuildssciUNCONFIRMEDsci-libs/parmetis-3.2.0: fails tests2012-09-25 10:57:08
423679Prefix SupportprefixUNCONFIRMEDInvalid install_name in media-libs/opencv-2.4.02012-06-26 16:20:27
423817DevelopmentflameeyesUNCONFIRMEDdev-util/dwarves-1.9: ostra-cg cannot find python module ostra: ImportError: No module named ostra2012-06-27 18:54:10
423827KDEkdeUNCONFIRMEDkde-base/kdm fails to start using binpkgs2013-02-17 22:50:42
424053Keywording and Stabilizationweb-appsUNCONFIRMEDPlease stabilize =www-apps/collectd-web-0.4.02012-06-29 15:11:21
424191Gamesmaintainer-wantedUNCONFIRMEDgames-strategy/vcmi-data-0.89 - Data files for the turn based strategy game HOMM3 clone VCMI2013-01-28 21:27:50
424193Gamesmaintainer-wantedUNCONFIRMEDgames-strategy/vcmi-0.89.ebuild - a free HOMM 3 clone2013-01-28 21:26:51
424343Core systembase-systemUNCONFIRMEDsys-boot/grub-0.97: Cannot install boot loader to /dev/xvda. /dev/xvda does not have a correspondin2013-02-04 03:52:44
424357EbuildsnirbheekUNCONFIRMEDdev-python/pypy-1.9-r1: There is NOT at least 4 gibibytes RAM2012-12-16 10:05:41
424365EbuildsnirbheekUNCONFIRMEDdev-python/pypy-1.9-r1: AssertionError: must come from an argument to the function, got <-88;esp>2012-07-03 14:41:31
424373ApplicationspatrickUNCONFIRMEDnet-misc/strongswan-5.0.0 - Outdated description about (non-)root privileges2012-07-03 14:39:13
424445GamesgamesUNCONFIRMEDufo-ai-2.4 fails with Com_EParseValue: Illegal color statement '1 .874 .294 1'2012-08-02 20:55:27
424637Core systemsystemdUNCONFIRMEDsys-apps/systemd won't work with lvm due to udev and genkernel problems2012-07-07 09:32:46
424691Core systemrobbat2UNCONFIRMEDsys-process/audit uses alias from /etc/hosts in constructing Kerberos principal2012-12-22 07:20:43
424797EbuildspatrickUNCONFIRMEDapp-emulation/virtualbox-guest-additions-4.1.12: Successfully built on no-multilib amd642012-07-06 04:27:50
424816ApplicationspatrickUNCONFIRMEDapp-emulation/virtualbox-guest-additions-4.1.12 and x11-drivers/xf86-video-virtualbox-4.1.12 fail to2012-12-26 21:09:46
424854Ebuildsnet-mailUNCONFIRMEDdev-libs/cyrus-2.1.25-r2: subversion lose support for SASL with DIGEST-MD5 after upgrade cyrus-sasl 2012-07-05 06:54:33
424862Core systembase-systemUNCONFIRMEDsys-apps/logwatch - please add support for postscreen postfix service from upstream patch2012-08-28 08:48:18
425056OtherantarusUNCONFIRMEDGSoC 2012 gentoostats: Deploy the gentoostats webapp2012-09-05 11:19:59
425106Core systembase-systemUNCONFIRMEDsys-libs/db-4.8.30 FEATURES="test" - tests are not run : You must have USE=tcl to run the sys-libs/d2012-07-10 14:09:54
425132Ebuildsmaintainer-wantedUNCONFIRMEDdev-db/riak - "the most powerful open-source, distributed database you'll ever put into production."2012-07-08 14:09:00
425188ApplicationscppUNCONFIRMED[TRACKER] Packages failing to build with >=dev-libs/boost-1.502012-12-16 15:28:26
425192PrintingprintingUNCONFIRMEDapp-text/acroread-9.5.1-r1 not able to open file by clicking in filemanager, bum request for acrorea2013-02-15 17:03:57
425202Ebuildsmaintainer-wantedUNCONFIRMEDx11-plugins/torchat - Pidgin plugin for p2p instant messaging through Tor hidden service tunnels2012-07-08 14:10:34
425220InstallCDreleaseUNCONFIRMEDinstall-powerpc-minimal-20120624.iso fails to boot on Power Mac G5 late 2005 2x2Ghz2012-12-24 09:36:09
425302Gamesmaintainer-wantedUNCONFIRMEDgames-strategy/p6014 - Project 6014 Mod sequel to Star Control II: The Ur-Quan Masters2012-07-09 11:21:25
425524SandboxtoolchainUNCONFIRMED[ICE/4.6] sys-apps/sandbox build segfaults on hardened systems2012-11-17 19:16:55
425708ApplicationscalchanUNCONFIRMEDdev-lang/R-2.10.1 - R: stack smashing attack in function - terminated2012-10-07 11:57:34
425728Core systemtoolchainUNCONFIRMEDsys-libs/libstdc++-v3 sys-devel/gcc:3.3: no version information available in ia64 libstdc++.so2012-08-12 14:58:44
426294JavajavaUNCONFIRMEDnet-nds/jxplorer-3.3 - version bump request2013-01-28 15:25:13
426306Core systemtoolchainUNCONFIRMEDsys-libs/glibc-2.14.1-r3: tests failed2012-11-10 09:00:26
426356ApplicationsnetmonUNCONFIRMEDnet-analyzer/mrtg-2.17.4: /etc/init.d/mrtg restart: overload arg '..' is invalid at /usr/lib/perl5/v2012-07-25 14:42:22
426380JavajavaUNCONFIRMEDdev-java/cglib-{2.2.2,3.0} version bump request2012-08-18 14:17:39
426398Applicationsnet-dialupUNCONFIRMEDnet-dialup/pptpclient - stability fixes2012-07-18 00:06:56
426486ApplicationschithanhUNCONFIRMEDopenoffice-bin-3.4.0 automatically installs ~200MB of dictionary data for each user2012-07-14 00:20:34
426510Applicationsfreedesktop-bugsUNCONFIRMEDsys-power/pm-utils-1.4.1-r2 hangs PC instead of suspend to RAM2012-07-29 09:16:57
426514UnspecifiedswaponUNCONFIRMEDx11-drivers/xf86-video-virtualbox-4.1.12 - /usr/src/linux-3.3.8-gentoo/arch/x86/include/asm/unistd.h2012-09-11 23:56:28
426518Ebuildsmaintainer-wantedUNCONFIRMEDmedia-tv/oscam ebuild request2013-02-04 11:05:51
426658EbuildsproaudioUNCONFIRMEDmedia-sound/phasex-0.12.0_beta3 installs desktop and icon files in wrong places2013-01-13 09:19:20
426672EbuildsproaudioUNCONFIRMEDmedia-sound/timemachine should install a desktop file2012-07-18 15:45:01
426736Applicationsx11UNCONFIRMEDx11-base/xorg-server segfaults at startup with x11-drivers/xf86-video-ati-6.14.4-r12012-07-18 21:13:12
426744FreeBSDbsdUNCONFIRMEDopenistgt -- an enterprise iscsi target port for FreeBSD2012-07-15 20:52:56
426872Serveridella4UNCONFIRMEDapp-emulation/xen-tools-4.1* - disable HPET broadcast2012-08-13 09:47:39
426898Applicationspolynomial-cUNCONFIRMED=app-emulation/virtualbox-modules-4.1.12 with sys-kernel/vanilla-sources-3.4.5 - src_test(): .../wor2012-11-13 17:18:09
426912Librarynet-p2pUNCONFIRMEDnet-p2p/deluge unicode casting problems with net-libs/rb_torrent 0.16.x2013-01-26 06:22:29
426946Ebuildsmaintainer-wantedUNCONFIRMEDx11-wm/beshell - a simple desktop shell on KDE technology (namely KIO and Solid) for the rest of us2012-09-06 15:53:17
426986Core systembase-systemUNCONFIRMEDsys-fs/cryptsetup-1.4.1: initscript ignores last line of conf. file2013-01-18 11:31:09
427028ApplicationssciUNCONFIRMED[science overlay] media-gfx/librecad-9999 fails in install phase again2012-07-19 15:39:20
427030Applicationsmaintainer-neededUNCONFIRMEDnet-misc/sks version bump (and it should install an init.d script along with a uid/gid)2013-01-05 21:37:02
427062EbuildsxmwUNCONFIRMEDapp-admin/bcfg2-1.2.2-r1 - add support for Dynamic Reporting System2012-07-19 15:58:15
427162Ebuildsmaintainer-wantedUNCONFIRMEDdev-python/django-admin-tools-0.4.1 - a collection of tools for the django administration interface2012-12-12 12:25:24
427208EbuildstexUNCONFIRMEDdev-tex/rubber-20100306 version bump request and HOMEPAGE update2012-12-22 18:27:45
427228Applicationspolynomial-cUNCONFIRMED>=www-client/seamonkey-2.10: cannot install any more addons dictionaries2012-07-26 07:50:15
427302Applicationsx11UNCONFIRMEDmedia-fonts/font-alias-1.0.3 : Aliases referring to xyz-iso8859-1 when font packages install xyz-iso2012-07-24 13:58:10
427304ApplicationsvoyageurUNCONFIRMED=dev-libs/mpfr-3.1.1 fails tests with clang-3.1-r42012-10-08 15:16:38
427310ApplicationsvoyageurUNCONFIRMED=dev-libs/ppl-0.12.1 fails tests with clang-3.1-r42012-07-25 14:12:12
427314Core systemvoyageurUNCONFIRMEDsys-apps/sed fails test with clang-3.1-r42012-07-21 14:07:01
427316Core systemvoyageurUNCONFIRMED=sys-apps/findutils-4.5.10-r1 fails tests with clang-3.1-r42012-07-21 14:07:00
427318ApplicationsvoyageurUNCONFIRMEDdev-libs/popt fails tests with clang-3.1-r42012-10-09 15:26:37
427340Core systembase-systemUNCONFIRMEDsys-boot/grub-static-0.97-r10 incorrectly detects /boot as read-only and fails2012-07-26 19:22:30
427348ApplicationsvoyageurUNCONFIRMED=dev-db/sqlite-3.7.13 fails test with clang-3.1-r42012-07-21 14:07:01
427350ApplicationsvoyageurUNCONFIRMED=dev-lang/perl-5.16.0 fails tests with clang-3.1-r42012-07-21 14:07:00
427430FreeBSDbsdUNCONFIRMEDWhen using latest clang-3.1-r5, sys-freebsd/boot0-9.0/9.1_beta1 will fail to compile2012-11-25 11:39:35
427528Applicationsnet-p2pUNCONFIRMEDnet-p2p/deluge-1.3.3 and 1.3.5 segfaults on start2012-07-23 18:53:18
427572Applicationsapp-backupUNCONFIRMEDapp-backup/boxbackup - man pages are installed in /usr/man2012-07-24 14:08:07
427616Prefix SupportprefixUNCONFIRMEDdev-lisp/sbcl-1.0.55-r1 fails to install on OS X (with FEATURES=test)2012-10-22 18:12:45
427636JavajavaUNCONFIRMEDdev-java/bcpg-1.45 ebuild request2012-07-22 13:15:13
427688EbuildsjdhoreUNCONFIRMEDmedia-video/miro-5.0.1, pre-stripped files, and revdep-rebuild keeps rebuilding due to /usr/bin/code2012-08-14 16:25:31
427708ServerpatrickUNCONFIRMEDwww-servers/apache does not install apache2.initd-baselayout-1 in /usr/share/doc/apache2-*/2013-02-16 13:33:31
427762Ebuildsmaintainer-wantedUNCONFIRMEDNew: dev-python/django-grappelli-2.4.0 - A grid-based alternative/extension to the Django administra2012-07-24 14:52:05
427768ApplicationsgstreamerUNCONFIRMEDmedia-plugins/gst-plugins-ffmpeg-0.10.13-r2 - gstffmpegutils.c:42:40: error: parameter 1 ('smp_fmt')2012-07-24 15:31:30
427808EbuildsvoyageurUNCONFIRMEDx11-base/xorg-server-1.12.3 crashing at start-up when compiled with sys-devel/clang2012-12-31 12:32:19
427830Core systemvoyageurUNCONFIRMEDsys-devel/clang-3.1-r4 - clang: error: unable to execute command: Illegal instruction (in .../work/l2012-07-25 14:59:26
427854DevelopmentrubyUNCONFIRMEDdev-ruby/rspec-core-2.10.1 USE=doc - String finished while reading (break on []) already read: ...2012-07-26 05:09:16
427936Ebuildsnet-p2pUNCONFIRMEDmedia-libs/gupnp-dlna-0.6.6 USE=introspection - sandbox violation in /dev/dri/card0 by gst-plugin-sc2013-02-05 18:34:08
427960EbuildspythonUNCONFIRMEDdev-python/tox-1.4 - pkg_resources.DistributionNotFound: py>=1.4.92012-07-25 01:38:14
427998OpenRCopenrcUNCONFIRMEDsys-apps/openrc: The root script does not work correctly if root or any filesystems it remounts are 2012-10-18 17:42:12
428024Ebuildsmaintainer-wantedUNCONFIRMEDdev-libs/breakpad -- An open-source multi-platform crash reporting system2012-08-17 21:05:56
428174Libraryx11UNCONFIRMEDmedia-libs/mesa-8.1_rc1_pre20120724 USE=r600-llvm-compiler - R600RegisterInfo.td:4762:27997: error: 2012-12-08 03:34:08
428282LibrarypachoUNCONFIRMEDnet-wireless/bluez-4.99 expected specifier-qualifier-list before ‘typeof’ in bluetooth.h2013-02-12 21:43:00
428418ApplicationspatrickUNCONFIRMEDsci-libs/openfoam-2.1.1 foamInstall in OpenFOAM's bashrc set wrong2012-11-30 13:38:17
428460Applicationsx11UNCONFIRMEDmedia-libs/mesa-8.1_rc1_pre20120724 files swrast_dri.so and i915_dri.so contains insecure RUNPATHs2013-01-31 18:48:44
428474Enhancement/Feature Requestsdev-portageUNCONFIRMEDPrint a warning after merge with wrong permissions on existing file2012-07-28 22:34:46
428618Keywording and StabilizationjavaUNCONFIRMEDPlease mark =dev-java/rxtx-2.2_pre2 stable2012-07-30 23:35:26
428682HardenedhardenedUNCONFIRMEDSystem.map has an incorrect kernel version reported when grsec enabled2012-08-03 15:29:25
428746ApplicationscardoeUNCONFIRMEDnet-misc/netcf-0.1.9 - drv_initscripts.c:1083:15: error: ‘NETCF_TRANSACTION’ undeclared (first use i2012-08-01 04:17:19
429442EbuildsprintingUNCONFIRMEDapp-text/ghostscript-gpl - disable endian check when cross-compiling2012-08-02 13:07:09
429626CatalystcatalystUNCONFIRMEDdev-util/catalyst-2.0.10.1: get_libdir() return an empty value when cross compiling2012-08-13 13:01:10
429802Ebuildsnet-imUNCONFIRMEDnet-im/sendxmpp-1.20 with 2012-08-04 16:43:36
430010ApplicationsbluenessUNCONFIRMEDapp-admin/webapp-config-1.50.19 fails test: WebappConfig.content.Contents2012-08-05 14:22:59
430062JavajavaUNCONFIRMEDdev-java/glazedlists-1.8 version bump2012-08-05 19:29:55
430132Core - Dependenciesdev-portageUNCONFIRMEDVersioned virtuals cause slot conflict when weak block dependencies could resolve with uninstall2012-08-08 07:44:32
430178Prefix SupportprefixUNCONFIRMEDnet-libs/libtirpc : port to Gentoo Prefix request2013-01-04 18:53:51
430316Ebuildsidl0rUNCONFIRMEDFeature request: Add a check for sane folder/file permission in net-dns/bind2012-08-07 16:19:51
430318OpenRCopenrcUNCONFIRMEDsys-apps/openrc-0.10.5 fails to remounts reiserfs root file system read only on reboot: failed becau2012-11-07 11:40:40
430348EbuildsradioUNCONFIRMEDnet-wireless/gnuradio-3.6.1-r1 USE="doc" - some documentation is installed outside /usr/share/doc/${2012-08-13 23:02:49
430498PrintingprintingUNCONFIRMEDnet-print/cups-bjnp-1.0 and net-print/cups-1.6.1: Failed to read side-channel request!2012-08-09 23:40:25
430566DevelopmentembeddedUNCONFIRMEDsys-devel/crossdev installed bashrc doesn't run cross-fix-root when it should2012-08-10 00:43:26
430626DevelopmentperlUNCONFIRMEDdev-lang/perl-5.16.1 - Can't locate strict.pm in @INC2012-10-26 23:10:24
430690EbuildsmattmUNCONFIRMEDnet-libs/wt-3.2.2 - Aborting due to QA concerns: 4 files installed in /tmp/portage/net-libs/wt-3.2.22012-09-17 06:33:36
430854GNOMEford_prefectUNCONFIRMEDmedia-sound/pulseaudio-2.1: won't store volume level on gnome 3.2012-08-27 21:33:07
430870ApplicationshannoUNCONFIRMEDnet-analyzer/openvas-administrator - .../work/openvas-administrator-1.1.1/src/admin.c:877:3: error: 2012-08-12 14:12:23
430894Core systemmattmUNCONFIRMEDsys-power/apcupsd-3.14.10-r1[snmp] fails to build with latest net-snmp2013-02-02 23:16:04
430912Core systemsystemdUNCONFIRMEDvirtual/init - add RDEPEND on sys-apps/systemd-sysv-utils2012-08-15 00:27:49
431036ApplicationspchristUNCONFIRMEDdev-lisp/sbcl fails to compile (when the build system is testing "sb-posix")2012-08-30 18:50:48
431054Applicationsbase-systemUNCONFIRMEDnet-misc/icecast-2.3.3 USE=yp - libtool linker mangles CFLAGS ( x86_64-pc-linux-gnu-gcc: error: l1-c2012-08-12 20:10:16
431058Eclasses and ProfilespythonUNCONFIRMEDdev-util/gdbus-codegen-2.32.4 - /usr/portage/eclass/python-distutils-ng.eclass: line 206: syntax err2012-08-12 16:45:06
431066UnspecifiedsoundUNCONFIRMEDmedia-libs/libvisual - error: 'sigill_handler_sse' undeclared (first use in this function)2012-11-05 15:00:00
431214CatalystcatalystUNCONFIRMEDdev-util/catalyst: add qemu support2012-08-16 21:52:46
431354Ebuildsmaintainer-wantedUNCONFIRMEDdev-util/lttng-ust - Linux Trace Toolkit - UST library2012-08-14 12:55:20
431368ApplicationshaskellUNCONFIRMEDx11-misc/xmobar-0.14 - src/Plugins/Monitors/CoreCommon.hs:139:30: No instance for (Applicative (Cont2012-08-14 13:16:12
431388ApplicationspythonUNCONFIRMEDdev-python/ipython-0.13 -AttributeError: 'StoreMagics' object has no attribute 'db'2012-08-14 15:08:54
431396EbuildsgurligebisUNCONFIRMEDdev-php/ZendFramework - add USE flag to install ZendX2013-01-07 19:28:57
431522ApplicationsgstreamerUNCONFIRMEDmedia-video/flumotion: fails to build with python3* as system interpreter2012-12-28 00:22:54
431608Keywording and StabilizationpythonUNCONFIRMEDStabilize dev-python/virtualenvwrapper2013-01-04 01:17:32
431802Ebuildsmaintainer-wantedUNCONFIRMEDwww-apps/gitlab Project management and code hosting application written in ruby2013-01-23 04:07:24
431804Ebuildsmaintainer-wantedUNCONFIRMEDapp-text/pelican-3.0 - A tool to generate a static blog, with restructured text (or markdown) input 2012-08-18 15:39:10
431912InstallCDreleaseUNCONFIRMEDinstall-x86-minimal-20120710.iso - boot hangs while looking for cdrom when encounters swap partition2013-02-21 02:38:59
431920EbuildsalexxyUNCONFIRMEDnet-wireless/wimax-1.5.2-r1 installs /var/log/wimax with mode 7772013-01-01 21:49:31
431928Ebuildsmaintainer-wantedUNCONFIRMEDapp-benchmarks/mmtests - a configurable test suite that runs a number of common workloads of interes2012-08-20 02:07:01
431984Core systemia64UNCONFIRMEDsys-boot/efibootmgr - arch must match kernel arch to work correctly2012-08-22 00:02:20
432112Core systemtoolchainUNCONFIRMEDsys-libs/libspe2 with ppc64 requires multilib install2012-09-14 22:21:15
432296Developmentmaintainer-neededUNCONFIRMEDdev-libs/apr-1.4.5 fails to crosscompile: configure: error: cannot run test program while cross comp2013-01-03 18:43:02
432300Core systemtoolchainUNCONFIRMEDsys-devel/gcc-4.5.3-r2 fails to crosscompile: gcc-4.5.3/libstdc++-v3/src/atomic.cc:91:62: error: inv2012-08-22 14:43:31
432326EbuildspatrickUNCONFIRMEDapp-emulation/virtualbox-guest-additions should add group "vboxsf" to support automount shared folde2012-10-23 10:19:47
432502Ebuildsnet-mailUNCONFIRMEDmail-filter/mimedefang-2.73 please stabilize2012-11-09 18:12:51
432834ApplicationssciUNCONFIRMEDsys-cluster/charm-6.2.0 installs broken header symlinks2012-08-27 22:50:41
432910ApplicationspatrickUNCONFIRMEDapache2-2.2.22 mod_proxy_ftp segfaults on IPv4 requests to hosts with DNS AAAA records2013-02-16 14:06:24
432944UnspecifiedperlUNCONFIRMEDperl-gcpan/Math-GSL-0.27 wants to install perl-gcpan/Test-Tester-0.108 which conflics with installed2012-09-17 07:17:25
432964ApplicationspatrickUNCONFIRMEDwww-servers/apache - init.d script fails to detect server check/startup problem2013-02-16 13:23:59
432976KDEkdeUNCONFIRMEDnet-libs/telepathy-logger-qt-0.5.0: fails to build with >=dev-libs/boost-1.50.0-r22013-01-18 10:48:33
433074ServersambaUNCONFIRMEDnet-fs/samba: please add systemd unit file2013-02-15 18:19:32
433153ApplicationsramerethUNCONFIRMEDapp-emulation/ganeti should install logrotate config2012-09-03 11:31:29
433373Installation Handbookdocs-teamUNCONFIRMEDSubstitute old make.conf path2012-10-31 18:52:18
433441Core systemwilliamhUNCONFIRMEDnet-misc/dhcpcd should RDEPEND on net-dns/bind-tools (for either dig or host)2012-10-14 14:42:50
433443EbuildsnetmonUNCONFIRMEDnet-analyzer/snmptt should install snmptthandler-embedded2012-09-03 15:46:10
433455Applicationsalsa-bugsUNCONFIRMEDAlsa Master Volume between 0% and 16% not possible on intel hda2012-09-10 12:32:04
433457Core systemsystemdUNCONFIRMEDsys-apps/systemd should not store coredumps in its journal yet2012-10-27 21:52:30
433511Enhancement/Feature Requestsdev-portageUNCONFIRMEDadd multilib support (from portage multilib branch in git) to master branch2012-11-06 06:43:19
433515Prefix SupportprefixUNCONFIRMEDemerge app-doc/NaturalDocs-1.52 : request Prefix support2012-10-10 12:41:47
433531Prefix SupportprefixUNCONFIRMEDfox.eclass: request for Prefix support2012-09-29 14:02:59
433708ApplicationsmattmUNCONFIRMEDnet-analyzer/zabbix-2.0.2-r1: Makefiles are erroneously installed in /usr/share/zabbix2012-09-03 17:12:18
433786Ebuildsmaintainer-wantedUNCONFIRMEDmedia-fonts/opengostfont-0.3 - Open-source version of the fonts by Russian standard GOST 2.304-812012-09-04 09:14:50
433942Applicationsnet-p2pUNCONFIRMEDnet-p2p/amule - amule fails to start when an empty ~/.aMule/statistics.dat file is present2012-09-04 15:33:37
433944KDEqtUNCONFIRMEDdev-python/PyQt4 does not install phonon-module2013-01-02 12:49:56
433994Servermysql-bugsUNCONFIRMEDdev-db/mysql-5.1.62-r1 stack smashing detected in mysqld2012-09-05 17:17:06
434020OpenRCopenrcUNCONFIRMEDnet.example in docs dir suggest a faulty bond0-configuration.2012-09-05 11:55:57
434090Core systemsystemdUNCONFIRMEDsys-apps/systemd - mount and df list devices multiple times2012-09-19 18:51:11
434110Applicationsrobbat2UNCONFIRMEDapp-admin/cancd-0.1.0-r2: netconsole init script fails to start due to wrong ifconfig path2012-09-06 14:20:31
434124Ebuildsmaintainer-wantedUNCONFIRMEDdev-perl/Cache-FastMmap - Uses an mmap'd file to act as a shared memory interprocess cache2012-09-06 14:41:46
434180Core systemtoolchainUNCONFIRMEDsys-devel/gcc sandbox violation in /usr/include/DONE (dev-db/oracle-instantclient-basic creates a li2012-12-25 08:33:27
434236DevelopmentrafaelmartinsUNCONFIRMEDdev-lua/luafilesystem-1.5.0 with dev-lang/lua-5.2.1: src/lfs.c:779:30: error: array type has incompl2013-02-03 13:08:19
434366Ebuildsshell-toolsUNCONFIRMEDapp-text/pastebin: malfunctions because pastebin.com has changed their API2012-09-13 22:48:44
434416Keywording and StabilizationsoundUNCONFIRMED=media-sound/qarecord-0.5.0 stable request2012-09-09 15:50:07
434440PrintingprintingUNCONFIRMEDnet-print/cups-1.6.1 should pull in virtual/libusb:1 with USE=usb instead of libusb:02012-09-09 16:02:09
434526Applicationsx11UNCONFIRMEDx11-base/xorg-server message should be updated since sets are in stable portage2012-10-26 06:41:59
434592Ebuildsmaintainer-wantedUNCONFIRMEDnet-misc/bubbleupnpserver - extends your existing UPnP AV Media Servers and Media Renderers on your 2012-09-11 14:16:40
434610ApplicationsjlecUNCONFIRMEDgnome-extra/zeitgeist-datahub-0.9.5 version bump2012-09-11 14:22:09
434702ApplicationsspingUNCONFIRMEDmedia-sound/mp3splt-gtk-0.7.3: QA Notice: This package installs one or more .desktop files that do n2012-11-21 18:48:15
434704ApplicationsgpeUNCONFIRMEDx11-misc/matchbox-keyboard-0.1: QA Notice: This package installs one or more .desktop files that do 2012-11-21 18:48:19
434734Applicationsphp-bugsUNCONFIRMEDapp-doc/php-docs-20101029-r1 doesn't install anything except symlink2013-01-14 14:39:05
434744Ebuildsmaintainer-wantedUNCONFIRMEDdev-db/mysql-cluster-7.2.8 - a high availability and high performance alternative to regular mysql2012-10-14 09:35:05
434842GNOMEgnomeUNCONFIRMEDmedia-video/cheese-3.4.2 This package installs one or more .desktop files that do not pass validati2012-11-21 18:48:25
434906DevelopmentvoyageurUNCONFIRMEDsys-devel/clang should install x86_64-pc-linux-gnu-clang symlink2012-09-13 15:46:46
434924EbuildswilliamhUNCONFIRMEDdev-lang/go - static libraries in /usr/lib/go/pkg* with older mtimes than /usr/lib/go/src causes use2012-09-14 13:35:30
434926Applicationsmaintainer-neededUNCONFIRMED>=net-im/skype-4.0.0.7 - login failure, stuck at "signing in" with JFS filesystem2013-01-03 19:31:41
434940PrintingprintingUNCONFIRMEDnet-print/cups-1.6.1 prints square of number of prints requested2012-09-24 16:56:30
435044Prefix SupportprefixUNCONFIRMEDbootstrap-prefix.txt fails on comilation of portage/app-editors/nano-2.3.1-r22012-10-01 14:08:25
435144Ebuildsmaintainer-wantedUNCONFIRMEDsci-electronics/bitscope-dso - a suite of high performance mixed signal virtual test, measurement an2012-09-16 16:13:50
435304Unspecifiedrobbat2UNCONFIRMEDapp-portage/g-cpan-0.16.4-r1 generates broken ebuild depending on perl-g-cpan instead of dev-perl mo2013-02-21 07:50:32
435334Applicationsqmail-bugsUNCONFIRMEDmail-mta/netqmail-1.06 - pkg_postinst(): queue-repair failed2012-10-14 19:09:10
435426ApplicationstommyUNCONFIRMEDdev-vcs/subversion-1.6.17-r7 USE=-perl still depends on dev-lang/perl through perl-module.eclass2012-11-05 09:43:38
435488GNOMEgnomeUNCONFIRMEDmedia-libs/cogl-1.10.4 fails all tests2013-01-13 16:14:42
435534ApplicationsqemuUNCONFIRMEDapp-emulation/qemu-kvm-1.1.1-r1 - manual pages are not installed2012-11-30 12:14:46
435596Ebuildsmaintainer-wantedUNCONFIRMEDdev-ruby/rainbow - extension to ruby's String class adding support for colorizing text on ANSI termi2012-10-03 17:50:28
435648FreeBSDbsdUNCONFIRMEDSegmentation fault always occurs when starting X, using later versions xf86-video-vesa-2.3.0-r12012-09-23 13:02:11
435656EbuildshannoUNCONFIRMEDnet-analyzer/greenbone-security-assistant-2.0.1 - ld: CMakeFiles/gsad.dir/gsad.c.o: undefined refere2012-09-24 10:44:47
435676Applicationssci-chemistryUNCONFIRMEDsci-chemistry/ghemical-2.99.2-r2 - /usr/lib64/libSCwfn.so: undefined reference to `sc::DenFunctional2012-09-21 16:11:33
435686Librarydev-zeroUNCONFIRMEDdev-libs/boost-1.49.0-r1 - In file included from [...] libs/date_time/src/gregorian/greg_month.cpp:12012-11-11 05:45:20
435690Applicationsmysql-bugsUNCONFIRMEDdev-db/mysql-5.1.62-r1 - Makefile:186: *** missing separator. Stop.2013-02-04 23:51:03
435732ApplicationsjerUNCONFIRMEDx11-terms/rxvt-unicode-9.15 - glibc detected *** urxvtd: malloc(): smallbin double linked list corru2013-01-05 22:08:43
435740Developmentcommon-lispUNCONFIRMEDdev-lisp/asdf-binary-locations - uninstall should clean up /etc/gentoo-init.lisp2012-09-21 16:42:43
435762ApplicationsnirbheekUNCONFIRMEDnet-misc/networkmanager-0.9.6.0 disconnects shortly after establishing connection2012-10-26 23:03:17
435764JavajavaUNCONFIRMEDdev-java/wss4j-1.6.7 version bump request2012-09-21 18:44:27
435784EbuildsjsbronderUNCONFIRMED=sys-cluster/ganglia-3.3.7 calling gcc/ar/ranlib directly2012-09-22 16:41:49
435808JavajavaUNCONFIRMEDdev-java/opensaml-2.5.3 version bump request2012-09-22 06:45:45
435844LibrarysciUNCONFIRMEDsci-libs/netcdf-4.1.1-r4 USE=doc - egrep: Das Ende des angegebenen Intervalls ist nicht gültig2012-12-14 12:44:40
435982ApplicationsnetmonUNCONFIRMEDnet-analyzer/tcpdump-4.3.0 fails tests: esp4, esp5, isakmp4, ikev2pI22012-10-12 10:51:32
436012JavajavaUNCONFIRMEDdev-java/ant-core-1.8.4-r1 can't override system properties for ant2012-09-23 18:13:25
436052GNOMEgnomeUNCONFIRMEDgnome-base/gnome-shell-3.4.2 QA Notice: This package installs one or more .desktop files that do not2012-11-21 18:48:32
436054GNOMEgnomeUNCONFIRMEDgnome-base/gnome-control-center-3.4.2-r1 QA Notice: This package installs one or more .desktop files2012-11-25 09:53:38
436140GamesgamesUNCONFIRMEDgames-action/descent3 - updated ebuild to support installation from GOG package2012-09-24 22:54:46
436226JavajavaUNCONFIRMEDdev-util/checkstyle should install an ant task2012-09-26 10:14:51
436266OpenRCopenrcUNCONFIRMEDsys-apps/openrc-0.9.8.4: start in LXC brings down lxc-initialized interface2012-10-05 14:00:02
436278Librarymaintainer-wantedUNCONFIRMEDnet-analyzer/nagios-afs-monitor - Nagios plugins to monitor openafs server status2012-09-26 13:37:17
436290KDEkdeUNCONFIRMEDkde-base/okular-4.9.1 - hpcups[7483]: prnt/hpcups/HPCupsFilter.cpp 536: cupsRasterOpen failed, fd = 2013-01-10 19:35:12
436346LibrarypythonUNCONFIRMEDdev-python/llfuse-0.37.1 - .../work/llfuse-0.37.1/distribute-0.6.12-py3.2.egg/setuptools/command/eas2012-09-27 22:00:38
436348EbuildstoveUNCONFIRMEDPlease stabilize =app-shells/zsh-5.0.22013-02-10 03:55:11
436406ServergrobianUNCONFIRMEDmail-mta/exim please install headers files (aka please add "dlfunc" use flag)2013-02-04 09:35:04
436432Keywording and Stabilizationsci-geosciencesUNCONFIRMEDsci-libs/geos-3.3.5 stabilisation2013-02-02 12:08:29
436442Eclasses and Profileskernel-miscUNCONFIRMEDkernel-2.eclass - Offer a mean to install the kernel distribution under a tunable directory name2012-09-28 14:34:11
436500LibraryprintingUNCONFIRMEDapp-text/ghostscript-gpl with media-libs/freetype-2.4.10-r1 USE=infinality - ghostscript based appli2013-02-16 21:14:40
436528LibrarysoundUNCONFIRMEDmedia-libs/speex: Resampler stops in the middle of run with multiple channels2012-09-29 15:26:02
436594Core systembase-systemUNCONFIRMED>=sys-apps/memtest86+-2.00 should make use of/document "console="2012-09-29 15:40:51
436602GNOMEgnomeUNCONFIRMEDThe systemd and consolekit USE-flags should not be set together for GNOME >= 3.42012-11-04 15:02:44
436644JavajavaUNCONFIRMEDdev-java/owasp-esapi-2.0.1 ebuild request2012-10-06 10:59:19
436674ApplicationsgstreamerUNCONFIRMEDmedia-libs/gst-plugins-base-0.10.35: www-client/firefox-15.0.1[gstreamer] segfaults playing some vid2013-01-31 21:51:41
436680ApplicationsbluenessUNCONFIRMEDapp-admin/webapp-config wrong permissions for vhost_perms_defaultowned_dir2012-10-01 00:54:40
436702ApplicationsgurligebisUNCONFIRMEDnet-wireless/wpa_supplicant - systemd unit does not configure ctrl_interface2012-11-18 13:03:00
436704Keywording and Stabilizationrobbat2UNCONFIRMEDPlease stabilize =dev-vcs/git-1.7.12.42013-02-20 10:06:09
436986Applicationsrobbat2UNCONFIRMEDapp-portage/g-cpan - perl-gcpan/Finance-QuoteHist-1.16 attempts to pull in perl-gcpan/Date-Manip, ig2012-10-02 17:09:49
437000Core systembase-systemUNCONFIRMEDdev-libs/openssl-1.0.1c installs broken symlinks in /usr/share/man/man1/2013-02-09 12:25:18
437020Prefix SupportprefixUNCONFIRMEDbootstrap-prefix failed on gcc-4.2.4 in stage 32012-10-03 15:44:28
437028UnspecifiedrafaelmartinsUNCONFIRMEDdev-lua/luafilesystem-1.6.0 version bump2013-02-03 13:08:28
437090ServerclusterUNCONFIRMEDsys-cluster/keepalived-1.2.7-r1 "ip number count" errors2012-10-03 18:20:57
437106Ebuildsmaintainer-wantedUNCONFIRMEDapp-misc/stiki - a tool for reverting vandalism on Wikipedia2012-10-04 06:58:58
437112Unclassifieddev-portageUNCONFIRMEDno TIMESTAMP field when using ftps/https binhost2012-10-08 21:24:38
437116EbuildstexUNCONFIRMEDdev-tex/biblatex-2.5 version bump request2013-02-02 09:26:44
437118EbuildsdotnetUNCONFIRMEDdev-lang/mono-9999 - git master live ebuild2012-10-04 18:35:50
437122EbuildsdotnetUNCONFIRMEDdev-dotnet/xsp-9999 - live ebuild request2012-10-04 03:37:28
437176Applicationsx11UNCONFIRMEDx11-apps/xcalc-1.0.4.1 number keys stopped working2012-10-08 20:37:46
437236ApplicationszerochaosUNCONFIRMEDnet-analyzer/metasploit:4.4 | revdep-rebuild keeps reinstalling it when run2012-12-26 04:41:05
437392JavajavaUNCONFIRMEDdev-java/owasp-antisamy-1.4.4 ebuild request2012-10-06 10:16:34
437416LibrarybluenessUNCONFIRMEDnet-libs/libmicrohttpd-0.9.21 fails tests with USE="ssl"2012-12-26 13:26:06
437458InstallCDreleaseUNCONFIRMEDinstall-amd64-minimal-20120917.iso doesn't autodetect VirtIO blockdevice/network devices2012-12-16 06:09:55
437542Other documentsdocs-teamUNCONFIRMEDSuggestion for using speaker-test instead of relying on an audio player in the ALSA guide2012-10-29 19:09:04
437634Ebuildsmaintainer-wantedUNCONFIRMEDnet-dialup/qst - QT-based serial terminal program2012-10-09 06:34:10
437714Core systemrobbat2UNCONFIRMEDsys-fs/lvm2-2.02.97 init stop fails to deactivated lvs and vgs on shutdown2013-02-04 12:49:21
437718Core systemrobbat2UNCONFIRMEDsys-fs/lvm2-2.02.97 /etc/init.d/lvm-monitoring slows down boot and shutdown on systems with multiple2012-12-23 09:48:04
437728Core systema3liUNCONFIRMEDsys-boot/plymouth - static archives (*.a) and libtool library files (*.la) do not belong in /2012-11-15 22:53:53
437732HardenedhardenedUNCONFIRMEDmedia-video/ffmpeg-0.10.3 can't install ffmpeg due to grsec restrictions2012-10-09 14:52:20
437840ApplicationsnetmonUNCONFIRMEDnet-analyzer/net-snmp-5.7.2_rc1 - snmpd(XX): floating-point assist fault at ip 20000595aab3efc2, isr2012-10-14 18:00:40
437898Core systemmaintainer-neededUNCONFIRMEDnet-wireless/broadcom-sta-5.100.82.112-r2 with gentoo-sources-3.6.x - general protection fault in wl2013-02-03 13:08:44
437924Feature Requestmirror-adminUNCONFIRMEDThe list of rsync mirrors should have correct path or notify user of path2012-10-11 02:16:35
438086Applicationsweb-appsUNCONFIRMEDwww-apps/gallery-2.3.1 - "Begin Installation" fails with "The requested URL /gallery/install/
<
2012-10-12 16:43:46
438150ServerpatrickUNCONFIRMEDwww-servers/apache-2.4.3 - configuration files have "require host", should be "require ip"2013-02-16 14:07:53
438164Unspecifiedpolynomial-cUNCONFIRMEDapp-emulation/virtualbox - EQ overflow in X server when virtualbox starts with Wacom tablet's mouse 2012-10-14 18:22:06
438276ApplicationsbluenessUNCONFIRMEDapp-admin/webapp-config-1.50.19 - ignores vhost_config_dir value2013-02-17 00:47:25
438302Ebuildsmaintainer-wantedUNCONFIRMEDdev-db/mysql-mmm - Multi-Master Replication Manager for MySQL2012-10-15 11:04:50
438464UnspecifiedsysadminUNCONFIRMEDnet-analyzer/nagios-3.3.1: apache-2.4.3 fails to start with Syntax error on line 6 of /etc/apache2/2012-12-14 16:11:32
438494Conceptual/Abstract Ideaspms-bugsUNCONFIRMEDHave configuration file protection against new files in conf.d/ directories2012-10-16 15:46:11
438620GNOMEgnomeUNCONFIRMEDdev-libs/glib-2.32.4-r1 - src_test(): FAIL: run-assert-msg-test.sh2012-10-17 17:36:06
438622Ebuildsmaintainer-neededUNCONFIRMEDnet-wireless/broadcom-sta-6.20.55.19 version bump2013-02-07 12:05:08
438660Eclasses and ProfilesperlUNCONFIRMEDperl-module.eclass should not delete .packlist files2012-10-17 12:43:39
438708ApplicationsroxUNCONFIRMED2012-10-17 14:29:58
438730Core systemkernel-miscUNCONFIRMEDSandbox violations when emerging kernel modules from /etc/kernel/postinst.d hook against a kernel bu2012-11-05 03:29:40
438740ApplicationssciUNCONFIRMEDsci-misc/boinc - start /etc/init.d/boinc later2012-10-25 17:40:08
438768Keywording and StabilizationsciUNCONFIRMEDPlease stabilize =sci-libs/gsl-1.152012-11-09 18:12:29
438778EbuildsevermindUNCONFIRMED[pro-audio overlay] media-sound/non-things - git structure change causing configure fail and eutils 2012-10-25 13:48:06
438844Applicationsalsa-bugsUNCONFIRMEDmedia-sound/alsa-utils[pulseaudio]: alsasound init.d script generates pulse state files in /2012-12-16 03:05:14
438848ApplicationsqtUNCONFIRMEDsci-astronomy/stellarium crashes/hangs on start: QEglContext::swapBuffers(): "Bad surface (0x300D)"2012-10-26 20:08:07
438900GNOMEfreedesktop-bugsUNCONFIRMEDmedia-libs/libopenraw-0.0.9 - segmentation faults in OpenRaw::IO::MemStream::read (crashes gnome-bas2012-10-19 17:18:13
438930Ebuildspolynomial-cUNCONFIRMEDapp-emulation/virtualbox-4.2 USE=vnc - vnc module is built but not installed2012-12-21 18:07:10
438986EbuildschutzpahUNCONFIRMEDapp-admin/salt-0.10.0 - error: file '.../work/impl_python3_2/salt-0.10.0/scripts/salt-master' does n2012-10-21 14:26:16
438998Core systembase-systemUNCONFIRMEDsys-fs/cryptsetup[selinux,static]: with sys-libs/libselinux-2.1.12, link fails with pcre missing sym2012-10-23 15:34:25
439028ServerclusterUNCONFIRMEDsys-cluster/cman-3.1.5 init script should provide corosync2012-10-20 15:38:26
439060Ebuildsmaintainer-wantedUNCONFIRMEDsci-electronics/openhantek-0.2.0 and -9999 - Digital Storage Osziloscope2012-10-20 15:41:18
439136OpenRCopenrcUNCONFIRMEDsys-apps/openrc beta testing2012-11-06 21:25:24
439140JavajavaUNCONFIRMEDdev-java/icedtea: Use meaningful names for distfiles2013-02-20 07:39:04
439246ApplicationsgnomeUNCONFIRMEDmedia-gfx/gthumb-3.0.0 - segmentation fault in strlen(""), called from g_str_has_prefix at gstrfuncs2012-11-19 23:40:51
439280LibraryvadimkUNCONFIRMEDapp-emulation/vmware-modules-264.4 - missing return carriage in printk in VNetUserIfSetUplinkState()2012-10-23 10:12:15
439344GNOMEgnomeUNCONFIRMEDdev-libs/glib USE=-utils should not install gtester-report man page2012-10-23 10:09:12
439372Core systemjdhoreUNCONFIRMEDsys-apps/paludis[ruby-bindings] installs unslotted to latest ruby (actually 1.9) disregarding eselec2013-02-07 08:07:43
439396Ebuildsmaintainer-wantedUNCONFIRMEDmedia-sound/postfish - The Postfish is a digital audio post-processing, restoration, filtering and m2012-10-26 06:43:41
439408Ebuildsmaintainer-wantedUNCONFIRMEDdev-db/rockmongo-1.1.5 - Web-based administration for Mongo database in PHP2013-02-07 14:35:09
439438Ebuildssci-chemistryUNCONFIRMEDsci-chemistry/wxmacmolplt-7.4.3 version bump2012-10-23 19:24:23
439676UnspecifiedvoyageurUNCONFIRMEDapp-i18n/ibus-qt-1.3.1 with clang 3.1 - qibusserializable.h:94:59: error: non-const lvalue reference2012-10-26 16:33:42
439728Core systembase-systemUNCONFIRMEDnet-misc/ntp with sys-libs/glibc-2.15-r3 - ntpq -p: Request timed out2012-10-26 16:32:10
439754Ebuildsmaintainer-wantedUNCONFIRMEDsys-apps/inxi - A full featured system information script2012-11-19 17:19:20
439796EbuildshwoarangUNCONFIRMEDnet-misc/dibbler - /etc/init.d/dibbler-client stop doesn't stop client gracefully2012-11-04 10:57:39
439844EbuildsaballierUNCONFIRMEDmedia-libs/stk-4.4.4 - In file included from RtAudio.cpp:6750:0: include/soundcard.h:106:28: fatal e2013-01-23 16:33:32
439894Applicationsapp-dictsUNCONFIRMEDapp-text/stardict - configure.ac:310: error: possibly undefined macro: AM_GCONF_SOURCE_22012-10-27 18:48:47
439908EbuildsalexxyUNCONFIRMEDsci-chemistry/gamess-20120501.1 version bump2012-10-28 11:49:32
439912LiveCD/DVDlivecdUNCONFIRMEDapp-misc/livecd-tools-2.0.2: DHCP Broadcasting for IP not working2012-12-30 00:39:23
439918Serverphp-bugsUNCONFIRMEDdev-lang/php USE=fpm should provide a systemd service file2012-12-27 21:50:11
439982ApplicationshwoarangUNCONFIRMEDgnome-extra/nautilus-dropbox-1.4.0 - /usr/bin/rst2man.py dropbox.txt > dropbox.1 /// TypeError: 'str2012-11-04 10:56:31
440104ApplicationsgraphicsUNCONFIRMEDmedia-libs/lensfun-0.2.6 installs corrupted pkgconfig file2013-01-10 07:44:34
440194Core systembase-systemUNCONFIRMEDsys-apps/microcode-data20120606_p2? (v2) version bump request2012-11-06 11:28:26
440214EbuildsqaUNCONFIRMED[tracker] packages with emerge messages that can be improved by checking the previous installed vers2013-02-14 19:45:48
440218Conceptual/Abstract Ideaspms-bugsUNCONFIRMEDportage should have a ebuild-accessible variable for the USE flags of previously-installed versions2012-10-30 16:30:36
440286Ebuildsnet-fsUNCONFIRMEDnet-nds/rpcbind - add support for warm restarts of rpcbind daemon2013-01-10 20:33:08
440302EbuildsswegenerUNCONFIRMEDnet-irc/irssi - support static-libs and proxy USE flags2012-12-15 13:36:01
440420Toolsportage-utilsUNCONFIRMEDapp-portage/portage-utils-0.10: some elog messages should only be shown for the first install.2012-10-31 15:59:24
440426Applicationsmedia-opticalUNCONFIRMEDapp-cdr/dvd+rw-tools-7.1-r1: some elog messages should only be shown for the first install.2012-10-31 16:10:12
440428Applicationsshell-toolsUNCONFIRMEDapp-shells/bash-completion-1.3: some elog messages should only be shown for the first install.2012-10-31 16:10:30
440430Applicationsshell-toolsUNCONFIRMEDapp-shells/gentoo-bashcomp-20101217-r1: some elog messages should only be shown for the first instal2013-02-07 19:52:02
440436Applicationscvs-utilsUNCONFIRMEDdev-vcs/cvs-1.12.12-r6: some elog messages should only be shown for the first install.2012-10-31 16:11:44
440438Core systembase-systemUNCONFIRMEDnet-misc/ntp-4.2.6_p5-r1: some elog messages should only be shown for the first install.2012-11-06 21:40:35
440440PrintingprintingUNCONFIRMEDapp-text/libpaper-1.1.24-r1: some elog messages should only be shown for the first install.2012-10-31 16:12:32
440442Core systembase-systemUNCONFIRMEDsys-boot/grub-0.97-r12: some elog messages should only be shown for the first install.2012-10-31 16:13:08
440444ServerclusterUNCONFIRMEDsys-devel/icecream-0.9.7-r1: some elog messages should only be shown for the first install.2012-10-31 16:13:28
440446ApplicationsbluenessUNCONFIRMEDdev-util/valgrind-3.7.0-r4: some elog messages should only be shown for the first install.2012-10-31 16:13:46
440448Applicationsalsa-bugsUNCONFIRMEDmedia-sound/alsa-utils-1.0.25-r1: some elog messages should only be shown for the first install.2012-10-31 16:14:30
440452ApplicationsgraphicsUNCONFIRMEDmedia-gfx/grub-splashes-20091109: some elog messages should only be shown for the first install.2012-10-31 16:14:45
440454Applicationsx11UNCONFIRMEDx11-apps/xinit-1.3.2: some elog messages should only be shown for the first install.2012-10-31 16:14:56
440456Applicationsapp-dictsUNCONFIRMEDapp-text/aspell-0.60.6.1: some elog messages should only be shown for the first install.2012-10-31 16:15:12
440460ApplicationsbluenessUNCONFIRMEDnet-dns/avahi-0.6.30-r3: some elog messages should only be shown for the first install.2013-01-19 17:29:00
440464ApplicationsxmwUNCONFIRMEDnet-dns/dnssec-tools-1.14: some elog messages should only be shown for the first install.2012-10-31 21:15:16
440466ApplicationsnirbheekUNCONFIRMEDnet-misc/modemmanager-0.5.2.0-r3: some elog messages should only be shown for the first install.2012-10-31 16:16:29
440470Applicationsldap-bugsUNCONFIRMEDnet-nds/openldap-2.4.30: some elog messages should only be shown for the first install.2012-10-31 16:17:07
440476Core systembase-systemUNCONFIRMEDapp-admin/sudo-1.8.5_p2: some elog messages should only be shown for the first install.2012-10-31 16:18:06
440478Applicationspolynomial-cUNCONFIRMEDnet-ftp/pure-ftpd-1.0.36: some elog messages should only be shown for the first install.2012-10-31 16:18:31
440484ApplicationspatrickUNCONFIRMEDwww-servers/apache-2.2.23: some elog messages should only be shown for the first install.2013-02-16 13:34:36
440494Applicationsrobbat2UNCONFIRMEDdev-vcs/git-1.7.8.6: some elog messages should only be shown for the first install.2012-10-31 16:19:35
440502PrintingprintingUNCONFIRMEDnet-print/cups-1.5.2-r4: some elog messages should only be shown for the first install.2012-10-31 16:19:53
440508Applicationsford_prefectUNCONFIRMEDmedia-sound/pulseaudio-1.1-r1: some elog messages should only be shown for the first install.2012-12-07 20:08:23
440512Applicationsmaintainer-neededUNCONFIRMEDnet-im/skype-4.0.0.8-r1: some elog messages should only be shown for the first install.2013-01-03 19:31:53
440520Applicationsalsa-bugsUNCONFIRMEDmedia-libs/alsa-lib-1.0.25-r1: some elog messages should only be shown for the first install.2012-10-31 16:21:34
440576ApplicationspatrickUNCONFIRMEDapp-benchmarks/phoronix-test-suite-4.0.1: some elog messages should only be shown when upgrading fro2012-10-31 16:26:55
440598Eclasses and ProfilesfontsUNCONFIRMEDfont.eclass outputs elog messages that shoud only be displayed for new installs2012-10-31 16:05:11
440614ApplicationslackUNCONFIRMEDnet-dns/openresolv-3.4.1-r1: order of entries is not consistent with resolvconf -u on interface wake2012-10-31 16:01:39
440960ApplicationsgraphicsUNCONFIRMEDmedia-gfx/wings crashes at startup with incorrect version of erl_driver.h2012-11-02 17:02:33
441618JavajavaUNCONFIRMEDdev-java/icedtea-bin-7.2.3.3: should not install libsplashscreen.so with USE=-X2013-01-17 14:25:52
441666Unspecifiedx11UNCONFIRMEDmedia-libs/mesa: Install symlinks with splitdebug2012-11-04 00:12:13
441718GNOMEgnomeUNCONFIRMEDgnome-base/libbonoboui-2.24.5: QA Notice: This package installs one or more .desktop files that do n2012-11-21 18:48:50
441720PrintingprintingUNCONFIRMEDnet-print/cups-1.6.1: QA Notice: This package installs one or more .desktop files that do not pass v2012-11-27 16:02:55
441864ApplicationsvimUNCONFIRMEDapp-editors/vim-7.3.646 vim: stack smashing attack in function - terminated2012-11-05 13:04:29
441880ApplicationslehoUNCONFIRMEDmedia-tv/tvheadend-3.2 should not force --disable-dvbscan and should not install data in /usr/share/2012-11-30 01:57:07
441888ApplicationslehoUNCONFIRMEDmedia-tv/tvheadend-3.2 usage of xmltv is mysterious2012-11-05 17:16:09
441976StagesembeddedUNCONFIRMEDIdea: Providing a tiny stage (and profile) for limited embedded devices.2013-02-15 11:46:25
442078genkernelgenkernelUNCONFIRMEDsys-kernel/genkernel-3.4.45 - wrong lvm.static usage2013-01-04 17:15:11
442104Ebuildsmaintainer-wantedUNCONFIRMEDsci-geosciences/osmconvert - Tool for converting and processing OpenStreetMap files2012-11-06 21:45:24
442162ApplicationsdjcUNCONFIRMEDnet-misc/openvpn-2.1.4 - src_install: rmdir: failed to remove ‘/var/tmp/portage/net-misc/openvpn-2.12012-11-07 14:09:59
442222Ebuildsmaintainer-wantedUNCONFIRMEDdev-libs/thrust - a parallel algorithms library which resembles the C++ Standard Template Library2012-11-07 17:53:54
442232Ebuildsmaintainer-wantedUNCONFIRMEDsys-fs/hammer-{linux,read} - a port of the HAMMER File System from DragonFly BSD2012-11-07 19:44:43
442270Ebuildssci-astronomyUNCONFIRMEDsci-astronomy/aatm-0.4.3.1: fails to build2012-12-06 23:52:28
442320InstallCDreleaseUNCONFIRMEDinstall-cd (sparc) - errors at boot2012-12-16 05:42:05
442322Ebuildsmysql-bugsUNCONFIRMEDdev-db/myodbc-5.1.6 - Build fails against dev-db/mysql-5.5.28 - error: too many arguments to functio2013-02-09 20:29:48
442334JavajavaUNCONFIRMEDdev-java/jlex should install jlex launcher2012-11-08 15:36:52
442342Ebuildsmaintainer-wantedUNCONFIRMEDdev-perl/Data-Diver - Simple, ad-hoc access to elements of deeply nested structures2012-12-27 11:11:38
442388Ebuildsmaintainer-wantedUNCONFIRMEDapp-backup/storebackup - Storebackup is a backup suite that stores files on other disks.2012-11-08 23:28:56
442484LibrarycppUNCONFIRMEDdev-libs/boost-1.49.0-r2: Segmentation fault during install phase.2012-11-12 12:00:11
442522EbuildscppUNCONFIRMEDboost::unordered_multimap<>::erase(iterator, iterator) broken in boost1.49-1.512012-11-10 11:44:20
442534Ebuildsmaintainer-wantedUNCONFIRMEDapp-admin/puppetdb-1.0.2 ebuild request2012-11-10 22:53:28
442610ServerhollowUNCONFIRMEDwww-servers/nginx - Feature support request for dav-ext-module.2012-11-26 20:05:19
442616DevelopmentdjcUNCONFIRMEDdev-db/couchdb - /usr/lib/couchdb/bin/couchjs needs pax-mark mr on PaX-enabled systems.2013-01-12 18:34:44
442690baselayoutbase-systemUNCONFIRMEDsys-apps/baselayout - share.BSD/fstab device names have changed with FreeBSD 9.02012-11-12 22:39:21
442706ApplicationsultrabugUNCONFIRMEDapp-admin/rsyslog.service file does not work with newer sys-apps/systemd2012-11-22 08:33:40
442708FreeBSDbsdUNCONFIRMEDsys-fs/fuse4bsd -- version bump request2012-12-09 02:14:11
442734Keywording and StabilizationswegenerUNCONFIRMED~dev-util/systemtap-2.0 please stabilize2013-01-07 09:07:55
442814ApplicationsfloppymUNCONFIRMEDnet-misc/freerdp-1.1.0_pre20121004-r1 CMake Error at cunit/CMakeLists.txt:28 (add_executable): Canno2012-11-13 07:00:04
442826EbuildsxmwUNCONFIRMEDsys-power/suspend-1.0 - /usr/lib64/libfreetype.a(ftbzip2.o): In function `ft_bzip2_stream_close': (.2012-11-30 01:23:17
442838EbuildssciUNCONFIRMEDsci-libs/netcdf-cxx-4.2: fails tests2012-11-13 06:16:03
442874Applicationsnet-proxyUNCONFIRMEDnet-proxy/http-replicator - local rsync server reports install flash player as wrong size2012-11-14 00:16:31
442876Applicationspolynomial-cUNCONFIRMEDapp-emulation/virtualbox-4.2.4: after upgrade some VMs do not start anymore2013-01-02 19:55:58
442880EbuildssciUNCONFIRMED[science overlay] sci-libs/trilinos-10.12.2 - Version bump; install location fix; prefix support.2012-11-12 19:00:06
442920Ebuildsmaintainer-wantedUNCONFIRMEDmedia-sound/laditools - Control and monitor a LADI system the easy way.2012-11-13 12:30:44
442930New Documentationdocs-teamUNCONFIRMEDHow to install Gentoo with a UEFI motherboard2012-12-28 16:49:35
442992Prefix SupportprefixUNCONFIRMED2012-12-08 09:11:17
443476Ebuildsmaintainer-wantedUNCONFIRMEDapp-admin/reprepro - Tool for creating a Debian APT repository with a pool structure2012-11-16 16:10:46
443490ApplicationssciUNCONFIRMEDsci-misc/boinc - upstream switched to git2013-01-27 10:35:55
443510EbuildspythonUNCONFIRMEDdev-lang/python should install helper file for sys-devel/gdb2012-11-16 16:07:09
443512Ebuildsmaintainer-wantedUNCONFIRMEDsci-physics/fullprof - a set of crystallographic programs (FullProf, WinPLOTR, EdPCR, GFourier, etc.2012-11-19 15:34:40
443518Keywording and Stabilizationrobbat2UNCONFIRMEDdev-libs/libmemcached-0.50 stable request2012-11-20 07:42:08
443584ApplicationsgraphicsUNCONFIRMED>=media-gfx/nvidia-cg-toolkit-3.1.0013 - Breaks flash websites. - Inconsistency detected by ld.so: d2012-11-19 18:47:29
443600ApplicationssoundUNCONFIRMEDmedia-libs/libsndfile-1.0.25 - Fails test with SyntaxError: invalid syntax in binheader_writef_check2012-11-17 18:45:12
443630ApplicationsselinuxUNCONFIRMEDSELinux + >app-emulation/libvirt-0.9.13-r1 - Segfault starting qemu domains.2013-02-16 18:03:09
443636Core systemnet-fsUNCONFIRMEDnet-fs/davfs2-1.4.7 - User mount does not work, no entry for http://HOST/owncloud/files/webdav.php f2013-02-13 22:40:25
443728EbuildshwoarangUNCONFIRMEDapp-laptop/prey-0.5.4-r1: /etc/init.d/prey-trigger is installed as invalid symlink, first run attemp2013-01-15 19:43:12
443804EbuildssystemdUNCONFIRMEDsys-apps/systemd should install python-systemd bindings2012-11-19 09:42:48
443890Applicationsnet-imUNCONFIRMEDnet-im/ejabberd - typo in /etc/init.d/ejabberd : EJABBERDCTL_OPT instead of EJABBERDCTL_OPTS2012-11-20 19:41:35
443932ApplicationsswegenerUNCONFIRMEDapp-misc/screen - add USE=static2012-11-19 19:43:25
443950Ebuildsgnome-mmUNCONFIRMEDdev-cpp/cairomm-1.10.0 USE="doc" installs documentation outside /usr/share/doc/$PF2012-11-19 20:31:56
443962Core systemppc64UNCONFIRMEDsys-boot/yaboot-static-1.3.17-r1 unable to read ext2 filesystem on powermac G52012-11-20 00:06:17
444104ApplicationssciUNCONFIRMEDsci-libs/scipy-0.11.0 - numpy.distutils.system_info.BlasNotFoundError2012-12-06 15:49:39
444135Applicationsmaintainer-neededUNCONFIRMEDapp-misc/gpsdrive-2.11-r3 with boost-1.52.0-r3: /var/tmp/portage/app-misc/gpsdrive-2.11-r3/work/gpsd2013-01-11 19:10:30
444218ApplicationspatrickUNCONFIRMEDwww-servers/apache-2.4.3 - init script doesn't handle failed start correctly2013-02-16 13:19:08
444232Core systembase-systemUNCONFIRMEDsys-apps/coreutils: Add USE=hostname for those who do not want net-tools2012-11-27 05:09:49
444380ApplicationsvoipUNCONFIRMEDnet-voip/ekiga-3.2.7 - Fails src_test for LINGUAS=en_GB - Document ./en_GB/ekiga.xml does not valida2012-11-22 22:49:37
444390ServersysadminUNCONFIRMEDnet-analyzer/nagios - Directory permissions for /etc/nagios are wrong, apache can't start2012-11-23 17:41:24
444394Core systemlu_zeroUNCONFIRMEDsys-apps/dtc-1.3.0-r1 - /usr/bin/install: cannot stat 'fdtdump': No such file or directory2012-12-21 15:58:17
444402Serverrobbat2UNCONFIRMEDnet-misc/memcached - Malformed pid filename when running multiple instances2012-11-23 09:40:18
444428Core systemppc64UNCONFIRMEDsys-devel/kgcc64: kill off usage for ppc systems2012-11-26 07:49:40
444442Applicationsx11UNCONFIRMEDx11-drivers/xf86-video-sis with xorg-server-1.13.0-r1 - X segfaults at startup2012-11-25 11:46:37
444448Third-Party Toolstools-portageUNCONFIRMEDapp-portage/genlop: 'genlop -i' should print last merge time too2012-11-23 15:57:18
444486Keywording and StabilizationnaotaUNCONFIRMEDPlease stabilize =sys-fs/nilfs-utils-2.1.42013-02-03 13:07:08
444502ApplicationspatrickUNCONFIRMEDapp-benchmarks/phoronix-test-suite-4.0.1 - No matter what, it complains that PHP_TARGETS is empty2012-12-25 22:09:37
444532Applicationsrobbat2UNCONFIRMEDnet-misc/cfengine try to exec /sbin/ifconfig instead of /bin/ifconfig2013-02-08 06:53:29
444602ApplicationsvirtualizationUNCONFIRMEDapp-emulation/virtinst-0.600.3 - Exception in thread Checking storage allocation2013-02-16 18:03:56
444652OpenRCopenrcUNCONFIRMEDUpgrade to OpenRC 0.11.5 breaks services: "You are attempting to run an openrc service on a system w2012-12-16 02:58:07
444668KDEkdeUNCONFIRMEDkde-base/kmix-4.9.3 causes plasma system tray to flicker2013-02-14 20:28:22
444692ApplicationsxmwUNCONFIRMEDnet-misc/aiccu systemd support2012-12-27 21:50:10
444700Applicationsnet-p2pUNCONFIRMEDnet-p2p/rtorrent-0.9.2 could not start initscript2012-12-29 14:14:37
444946Ebuildsmaintainer-wantedUNCONFIRMEDdev-python/txscheduling-1.1 - A scheduling plugin for Twisted2013-02-17 16:25:45
444964Applicationsx11UNCONFIRMEDx11-drivers/xf86-video-ati-7.0.0 with x11-base/xorg-server-1.13 - second X server fails to start on 2012-12-15 18:49:10
445004Ebuildsmaintainer-wantedUNCONFIRMEDapp-text/sgml-base - SGML infrastructure and SGML catalog file support2012-11-27 22:29:18
445014Ebuildsmaintainer-wantedUNCONFIRMEDdev-libs/xml-core - XML catalog infrastructure support2012-11-30 22:13:51
445081ApplicationspythonUNCONFIRMEDnet-zope/zope-interface-3.8.0 - src_test(): TypeError: metaclass conflict: the metaclass of a derive2013-02-02 10:01:54
445083ApplicationsdjcUNCONFIRMEDdev-vcs/mercurial-2.1.1 src_test(): ...: Permission denied2012-12-16 14:33:53
445132Core systemtoolchainUNCONFIRMEDsys-devel/gdb-7.5: build fails w/-ftracer on amd64: linux-x86-low.c:2939: Error: symbol 'start_i386_2012-11-29 19:36:23
445186Installation Handbookdocs-teamUNCONFIRMEDA link to the online list of local USE flags is missing in the installation handbook2012-11-29 12:18:57
445276Ebuildsnet-mailUNCONFIRMEDmail-client/alpine-2.10 - Version bump request.2013-01-22 08:16:27
445278PrintingprintingUNCONFIRMED>=net-print/cups-1.5.3 - Broken for some printer models [prints half last page]2013-02-19 17:40:28
445470Keywording and Stabilizationdesktop-miscUNCONFIRMEDx11-misc/numlockx-1.2 - Request for ~arm keyword.2012-12-01 15:19:19
445534GamestuponeUNCONFIRMEDmedia-libs/varconf-1.0.0: version bump request2012-12-02 01:59:02
445540ApplicationstomjbeUNCONFIRMED>=app-backup/bacula-5.0.3 - Upstream doesn't officially support SQLite.2012-12-03 05:48:57
445544Applicationsmedia-videoUNCONFIRMEDmedia-video/dvdstyler-2.3.4 - Fails to generate iso, consider to hard-mask this version.2012-12-03 05:50:21
445548Ebuildsmaintainer-wantedUNCONFIRMEDnet-analyzer/tespeed - New package. - Terminal network speed test that uses servers from Speedtest.n2012-12-04 09:31:07
445550ApplicationsalexxyUNCONFIRMEDwww-apps/rutorrent-3.4-r1: outputs garbage to Apache error.log if PHP is running in strict mode2012-12-02 06:13:37
445568Librarynet-mailUNCONFIRMEDmail-mta/postfix with dev-libs/cyrus-sasl-2.1.25-r3 - broken SASL authentication2012-12-20 12:06:09
445570Applicationsdesktop-wmUNCONFIRMEDx11-wm/icewm - Displays black instead of icons (for some apps).2012-12-03 06:01:49
445594Core systembluenessUNCONFIRMEDsys-apps/coreutils - FAIL: tests/cp/fiemap-FMR.sh - Fails src_test with -march=native : valgrind "un2013-02-12 03:34:41
445636Librarybase-systemUNCONFIRMEDdev-libs/libpcre-8.32 - stack size should be increased for the test case2012-12-04 15:29:58
445712Libraryx11UNCONFIRMEDapp-emulation/emul-linux-x86-opengl-20121202 does not install /us/lib32/libGLU.so.12013-01-23 19:53:52
445722DevelopmentcppUNCONFIRMEDdev-libs/STLport-9999 - add a live ebuild2012-12-03 11:24:22
445736Ebuildsmaintainer-wantedUNCONFIRMEDdev-libs/weston-1.0.2 - Wayland reference compositor2013-02-19 12:11:30
445776Ebuildsnet-p2pUNCONFIRMEDnet-p2p/wire-1.1.3 version bump request2012-12-03 11:25:21
446122ApplicationsjlecUNCONFIRMED[science overlay] sci-chemistry/apbs-1.3-r3 with sci-libs/mkl-11.0.0.079 - ../../src/aaa_lib/.libs/l2012-12-12 07:38:17
446172Core systempam-bugsUNCONFIRMEDsys-libs/pam-1.1.5 fails to cross-compile because flex is not installed in the target2013-01-09 09:31:35
446251EbuildsgstreamerUNCONFIRMEDmedia-plugins/gst-plugins-dts and others shouldn't depend on media-libs/gst-plugins-bad2012-12-09 05:36:59
446275KDEkdeUNCONFIRMEDpython ABI deps support for system-config-printer-kde and printer-applet2012-12-11 14:07:52
446312ApplicationsxmwUNCONFIRMEDapp-shells/autojump-21.1.0 causes startDM.sh to segfault during system start2013-01-25 08:51:42
446386Core systembase-systemUNCONFIRMEDsys-devel/automake-1.12.5 fails tests related to yacc2012-12-08 05:53:22
446614ApplicationsvadimkUNCONFIRMEDapp-emulation/vmware-workstation-9.0.1.894247 - vmui| I120: SymBacktrace[0] 00007fff80c53fc0 rip=0002013-02-13 10:37:51
446628EbuildsgraphicsUNCONFIRMEDmedia-gfx/gtkimageview-1.6.4 should not restrict userpriv when not running tests2012-12-09 23:41:57
446644EbuildscardoeUNCONFIRMEDmedia-tv/ivtv-firmware-20080701 should probably not be mirror-restricted2012-12-10 12:04:48
446682Applicationsamd64UNCONFIRMEDapp-emulation/emul-linux-x86* - new libraries for steam platform2013-02-20 22:44:38
446698LibrarytoolchainUNCONFIRMEDdev-libs/ppl-1.0 version bump request2013-02-05 08:27:08
446720VulnerabilitiessecurityUNCONFIRMED2012-12-11 12:34:11
446734EbuildshollowUNCONFIRMEDwww-servers/nginx - init script changes owner and mode of /var/log/nginx on each startup/restart2013-01-21 03:28:06
446796ApplicationsprefixUNCONFIRMEDapp-misc/pax-utils: src_install tries to compile stuff2013-01-02 17:41:59
446828Applicationsrobbat2UNCONFIRMEDnet-analyzer/sslsniff-0.8-r1 - conftest.cpp:21:26: fatal error: boost/asio.hpp: No such file or dire2012-12-11 22:11:50
446850HardenedhardenedUNCONFIRMEDthunderbird-17.0-r2 fails to install with CONFIG_PAX_MPROTECT enabled2012-12-14 17:52:48
446924LibrarymabiUNCONFIRMEDx11-libs/fox-1.6.40 - Upstream bug makes build ignore -opengl.2013-01-02 19:32:57
446968Applicationsmaintainer-neededUNCONFIRMEDnet-misc/netkit-telnetd-0.17-r10 - Use native gcc instead of CC (cross compile issue)2013-02-16 13:35:19
446974Ebuildsmaintainer-wantedUNCONFIRMEDdev-libs/libpreludedb, app-admin/prelude-manager, net-analyzer/prewikka resurrection request2012-12-27 21:31:08
447100genkernelgenkernelUNCONFIRMEDsys-kernel/genkernel should have an option to avoid firmware installation at all2013-02-17 11:31:29
447102Applicationsidl0rUNCONFIRMEDnet-analyzer/nagstamon-0.9.9 throws glib.GError: Couldn't recognize the image file format for file '2012-12-13 14:34:59
447192Ebuildsmaintainer-wantedUNCONFIRMEDapp-admin/logstash - a tool for managing events and logs2013-02-02 04:42:43
447222Applicationsmaintainer-wantedUNCONFIRMEDAdd standalone xulrunner for MonoDevelop.2013-01-15 08:03:00
447246KDEkdeUNCONFIRMEDkde-misc/kolor-manager-0.99 crashes when media-libs/oyranos-0.9.1 is built against app-admin/elektra2013-02-10 22:35:46
447266Ebuildsmaintainer-wantedUNCONFIRMED=app-text/ghostpdl-9.06 - New package. - GhostPCL, GhostXPS, Ghostscript and GhostPDF Interpreters2012-12-14 23:49:32
447328genkernelgenkernelUNCONFIRMEDsys-kernel/genkernel-3.4.45: encrypted filesystems from initramfs.mounts cannot be mounted2012-12-15 11:14:42
447348Prefix SupportprefixUNCONFIRMEDbootstrap-prefix fails on emerge 'sed'2012-12-18 16:15:59
447436Applicationstools-portageUNCONFIRMED=app-portage/genlop-0.30.8-r2 - Use of uninitialized value in concatenation (.) or string at /usr/b2012-12-17 07:12:11
447474Core systembase-systemUNCONFIRMEDsys-devel/make-3.82-r4 - fails 1 test in features/parallelism2012-12-17 16:10:34
447502LibrarysciUNCONFIRMEDdev-python/numpy-1.6.2 - FAIL: test_pareto (test_random.TestRandomDist)2013-01-05 08:15:18
447532Applicationssci-chemistryUNCONFIRMEDsci-chemistry/avogadro segmentation fault with icc-built openbabel2012-12-18 16:45:45
447534Applicationspolynomial-cUNCONFIRMEDapp-emulation/virtualbox-4.1.22-r1 - VBox/Runtime/common/string/strformatrt.cpp:829:19: internal com2012-12-23 18:30:14
447556Mac OSXprefixUNCONFIRMEDdev-python/virtualenv-1.8.4 emerge failed with error virtualenv-3.3 already exists2013-01-19 18:48:58
447626Applicationslu_zeroUNCONFIRMEDmedia-gfx/blender should not use environment variables to set installation directories2013-01-31 09:26:50
447678OpenRCopenrcUNCONFIRMEDsys-apps/openrc-0.11.8 - rm: cannot remove /run/openrc: Read-only file system2012-12-19 17:54:11
447688Prefix SupportprefixUNCONFIRMEDsys-fs/mtools: ld fails to build because of lost libiconv linkage flag2012-12-18 20:29:17
447694Applicationsford_prefectUNCONFIRMEDmedia-sound/pulseaudio-2.99.3 USE=-system-wide - * Starting D-BUS system messagebus ... Unknown user2013-01-30 07:04:04
447746Librarymedia-videoUNCONFIRMED[PATCH] media-libs/mlt-0.8.2 builds with -DARCH_X86_64 even though CHOST=i686-pc-linux-gnu and fails2012-12-24 10:27:50
447774Core systempatrickUNCONFIRMEDsys-libs/tdb-1.2.11: tdb.h uses mode_t but does not include relevant system header2012-12-19 02:24:08
447780EbuildspatrickUNCONFIRMEDnet-analyzer/snort init scripts snort.rc1* still use opts variable2012-12-19 02:35:38
447782LibrarycppUNCONFIRMEDdev-libs/boost-1.52.0-r5 - .../temp/environment: line 964: 31328 Segmentation fault b2 "$@"2012-12-19 13:37:44
447812Keywording and Stabilizationmaintainer-neededUNCONFIRMEDapp-doc/gimp-help-2.6.1 stable request2013-02-16 13:26:25
447846GamesgamesUNCONFIRMEDgames-roguelike/scourge removal request2012-12-19 16:40:04
447882Keywording and Stabilizationweb-appsUNCONFIRMEDKeyword request: Please add the sparc keyword to www-apps/gallery2012-12-20 14:52:24
447902Ebuildsnet-proxyUNCONFIRMEDnet-proxy/dansguardian-2.12.0.3 version bump request2012-12-21 05:38:19
447960ApplicationssysadminUNCONFIRMEDnet-analyzer/munin: Rename 'apache' USE flag to 'apache2' for consistency2012-12-20 15:56:04
447970Core systemsandboxUNCONFIRMEDsys-apps/sandbox makes autoconf's getcwd long path test take hours2013-01-31 14:19:12
447996Applicationsldap-bugsUNCONFIRMEDnet-nds/openldap tries to start before net.eth0 and fails2012-12-22 13:00:56
448062ApplicationswilliamhUNCONFIRMEDapp-accessibility/speech-dispatcher-0.7.1-r1 src_compile(): mv: cannot stat '.deps/spd_audio.Tpo': N2013-01-01 12:02:28
448104DevelopmentperlUNCONFIRMEDdev-perl/PortageXS-0.02.10-r2 - test-suite fails - Cannot open file /etc/portage/make.conf at lib//P2012-12-24 09:37:14
448110DevelopmentsciUNCONFIRMEDdev-python/rpy-2.2.6-r1 fails test testInterruptR - AssertionError: True is not false2013-01-23 17:03:53
448112ApplicationsspingUNCONFIRMEDmedia-gfx/gimp-2.8.2-r1 has several test failures.2012-12-24 00:28:37
448130ApplicationsopenofficeUNCONFIRMEDapp-office/libreoffice-3.6.4.3 - /usr/lib64//libclucene-core.so: undefined reference to `std::__deta2012-12-27 07:54:58
448152Applicationslu_zeroUNCONFIRMEDapp-emulation/qemu-user-1.0 should depend on sys-apps/usbredir[static-libs]2012-12-24 16:15:07
448206Core systemlu_zeroUNCONFIRMEDflag-o-matic.eclass: `CHOST=${CTARGET} strip-unsupported-flags` doesn't strip flags2013-01-07 17:18:12
448254Keywording and Stabilizationphp-bugsUNCONFIRMED=dev-libs/libxdiff-0.23 - Please stabilize2012-12-24 15:41:34
448268Core systembase-systemUNCONFIRMEDsys-apps/less-457 should use elog instead of einfo2012-12-24 08:32:38
448294Applicationspolynomial-cUNCONFIRMEDapp-emulation/virtualbox-4.2.6: cannot open shared object libstdc++.so.62012-12-24 10:19:17
448314ServergrobianUNCONFIRMEDmail-mta/exim-4.80.1: relay_from_hosts default should include the ::1 address2013-02-03 21:15:05
448316Ebuildsdev-zeroUNCONFIRMEDapp-emulation/spice: error BadMatch request X_SetInputFocus2012-12-25 16:38:18
448340LibrarymozillaUNCONFIRMEDdev-libs/nss-3.14 - nsinstall: Comando não encontrado2012-12-28 23:13:21
448342GNOMEgnomeUNCONFIRMED[gnome-overlay] =app-admin/gnome-system-tools-3.0.0: undefined reference to `g_thread_init'2012-12-23 23:45:59
448400Librarymaintainer-wantedUNCONFIRMEDdev-php/PEAR-Image_Barcode2 - generate barcode representations of given strings2012-12-24 16:11:53
448416GamesgamesUNCONFIRMEDgames-strategy/dungeon-defenders - Humble Indie Bundle 7 game2013-01-04 00:06:56
448466EbuildssoundUNCONFIRMEDmedia-sound/gpodder 3.4.0 version bump request2012-12-25 03:39:36
448470Core systemrobbat2UNCONFIRMEDsys-process/audit-2.2.2 incorrectly suggests removal of /lib/libauparse.so.02013-02-03 19:08:30
448558Applicationsphp-bugsUNCONFIRMEDdev-php/PEAR-Mail_Mime-1.8.7 version bump request2012-12-25 17:46:14
448564Keywording and Stabilizationphp-bugsUNCONFIRMEDplease stabilize dev-php/pecl-apc-3.1.132013-01-28 10:43:52
448566GNOMEgnomeUNCONFIRMEDmedia-sound/rhythmbox should RDEPEND on media-plugins/gst-plugins-gio2012-12-25 18:04:00
448624genkernelgenkernelUNCONFIRMEDlast step of compile_kernel() does not respect ${KERNEL_OUTPUTDIR} in genkernel-3.4.452012-12-26 01:26:22
448698ApplicationsvoipUNCONFIRMEDnet-voip/ekiga wipes out ~/.config/ekiga.conf on start2012-12-26 23:42:19
448750Applicationsphp-bugsUNCONFIRMEDdev-php/PEAR-Mail: Fix non-static function warning2012-12-27 02:01:00
448764ApplicationsopenofficeUNCONFIRMEDapp-office/libreoffice-3.6.4.3 fails with dev-libs/boost-1.52.0-r5 (bug 425356 strikes again!)2012-12-27 05:37:52
448780DevelopmentrubyUNCONFIRMED=dev-ruby/webmock-1.7.4 - Many tests failed.2013-02-20 06:24:05
448788InstallCDreleaseUNCONFIRMEDAMD 64 install CD: wireless network card not detected (lenovo T61, Intel Wireless 4965) - missing fi2012-12-27 07:54:59
448790Core systemrobbat2UNCONFIRMEDsys-fs/lvm2 - Please don't depend on udev when USE="+static -udev". (was: static flag requires +udev2013-02-10 16:07:22
448900LibrarygraphicsUNCONFIRMEDmedia-libs/gexiv2-0.5.0 version bump request2012-12-28 14:52:07
448906Miscbase-systemUNCONFIRMEDnet-firewall/iptables-1.4.16.3 upgrade does not preserve state matches2013-01-02 20:09:23
448910Applicationsqmail-bugsUNCONFIRMEDmail-mta/netqmail-1.06 - Force python version to 2.x. - pkg_postinst - SyntaxError: invalid token "02012-12-28 13:08:59
448914Ebuildsrobbat2UNCONFIRMEDdev-db/libdbi-drivers needs a local description of bindist USE-flag2012-12-27 19:52:27
448918EbuildsswegenerUNCONFIRMEDdev-db/opendbx needs a local description of bindist USE-flag2012-12-27 20:13:18
448926EbuildsfontsUNCONFIRMEDmedia-libs/freetype needs a local description of bindist USE-flag2012-12-27 20:19:55
448928EbuildssoundUNCONFIRMEDmedia-libs/libaacplus needs a local description of bindist USE-flag2012-12-27 20:21:50
448930EbuildsvoipUNCONFIRMEDmedia-libs/mediastreamer needs a local description of bindist USE-flag2013-02-16 14:09:18
448934EbuildsvoipUNCONFIRMEDmedia-plugins/mediastreamer-silk needs a local description of bindist USE-flag2012-12-27 20:27:17
448938EbuildsnikoliUNCONFIRMEDmedia-video/mplayer2 needs a local description of bindist USE-flag2012-12-27 20:30:03
449044GNOMEgnomeUNCONFIRMED[gnome overlay] x11-terms/gnome-terminal-9999 fails to install : README does not exist2012-12-28 14:04:18
449116EbuildsdanielpiUNCONFIRMEDapp-accessibility/julius::sunrise and sci-libs/fplll::sage-on-gentoo both install /usr/bin/generate2012-12-29 11:48:00
449132ApplicationschutzpahUNCONFIRMED>=app-admin/salt-0.11.0 does not install config template files2012-12-29 11:40:31
449200Keywording and StabilizationaballierUNCONFIRMED=dev-libs/kpathsea-6.1.0_p20120701: please stabilize2013-02-17 13:11:18
449202Keywording and StabilizationaballierUNCONFIRMED=app-text/ps2pkm-1.5_p20120701: please stabilize2012-12-29 15:32:06
449232ApplicationssciUNCONFIRMED[science overlay] sci-libs/cholmod-2.0.1: pkg-config fails to find lapack libraries installed from s2013-01-29 19:26:55
449238Applicationsmedia-videoUNCONFIRMEDmedia-video/gpac-0.5.0 should use --extra-cflags in configure instead of overriding OPTFLAGS2012-12-31 15:11:00
449266LibrarycppUNCONFIRMEDdev-libs/Ice-3.4.2-r1 - /usr/lib64/libIceGrid.so.34: undefined reference to `IceInternal::upCast(Ice2012-12-31 15:31:18
449296KDEkdeUNCONFIRMEDnet-im/ktp-call-ui-0.5.1: gsttaglist.h:152:28: error: conflicting declaration ‘typedef struct _GstTa2013-01-18 10:50:15
449298Keywording and StabilizationtexUNCONFIRMED=app-text/texlive-2012: please stabilize2013-01-21 17:21:51
449306Applicationsmedia-videoUNCONFIRMEDmedia-video/gaupol-0.21 version bump request2012-12-30 16:48:12
449320LibrarysciUNCONFIRMEDsci-libs/cholmod-2.0.1 - configure: .../temp/ccKrajc0.o: In function `main': conftest.c:(.text+0x7):2013-01-05 00:28:07
449354ApplicationsqemuUNCONFIRMEDapp-emulation/qemu-guest-agent fails to shutdown the guest2013-01-01 20:32:37
449372Applicationsmedia-videoUNCONFIRMEDnet-misc/mediatomb - broken Samsung 2012 TV send an invalid request2013-01-24 20:18:11
449470Core systemjdhoreUNCONFIRMEDsys-apps/lm_sensors-3.3.3-r1 init.d/sensord tries to run /usr/sbin/sensorsd instead of /usr/sbin/sen2013-02-02 12:22:54
449496GNOMEgnomeUNCONFIRMEDgnome-base/gnome-shell-3.6.2-r1: on non-gdm systems needs new dependency on gnome-screensaver2013-02-01 16:55:53
449630KDEkdeUNCONFIRMEDkde-base/kdelibs-4.9.4-r1: several *.desktop files are not compliant with XDG standard (missing trai2013-01-01 13:31:13
449654Ebuildsmaintainer-wantedUNCONFIRMEDmedia-video/subliminal-0.6.2.ebuild - Subtitles, faster than your thoughts2013-01-22 02:24:52
449726GamesgamesUNCONFIRMEDgames-board/raptor: request for ebuild2013-01-08 08:29:48
449742ApplicationskdeUNCONFIRMEDnet-im/ktp-call-ui-0.5.1 does not build with net-libs/telepathy-farstream-0.6.02013-02-19 21:49:10
449794Ebuildsmaintainer-wantedUNCONFIRMEDapp-emulation/tilem-2.0 - an emulator and debugger for Texas Instruments Z80-based graphing calculat2013-01-03 00:16:42
449950Applicationsnet-dialupUNCONFIRMED=net-dialup/pptpd-1.3.4-r1 incorrect restart: no matching processes found2013-01-17 06:58:53
450084Keywording and StabilizationpythonUNCONFIRMEDPlease stabilize =dev-python/virtualenv-clone-0.2.42013-01-05 17:04:31
450086Keywording and StabilizationpythonUNCONFIRMEDPlease stabilize =dev-python/stevedore-0.62013-01-05 17:04:57
450116Ebuildsnet-mailUNCONFIRMEDnet-mail/fetchyahoo-2.14.9 bump request2013-01-05 16:03:52
450220ApplicationsprintingUNCONFIRMED=net-print/cups-1.5.2-r4 - German localization file has empty strings.2013-01-05 18:07:19
450262LibrarygnustepUNCONFIRMEDgnustep-base-1.24.0-r1 - Assembler messages: {standard input}:1430: Error: symbol `_OBJC_CLASS_GCObj2013-01-05 17:44:50
450330StagesreleaseUNCONFIRMEDno service can provide "net" on arm stage3-armv6j_hardfp (last known good build Nov 15 2012)2013-01-05 05:01:43
450340GNOMEgnomeUNCONFIRMEDgnome-extra/hamster-applet-2.32.1 possibly has wrong RESTRICT_PYTHON_ABIS2013-01-06 22:38:36
450406Applicationsidl0rUNCONFIRMEDnet-dns/bind-9.9.2_p1: /etc/bind/named.conf now points to /var/bind/root.cache (symlink) instead to 2013-01-07 03:35:32
450440Core systemmaintainer-wantedUNCONFIRMEDnet-fs/xtreemfs - XtreemFS is a fault-tolerant distributed file system for all storage needs2013-01-07 02:42:31
450682Keywording and Stabilizationsci-geosciencesUNCONFIRMEDsci-libs/gdal-1.9.2 stable request2013-01-07 11:55:21
450714Core systemtoolchainUNCONFIRMEDsys-libs/glibc-2.16.0: /usr/include/bits/stdlib-ldbl.h:35:1: error: 'qecvt' undeclared here (not in 2013-01-20 01:23:38
450772DevelopmentvoyageurUNCONFIRMEDsys-devel/llvm-9999 - subversion: can't fetch to /var/portage/distfiles/svn-src/llvm/trunk from http2013-01-09 19:43:43
450776HardenedhardenedUNCONFIRMEDapp-emulation/wine-1.5.21 - configure: checking for -lGL... ./conftest: error while loading shared l2013-02-11 21:23:57
450814Keywording and StabilizationsoundUNCONFIRMEDmedia-libs/flac-1.2.1-r4 stable request2013-01-08 14:04:48
450906Keywording and StabilizationsciUNCONFIRMEDsci-libs/libqalculate-0.9.7-r1: please stabilize2013-01-08 17:08:14
450908Keywording and Stabilizationia64UNCONFIRMEDsys-boot/gnu-efi-3.0s: please stabilize2013-01-08 17:08:39
450912Ebuildsmaintainer-wantedUNCONFIRMEDsci-libs/pg2plplot - Assist the transition from PGPlot to PLplot in Fortran programs2013-01-08 17:10:27
450942ServerjsbronderUNCONFIRMEDsys-cluster/mpe2-1.0.6_p1 installs mpecc.in and mpefc.in to /usr/bin/2013-01-08 20:09:17
450946Ebuildsmaintainer-wantedUNCONFIRMEDapp-vim/syntastic - vim plugin: Syntastic is a syntax checking plugin that runs files through extern2013-01-08 20:07:20
450956LibrarycppUNCONFIRMEDdev-libs/boost USE=icu - sub-slot operator causes downgrade to dev-libs/icu-49.1.22013-01-12 13:32:41
451054LibrarycjkUNCONFIRMEDdev-libs/oniguruma-5.9.2-r1 - autotools-utils_src_prepare: Cannot find the latest automake! Tried 1.2013-01-09 14:27:12
451056DevelopmentjsbronderUNCONFIRMEDsys-cluster/mpich2-1.2.1_p1-r1 fails to crosscompile: configure: error: Unable to determine Fortran 2013-01-09 15:17:48
451132ApplicationsrajivUNCONFIRMEDnet-dns/dnstop version bump request2013-02-03 15:00:48
451174DevelopmentwltUNCONFIRMEDdev-db/firebird-2.1.3.18185.0 - Unable to complete network request to host "localhost". Error readin2013-01-10 12:51:53
451290LibraryhaskellUNCONFIRMEDdev-haskell/pandoc-types-1.9.1.1 - setup: At least the following dependencies are missing: syb -any2013-01-11 18:00:06
451316ApplicationscedkUNCONFIRMEDnet-firewall/conntrack-tools-0.9.14 - parse.c:230:34: error: ‘NULL’ undeclared (first use in this fu2013-01-11 16:17:24
451394Applicationsrobbat2UNCONFIRMEDsci-mathematics/nusmv-2.5.2 USE=minisat - SolverTypes.h:126:56: error: cast from 'void*' to 'int' lo2013-01-12 16:25:09
451452Core systemrobbat2UNCONFIRMEDsys-fs/lvm2-2.02.97-r1 - Errors on LV create/delete operations in systemd-196 environment.2013-02-07 01:16:09
451456LibraryqtUNCONFIRMED[qt overlay] Qt5 packages try to link against already installed versions during recompilation2013-02-14 11:59:11
451478Core systemrobbat2UNCONFIRMEDsys-fs/lvm2 - /etc/init.d/lvm should support multiple volume groups - Command failed with status cod2013-01-31 02:20:00
451488Prefix SupportprefixUNCONFIRMEDbootstrap tar-1.26 fails with glibc 2.16 (no gets)2013-02-03 08:06:36
451504ApplicationsmozillaUNCONFIRMEDwww-client/firefox-18.0/www-client/seamonkey-2.15 failed (install phase) [to emerge]; incorrect pag2013-02-07 15:47:44
451510ApplicationsnirbheekUNCONFIRMEDnet-misc/networkmanager-0.9.4.0-r6 does not pass hostname to DHCP server2013-01-12 16:42:13
451532GNOMEgnomeUNCONFIRMEDnet-libs/webkit-gtk-1.10.2 - ALT parameter is not shown instead of the image2013-01-13 09:53:12
451574ApplicationsdjcUNCONFIRMEDnet-misc/openvpn-2.2.2: cannot open ifconfig-pool-persist file on startup2013-01-13 10:36:53
451584ApplicationscardoeUNCONFIRMEDapp-emulation/libvirt-1.0.1 - does not start LXC VM2013-02-05 17:25:51
451622Core systembase-systemUNCONFIRMEDsys-apps/man-db-2.6.3-r1[nls]: Translated manpages will not be installed if app-text/po4a is not ins2013-01-15 12:05:38
451668ApplicationsproaudioUNCONFIRMEDmedia-sound/lash-0.5.4-r1 with sys-devel/gcc-4.7.2 - lash.c:203:19: error: storage size of ‘max_fds’2013-02-03 22:16:12
451674ApplicationsgamesUNCONFIRMEDgames-strategy/xconq-7.4.1 fails to build with dev-lang/tcl-8.6.02013-01-14 07:03:16
451824ApplicationsalexxyUNCONFIRMEDsci-chemistry/vmd-1.9.1-r2 with tcl/tk-8.6 break g(r) analysis module2013-01-17 20:52:47
451846Installation Handbookdocs-teamUNCONFIRMEDwireless-tools no longer function with default installation2013-01-20 16:04:16
451922Core systemtoolchainUNCONFIRMEDsys-libs/glibc-2.15-r3 installs despite test failures2013-01-16 02:40:16
451946ApplicationszerochaosUNCONFIRMEDdev-ruby/metasploit_data_models-0.4.0 version bump request2013-01-15 12:25:13
451966Applicationsrobbat2UNCONFIRMEDapp-misc/g15daemon start-stop-daemon: fopen `/var/run/g15daemon.pid': No such file or directory2013-01-15 12:27:28
451990LibraryemacsUNCONFIRMEDapp-emacs/python-mode-6.1.0 should install autopair2013-01-15 12:34:04
452162ApplicationspachoUNCONFIRMED=net-wireless/bluez-5.2 version bump request2013-02-08 20:41:38
452378ServerclusterUNCONFIRMED>=sys-cluster/ceph-0.55.1 with dev-libs/boost-1.49 - In file included from mds/Dumper.cc:24: /usr/in2013-01-15 17:14:48
452482Applicationsmedia-videoUNCONFIRMEDmedia-video/libav-0.8.5 ABI=x32 - libavutil/x86/cpu.c:52: Error: invalid instruction suffix for `pus2013-02-03 00:43:50
452484ApplicationsnikoliUNCONFIRMED=media-video/mplayer2-2.0_p20120828 ABI=x32 - cpudetect.c:206: Error: invalid instruction suffix for2013-01-29 12:55:58
452546LibrarychutzpahUNCONFIRMEDdev-python/cov-core should not RDEPEND on dev-python/pytest2013-01-16 16:14:02
452558DevelopmentmlUNCONFIRMEDdev-lang/mlton-20100608 fails to build, unknown type name '__gmp_const'2013-01-25 08:43:11
452578DevelopmentyamakuzureUNCONFIRMED[seden overlay] dev-util/eclipse-sdk-3.7.1-r9 fails to start when 2013-01-17 09:24:25
452624Ebuildsmaintainer-wantedUNCONFIRMED[bumprequest] dev-ruby/fcgi - FastCGI library for Ruby2013-02-20 12:36:37
452676ServerjsbronderUNCONFIRMEDsys-cluster/torque - new HOMEPAGE2013-01-17 15:39:49
452730Applicationsdesktop-wmUNCONFIRMEDx11-wm/icewm-1.3.7 suggested patches2013-01-18 22:55:56
452776OpenRCopenrcUNCONFIRMEDsys-apps/openrc-0.11.*: system fails to shutdown with automount+nfs2013-02-16 13:44:26
452842ServerclusterUNCONFIRMEDsys-cluster/ceph: add udev rules for rbd devices2013-01-19 16:19:09
452898DevmanualdevmanualUNCONFIRMEDPortage only does dependency checking on the latest slot2013-01-21 15:46:28
452900DevelopmenttommyUNCONFIRMEDdev-vcs/subversion-1.7.7 when rubygems isn't installed for ruby18 - .../work/subversion-1.7.7/libtoo2013-01-21 11:54:22
452910Core systemsystemdUNCONFIRMEDsys-apps/systemd-196[python] needs dev-python/pygobject:3 - ImportError: No module named gi.reposito2013-01-20 17:07:04
452916Servermaintainer-wantedUNCONFIRMEDnet-misc/stargazer - Stargazer billing system for small home and office networks.2013-02-03 16:39:33
453038Ebuildsbase-systemUNCONFIRMEDsys-fs/reiser4progs-1.0.7 ? w/ patches from reiserfs-devel mailing list2013-02-08 17:27:09
453080All ISOreleaseUNCONFIRMEDSIL 3124 SATA controller driver missing from Alpha install CD2013-01-20 01:23:16
453098Core systembase-systemUNCONFIRMEDsys-devel/patch-2.7.1-r1: fails tests crlf-handling and need-filename2013-01-21 11:54:50
453122ApplicationsperlUNCONFIRMEDPlease stabilize =app-text/po4a-0.42 (was: 0.38 misparses CDATA section)2013-02-19 20:59:42
453208ApplicationswiredUNCONFIRMEDwww-client/uzbl-9999 - src/uzbl-core.h:16:25: fatal error: glib/gstdio.h: No such file or directory2013-01-21 19:18:42
453262EbuildsrubyUNCONFIRMEDdev-ruby/pdf-reader-1.3.0 version bump request2013-01-21 12:10:53
453264All ISOreleaseUNCONFIRMEDFirewire hard drive support missing from Alpha install CD2013-01-21 01:54:43
453270LibraryalexxyUNCONFIRMEDdev-python/configshell: snapshot request2013-01-21 12:27:59
453272LibraryalexxyUNCONFIRMEDdev-python/rtslib snapshot request2013-01-21 12:28:47
453274Core systemclusterUNCONFIRMEDsys-block/lio-utils snapshot request2013-01-21 12:29:12
453276Core systemalexxyUNCONFIRMEDsys-block/targetcli snapshot request2013-01-21 12:29:39
453278Core systemsystemdUNCONFIRMEDsys-apps/systemd - please port netcfg from Arch Linux for easier network configuration2013-01-21 20:21:49
453280GamesgamesUNCONFIRMEDgames-strategy/atom-zombie-smasher - new ebuild2013-01-21 17:58:47
453392GNOMEgnomeUNCONFIRMEDgnome-base/gdm-3.6 USE=plymouth prevents the automatic switch to vt7 on startup2013-02-12 09:11:09
453514Core systemtoolchainUNCONFIRMEDsys-libs/glibc-2.15-r3: nscd initscript fails while daemon starts2013-01-22 22:51:57
453540ApplicationsevermindUNCONFIRMED[pro-audio overlay] media-sound/jack-audio-connection-kit-1.9.9.5: TypeError: 'list' object is not c2013-02-09 17:14:49
453566ApplicationshwoarangUNCONFIRMEDmedia-sound/lastfmplayer 2.1.30 version bump2013-02-11 11:46:14
453614Core systemrobbat2UNCONFIRMEDsys-apps/linux-misc-apps-3.6-r1 installs two copies of cpupower2013-01-27 11:41:47
453644Core systemjsbronderUNCONFIRMEDsys-cluster/torque-2.5.12 - qstat-qstat.o: In function `tcl_run': qstat.c:(.text+0x1ac5): undefined 2013-02-06 16:34:18
453772OpenRCopenrcUNCONFIRMEDsystemwide use of taskset for pinning daemons to cpus on multicore systems2013-02-02 14:39:49
453780Applicationskondor6cUNCONFIRMEDwww-client/elinks-0.12_pre5-r2 USE=javascript with spidermonkey-1.8.5-r1 - elinks freezes on startup2013-02-01 11:12:46
453800Eclasses and ProfilespythonUNCONFIRMEDpython.eclass: dev-python/cython fails to install in environment that contains coreutils on Gentoo/F2013-01-29 23:58:29
453802Keywording and StabilizationwineUNCONFIRMEDapp-emulation/winetricks stable request2013-01-24 15:05:15
453832CoretoolchainUNCONFIRMEDsys-devel/gcc-4.6.3: hangs in pkg_postinst2013-01-31 20:11:38
453840Libraryphp-bugsUNCONFIRMEDdev-php/pecl-ssh2-0.12 version bump request2013-01-28 13:43:19
453880Applicationsnet-fsUNCONFIRMEDnet-fs/autofs-5.0.6-r5: fails to stop and to start:2013-02-16 13:22:48
453900ApplicationssoundUNCONFIRMEDmedia-sound/abcde should depend on virtual/perl-Digest-SHA2013-01-26 01:40:48
453918ApplicationsxmwUNCONFIRMED=app-admin/conkyforecast-2.24 with conky-1.9.0-r1 - `conkyForecastWU --datatype=WI` - conkyForecastW2013-02-10 16:49:05
453966ApplicationsmatsuuUNCONFIRMEDwww-apps/redmine-2.2.0 should depend on dev-ruby/fastercsv2013-01-30 10:10:19
454084ApplicationsgurligebisUNCONFIRMEDnet-wireless/hostapd USE=-debug prints no messages2013-01-26 15:49:39
454118ApplicationsjlecUNCONFIRMED[science overlay] sci-chemistry/mgltools-pmv-1.5.6_rc2 - runPmv: TclError: cannot use geometry manag2013-01-30 09:02:43
454120OpenRCopenrcUNCONFIRMEDsys-apps/openrc-0.11.8: Service XY stop makes other services stop, but consequent start of XY leaves2013-01-26 09:43:51
454196Core systembase-systemUNCONFIRMEDsys-apps/groff-1.22.1 installs broken symbolic link - /usr/share/doc/groff-1.22.1/pdf/mom-pdf.pdf: b2013-01-26 18:20:42
454200Core systemtoolchainUNCONFIRMEDsys-libs/glibc-2.17 breaks almost all binaries - error while loading shared libraries: libgcc_s.so.12013-02-09 05:39:00
454208LibraryyngwinUNCONFIRMEDx11-libs/cairo-1.12.10 - breaks claws-mail (still applies for -r1,-r2)2013-02-07 00:31:58
454260ApplicationsgraphicsUNCONFIRMEDmedia-gfx/nvidia-cg-toolkit-2.1.0017-r1 - should install a symlink on path /opt/nvidia-cg-toolkit 2013-01-28 13:14:58
454266Keywording and Stabilizationrobbat2UNCONFIRMEDsys-apps/linux-misc-apps-3.6-r1 stabilization request2013-01-28 12:11:50
454298Ebuildssci-mathematicsUNCONFIRMEDsci-mathematics/maxima - maxima cannot be started from wxmaxima or cantor2013-02-04 03:36:37
454322UnspecifiedsoundUNCONFIRMEDmedia-sound/lame-3.99.5 - console.o: In function `get_termcap_{string,number},apply_termcap_settings2013-01-28 18:33:17
454346Ebuildsmaintainer-wantedUNCONFIRMEDEbuild request: app-misc/elasticsearch - Open Source, Distributed, RESTful, Search Engine2013-01-28 18:47:24
454362Core systemkernel-miscUNCONFIRMEDsys-fs/jfsutils-1.1.15 - Fails to build with +static if sys-apps/util-linux is built without +static2013-01-28 02:04:19
454384BugzillabugzillaUNCONFIRMEDExtend "My Bugs" list with RESOLVED NEEDINFO and RESOLVED TEST-REQUEST states2013-01-28 15:27:34
454404Core systembase-systemUNCONFIRMEDsys-fs/static-dev: should also check for devtmpfs mounted at /dev2013-01-29 18:37:25
454462Core systemsystemdUNCONFIRMEDsys-apps/dbus-1.6.8-r1[systemd] <--> sys-apps/systemd circular dependency2013-02-03 10:59:34
454474GNOMEgnomeUNCONFIRMEDnet-im/empathy-3.6.3: history uses wrong encoding to show utf8 logs2013-01-28 22:49:52
454478SELinuxselinuxUNCONFIRMEDsys-apps/busybox-1.20.2 fails to merge on selinux profile with USE="static"2013-02-17 09:37:40
454492Toolstools-portageUNCONFIRMEDapp-portage/gentoolkit-0.3.0.7 - eclean-dist: UnboundLocalError: local variable 'cleaner' referenced2013-01-29 17:40:16
454508FreeBSDbsdUNCONFIRMEDfreebsd-rescue-9.1: Fail to link in environment that dev-util/pkgconfig-0.28 is installed.2013-01-29 11:31:19
454568Librarymedia-videoUNCONFIRMEDmedia-libs/mlt-0.8.8 - luma.c:92:11: erreur interne du compilateur: dans build2_stat, à tree.c:38032013-02-01 10:14:17
454604Third-Party ToolsdolsenUNCONFIRMEDapp-portage/layman feature requests2013-01-30 02:01:26
454648LibrarypatrickUNCONFIRMEDdev-libs/leveldb should install memenv library2013-02-03 17:27:05
454652StagesreleaseUNCONFIRMEDcurrent stage3-amd64-nomultilib has an immediate block between sys-apps/module-init-tools and sys-ap2013-01-30 14:46:25
454724Ebuildsmaintainer-wantedUNCONFIRMEDnet-analyzer/tallow - Block hosts that attempt to bruteforce SSH using the journald API2013-01-30 19:39:56
454744Ebuildsmaintainer-wantedUNCONFIRMEDnet-dns/validns should depend on new package dev-perl/Test-Command-Simple for src_test()2013-01-31 16:22:52
454802DevelopmentflameeyesUNCONFIRMEDdev-utils/google-perftools-2.0-r1 ARMv6 does not imply 'dmb' instruction availability but it is used2013-02-02 00:14:37
454808LibrarygnomeUNCONFIRMEDnet-libs/webkit-gtk-1.10.2-r300 - File "./Tools/Scripts/run-gtk-tests", line 168: Could not start ac2013-02-08 00:08:40
454816Librarymaintainer-neededUNCONFIRMEDwww-apache/mod_auth_kerb-5.4-r1: doesn't build against heimdal kerberos2013-01-31 19:51:21
454874Developmentlang-miscUNCONFIRMEDdev-lang/tcc-0.9.26_pre1 - access violation in install tcc-doc.info /usr/share/info2013-02-04 05:50:10
454902ApplicationssystemdUNCONFIRMEDnet-misc/ntp: please add systemd service file2013-02-03 14:05:39
454914OpenRCopenrcUNCONFIRMEDsys-apps/openrc: Feature Request: Open logfile before chuid option2013-01-31 23:56:37
454934GameshasufellUNCONFIRMEDgames-rpg/grimrock-20121222 segfault loading dungeon editor with USE=system-libs2013-02-05 01:39:36
454956GNOMEgnomeUNCONFIRMEDgnome-base/orbit-2.14.19-r1 with sys-devel/automake-1.13.1 - test/everything/Makefile.am:81: error: 2013-02-01 06:41:21
455076LibraryxmwUNCONFIRMEDmedia-gfx/zbar - In file included from from /usr/include/stdio.h:937:0, from zbar/debug.h:60, zbar/s2013-02-10 16:49:05
455082OpenRCopenrcUNCONFIRMEDsys-apps/openrc-0.11.8: Sometimes iwconfig.sh appends "enc open" to the key_SSID string2013-02-02 02:14:03
455090New Servermirror-adminUNCONFIRMEDdistfiles source mirror2013-02-02 06:40:17
455098ApplicationsxmwUNCONFIRMEDx11-wm/xpra-0.8.0 tries to remove non-existing files and fails2013-02-05 08:03:17
455104DevelopmentpythonUNCONFIRMEDdev-python/nose-1.2.1_p2012 fails tests (fails to parse coverage output)2013-02-06 10:00:25
455132DevmanualqaUNCONFIRMEDWrong hyperlink, must be absolute2013-02-04 05:08:57
455134Applicationsgnome-officeUNCONFIRMEDapp=office/gnucash with dev-db/libdbi - "The library "libdbi" installed on your system doesn't corre2013-02-12 19:39:30
455218KDEkdeUNCONFIRMEDx11-themes/oxygen-gtk-1.3.2.1:2 x11-themes/oxygen-gtk-1.1.2:3 version bump request2013-02-15 12:45:02
455276DevelopmentvapierUNCONFIRMEDdev-cpp/gmock-1.6.9 with python3 fails to execute test suite2013-02-05 11:28:28
455282LibrarytitanofoldUNCONFIRMEDdev-libs/libpqxx-4.0.1 with python 3.x - TypeError: 'str' does not support the buffer interface2013-02-19 08:19:43
455286UnspecifiedkdeUNCONFIRMED=media-libs/gstreamer-0.10.36 upgrade causes kde-base/dragon-4.9.5 to crash when playing movies2013-02-04 17:58:38
455288KDEkdeUNCONFIRMEDkde-base/kdm: please provide a systemd service file2013-02-15 17:35:02
455338KDEkdeUNCONFIRMEDmedia-libs/phonon-gstreamer-4.6.3 version bump2013-02-05 11:25:08
455372Keywording and StabilizationgnomeUNCONFIRMEDapp-text/rarian-0.8.1-r2 stable request2013-02-04 12:47:50
455418ServerclusterUNCONFIRMEDsys-cluster/libdlm-3.1.5 - In file included from .../work/cluster-3.1.5/dlm/libdlm/libdlm.c:21:0: /2013-02-05 12:39:44
455430Librarysci-geosciencesUNCONFIRMEDsci-libs/shapelib-1.3.0-r1 - Please make a rev-bump after changing ebuild to install headers.2013-02-07 12:28:41
455456LibrarykdeUNCONFIRMEDmedia-libs/phonon-gstreamer fails with gentoo-multilib - /usr/lib64/libphonon.so.4.6.0: could not re2013-02-05 06:18:13
455458OpenRCopenrcUNCONFIRMEDsys-apps/openrc - netmount fuser timeout - stopping the netmount script on shutdown. cifs shares won2013-02-06 12:18:47
455478ApplicationslxdeUNCONFIRMEDlxde-base/lxdm-0.4.1-r5 - How can I stop it from creating "/.dbus"?2013-02-04 19:38:47
455480ApplicationsvimUNCONFIRMEDapp-editors/vim-7.3.762 - Symlinks to gz manpages are dangling because my system uses bzip2 manpages2013-02-04 19:35:50
455512Prefix SupportprefixUNCONFIRMEDsys-libs.readline has an incorrect install_name which trigger install failure because of QA2013-02-05 01:02:35
455516Core systemclusterUNCONFIRMEDsys-fs/gfs2-utils with sys-kernel/hardened-sources-3.7.3 - In file included from conftest.c:84: /usr2013-02-08 16:35:19
455538GamesgamesUNCONFIRMEDgames-strategy/x2 broken link in description2013-02-20 23:59:09
455546Prefix SupportprefixUNCONFIRMEDsys-libs/zlib as a wrong install_name in the optional minizip library2013-02-05 02:58:40
455548Keywording and StabilizationenlightenmentUNCONFIRMEDx11-wm/enlightenment:0.17 stable request2013-02-08 05:26:27
455576DevelopmenthaskellUNCONFIRMEDdev-haskell/vty with sys-libs/ncurses[tinfo] - /usr/lib64/terminfo-0.3.2.5/ghc-7.6.2/libHSterminfo-02013-02-14 14:13:53
455582ServerclusterUNCONFIRMEDsys-cluster/ceph should be started before netmount2013-02-05 12:25:27
455584ServerclusterUNCONFIRMEDsys-cluster/ceph-0.56.3 version bump2013-02-19 16:46:44
455632ApplicationsjdhoreUNCONFIRMEDsys-apps/lm_sensors: should support systemd2013-02-05 19:45:47
455634KDEkdeUNCONFIRMEDkde-base/systemsettings kde-base/powerdevil and other kde apps have automagical media-sound/pulseaud2013-02-06 07:13:02
455690Servernet-dialupUNCONFIRMEDnet-dialup/freeradius-2.2.0 pkg_postinstall() hint not working2013-02-07 16:30:11
455704Gamesmaintainer-wantedUNCONFIRMEDgames-util/desura - a digital distribution service for gamers2013-02-13 10:54:12
455706Gamesmaintainer-wantedUNCONFIRMEDgames-util/desurium - a digital distribution service for gamers, open source2013-02-13 10:53:54
455806EbuildssysadminUNCONFIRMEDnet-analyzer/{nagios,nagios-core}-3.4.4 - version bump request2013-02-06 12:51:08
455874Installation Handbookdocs-teamUNCONFIRMEDminor typo in code listing 2.1 (ru translation)2013-02-06 16:33:17
455890Core systemlivecdUNCONFIRMEDsys-block/parted - parted binary should be installed in /usr/bin2013-02-07 02:12:12
455926Prefix SupportprefixUNCONFIRMEDperl-5.16.2 will install empty if prefix lives in /usr/local2013-02-06 22:57:05
455938GNOMEgnomeUNCONFIRMED=gnome-base/gdm-3.6* - Fails to start when access to /proc is restricted.2013-02-07 02:11:03
455988Core systembase-systemUNCONFIRMEDiproute2-3.3.0 USE=doc installs (useless) files into /usr/share/doc2013-02-07 14:15:33
456020Other documentsdocs-teamUNCONFIRMEDdon't suggest CORRECT_ALL option in zsh guide2013-02-07 14:25:52
456024ApplicationsnikoliUNCONFIRMEDmedia-sound/clementine 1.1.1 crashes with 0 size .mood file when moodbar is enabled in the playlist2013-02-07 14:14:11
456048ServerultrabugUNCONFIRMEDwww-servers/uwsgi-1.4.5 init script race condition if starting multiple uwsgi instances with differe2013-02-07 16:47:54
456094Ebuildsdev-zeroUNCONFIRMEDnet-misc/aria2-1.16.3 - version bump request2013-02-07 20:55:51
456110Applicationsmedia-videoUNCONFIRMED[multimedia overlay] mpv-9999 --disable-tv-bsdbt848 and --disable-radio-bsdbt848 does not exist anym2013-02-09 15:41:09
456118Core systemkernelUNCONFIRMEDsys-kernel/gentoo-sources-3.7.4 - memory exhaustion in AS firmware//lib/firmware/.gen.o2013-02-12 03:36:33
456136Libraryidl0rUNCONFIRMEDnet-dns/bind-tools with dev-libs/openssl-1.0.1c - nslookup: error: [...] /usr/lib64/engines/libgost.2013-02-11 12:12:54
456230KDEkdeUNCONFIRMEDapp-cdr/k3b-2.0.2-r4: complains about "process can't started. Calling of In/Output module not possib2013-02-10 15:13:30
456264LibraryfontsUNCONFIRMEDmedia-fonts/droid-113-r2 with multiple values in 2013-02-15 20:47:53
456308Core systembase-systemUNCONFIRMEDgrub2 won't launch memtest86 and memtest86+ if / and /boot are separated partitions and grub2 graphi2013-02-13 22:19:39
456328ApplicationschithanhUNCONFIRMEDwww-plugins/gnash-08.10-r2 with dev-libs/boost-1.52.0-r5 - ld: sdl_gnash-gnash.o: undefined referenc2013-02-12 14:38:36
456386DevelopmenthaskellUNCONFIRMEDdev-lang/ghc-7.6.2 - Segmentation fault [libraries/haskell98/dist-install/build/Prelude.o] & others 2013-02-14 10:41:34
456694LibraryhaubiUNCONFIRMEDdev-db/oracle-instantclient-sqlplus-11.2.0.3: sqlpus binary needs paxctl -c on hardened ~amd642013-02-19 20:33:27
456736Keywording and StabilizationenlightenmentUNCONFIRMED=x11-wm/enlightenment-0.17.1 keyword request2013-02-15 15:59:36
456748Keywording and StabilizationgnomeUNCONFIRMED=www-client/epiphany-extensions-3.6.0 keyword request2013-02-11 11:36:03
456752Keywording and StabilizationhollowUNCONFIRMED=www-servers/nginx-1.2.6-r1 keyword request2013-02-11 11:36:03
456764Keywording and StabilizationrentorbuyUNCONFIRMED=net-firewall/shorewall{,-core}-4.5.11.2 stabilisation request2013-02-11 17:03:57
456780LibrarygraphicsUNCONFIRMEDmedia-libs/icclib-2.14: iccdump segfaults on startup2013-02-12 15:13:03
456784ApplicationslxnayUNCONFIRMED[sabayon overlay] net-wireless/blueman-1.23-r2: Failed Patch: blueman-1.21-fix-segfault-startup.patc2013-02-12 15:10:18
456792LibrarycppUNCONFIRMEDdev-libs/boost-1.52.0-r5 fails to compile with custom /etc/site-config.jam: could not find main targ2013-02-12 22:13:10
456796Keywording and Stabilizationnet-imUNCONFIRMEDnet-im/pyicq-t: sparc keyword request2013-02-11 17:00:43
456904ApplicationsmozillaUNCONFIRMED[mozilla overlay] dev-lang/spidermonkey-1.8.8 - ./dist/include/js/HashTable.h:898:9: error: size of 2013-02-12 16:50:39
456922UnspecifiedhardenedUNCONFIRMEDUnable to start any java-vm on hardened gentoo icedtea-bin-6.1.11.5: Could not reserve enough space 2013-02-13 15:13:44
456928Applicationsphp-bugsUNCONFIRMEDdev-lang/php-5.4.8[imap] - ./conftest: symbol lookup error: /usr/lib64/libc-client.so.1: undefined s2013-02-13 19:05:07
456934Other documentsoverlaysUNCONFIRMEDSince the 2012-09-09-make.conf-and-make.profile-move the overlay instructions are out of date2013-02-13 10:03:36
456984ServerjsbronderUNCONFIRMEDsys-cluster/mpich2-1.5 should not DEPEND on sys-apps/hwloc2013-02-14 15:14:18
457026Core systembase-systemUNCONFIRMEDnet-misc/openssh: no host keys generated on systemd based system2013-02-20 18:21:40
457032Keywording and StabilizationtexUNCONFIRMEDStabilize app-text/djview-4.92013-02-16 13:35:05
457080EbuildsgraphicsUNCONFIRMEDmedia-gfx/cellwriter-1.3.5 - version bump request and please move it to app-accessibility/2013-02-13 18:34:41
457096Ebuildsmaintainer-wantedUNCONFIRMEDapp-admin/isohost-tools-0.1 - isoho.st remote management tools2013-02-15 15:04:21
457104KernelsecurityUNCONFIRMEDDriver of cypress corrupts file-system and partition table of external hard drives with M6116 SATA B2013-02-14 15:53:16
457126Libraryamd64UNCONFIRMEDapp-emulation/emul-linux-x86-qtlibs-20121202 should install libQtSvg2013-02-14 07:14:29
457430KDEkdeUNCONFIRMEDkde-base/kde...-4.10.0: KDE (un-)lock dialog stays on screen after unlocking2013-02-17 22:42:33
457498KDEkdeUNCONFIRMEDkrunner ("Run Command") window stays "stuck"2013-02-14 08:09:40
457504EbuildstomjbeUNCONFIRMEDapp-backup/bacula-5.2.12: add support for installing examples into docdir2013-02-14 15:48:10
457520ServerjavaUNCONFIRMEDinit script for www-servers/tomcat-7.0.32 drops STDOUT and STDERR2013-02-14 15:45:51
457528Applicationsx11UNCONFIRMED[x11 overlay] x11-libs/xpyb-9999 with python3 - checking for python include dir... File ""2013-02-15 15:34:34
457534ServerjsbronderUNCONFIRMEDsys-cluster/torque-2.4.16: mv: cannot stat `libtool': No such file or directory2013-02-14 14:39:41
457566LibrarynikoliUNCONFIRMEDmedia-libs/libechonest-2.0.3 version bump2013-02-15 15:35:23
457594ApplicationscardoeUNCONFIRMEDx11-drivers/nvidia-drivers: some elog messages could be shown only first time using readme.gentoo.ec2013-02-15 07:29:28
457600ApplicationsprometheanfireUNCONFIRMEDsys-cluster/swift-1.7.6 has runtime dependency for xattr>=0.4, but I have pyxattr 0.5.02013-02-15 18:34:52
457624GNOMEgnomeUNCONFIRMEDgnome-extra/gnome-system-monitor-3.6.1 has incorrect dependency on dev-cpp/glibmm2013-02-14 21:52:35
457628ApplicationsprometheanfireUNCONFIRMEDsys-cluster/swift-1.7.6 has typo in "newinitd"2013-02-15 18:36:35
457632ApplicationsgrobianUNCONFIRMEDmail-client/mutt: Occasional segfault in set_buffystats at sidebar.c:3432013-02-15 15:46:57
457652Applicationsmedia-videoUNCONFIRMEDmedia-video/mplayer-1.1 - fix building against >=media-libs/giflib-52013-02-18 15:14:07
457670Otherdocs-teamUNCONFIRMED[fa] handbook/hb-net-start.xml2013-02-15 08:34:05
457694ApplicationsultrabugUNCONFIRMED>=dev-db/mongodb-2.0.7 does not build and install libmongoclient.so anymore2013-02-15 17:20:16
457708Core systemhardened-kernelUNCONFIRMEDapp-emulation/virtualbox-4.{1.22,2.6}-r1 on sys-kernel/hardened-sources - Can't start virtual machin2013-02-16 21:53:53
457742EbuildskdeUNCONFIRMEDmedia-libs/phonon-vlc-0.6.2 version bump request2013-02-15 19:14:23
457748Other documentsdocs-teamUNCONFIRMEDdistcc guide has an invalid distcc-config option2013-02-15 19:40:51
457768Core systembase-systemUNCONFIRMEDeselect-sh should be pulled in by @system or virtual/shell or app-shells/* or (...)2013-02-18 05:52:51
457780Keywording and StabilizationhaskellUNCONFIRMEDstabilization request dev-lang/ghc-7.4.22013-02-16 21:14:28
457782BugzillabugzillaUNCONFIRMEDbugs.gentoo.org (mostly) inaccessible to bots2013-02-16 03:09:26
457784BugzillabugzillaUNCONFIRMED/data/cached/buglist-*.html missing last-modified timestamps2013-02-16 03:03:10
457904GamesgamesUNCONFIRMEDgames-strategy/freecraft: broken link in description of package2013-02-19 03:24:45
457924Keywording and StabilizationramerethUNCONFIRMED=dev-vcs/gitolite-3.3 stable request2013-02-17 16:56:42
457930LibraryjkarlsonUNCONFIRMEDx11-drivers/ati-drivers-12.11_beta11 system lock on exiting X2013-02-17 17:04:26
457958Keywording and Stabilizationpgsql-bugsUNCONFIRMEDdev-db/postgis-2.0.1 stable request2013-02-17 17:00:06
457960Keywording and StabilizationjavaUNCONFIRMEDdev-java/jdbc-postgresql-9.1_p902 stable request2013-02-17 17:38:38
457994LiveCD/DVDtenUNCONFIRMEDlivedvd-amd64-multilib-20121221.iso: kernel panic when booting in kvm with "-cpu host"2013-02-18 02:55:55
458018ServerswegenerUNCONFIRMEDnet-dns/pdns need more strict permissions for pdns.conf (security threat)2013-02-17 18:26:06
458028Core systemkernelUNCONFIRMEDKernel:3.7.8 BUG: unable to handle kernel paging request in radeon_mmap()2013-02-21 02:43:20
458034ApplicationsjsbronderUNCONFIRMEDnet-nntp/sabnzbd-0.7.11 initscript always reports crashed status2013-02-19 20:05:09
458042Prefix SupportprefixUNCONFIRMEDfix_libtool_files.sh --justfixit doesn't look for fixlafiles.awk in EPREFIX2013-02-18 00:28:40
458066ApplicationsangelosUNCONFIRMEDmedia-sound/xnoise-9999 (and possibly other versions) should depend on certain gst-plugins-*-package2013-02-19 20:18:26
458068GNOMEgnomeUNCONFIRMEDx11-themes/gnome-themes-standard: narrow scrollbars might violate accessibility regulation2013-02-19 06:38:31
458074OpenRCopenrcUNCONFIRMEDsys-apps/openrc-0.11.8 doesn't parse correctly options contained two words abreast self2013-02-18 13:35:38
458104PrintingprintingUNCONFIRMEDapp-text/acroread-9.5.1-r1 - acroread creates $HOME/fontconfig directory on startup2013-02-18 13:45:46
458148Unclassifieddev-portageUNCONFIRMEDdev-libs/cyrus-sasl-2.1.25-r4: gzip: stdout: Broken pipe - phase-helpers.sh, line 312: Called __as2013-02-20 22:52:41
458160Applicationsidella4UNCONFIRMEDapp-emulation/xen-4.2.0-r1 - x86_64-pc-linux-gnu-ld: unrecognized option '--subsystem=10'2013-02-21 12:48:18
458170EbuildsqtUNCONFIRMEDnet-news/quiterss-0.12.1 - version bump request2013-02-18 22:02:11
458184Keywording and StabilizationyngwinUNCONFIRMEDapp-arch/lrzip-0.614 stable request2013-02-19 16:17:49
458190Keywording and Stabilizationmaintainer-neededUNCONFIRMEDsys-apps/i2c-tools stable request2013-02-19 10:48:36
458196Keywording and Stabilizationkernel-miscUNCONFIRMEDsys-fs/ecryptfs-utils-101 ppc64 keyword request2013-02-20 02:09:24
458262baselayoutrobbat2UNCONFIRMEDsys-fs/lvm2 Failed to find sysfs mount point when starting2013-02-20 16:20:15
458270KDEkdeUNCONFIRMEDmedia-libs/qt-gstreamer-0.10.2: QtGLib requires >=sys-devel/gcc-4.5 as RDEPEND (libstdc++.so.6)2013-02-19 11:59:44
458280GNOMEgnomeUNCONFIRMEDdev-python/pygtk-2.24.0-r3 installing postrm warning: Unable to establish symlink2013-02-21 03:06:11
458282Servermarko.durkovicUNCONFIRMEDnet-im/jabberd2-2.2.14 - dodoc: tools/migrate.pl does not exist2013-02-20 16:17:20
458288Applicationsrobbat2UNCONFIRMEDsys-apps/hwinfo stack smashing detected2013-02-19 20:31:17
458338DevelopmentcppUNCONFIRMEDdev-libs/boost-1.49.0-r2 with sys-libs/uclibc - In file included from libs/locale/src/posix/codecvt.2013-02-21 02:53:30
458346Ebuildsmaintainer-wantedUNCONFIRMEDdev-db/libodb-boost - ODB boost support library (dependency of dev-db/odb)2013-02-19 22:10:48
458348Ebuildsmaintainer-wantedUNCONFIRMEDdev-db/libodb-pgsql - acess a PostgreSQL database using ODB (dependency of dev-db/odb)2013-02-19 22:09:23
458360Keywording and StabilizationsystemdUNCONFIRMED=sys-apps/systemd-197-r1 ppc64 keyword request2013-02-20 14:36:41
458404LibrarycppUNCONFIRMEDdev-libs/boost-1.52.0-r5 - error: Duplicate name of actual target: libboost_system.so.1.2013-02-21 02:56:16
458440ApplicationspatrickUNCONFIRMEDapp-office/openerp-6.1.1-r1 USE=-postgres - sed: can't read /var/tmp/portage/app-office/openerp-6.1.2013-02-20 15:16:18
458464Core - Interface (emerge)dev-portageUNCONFIRMEDsys-apps/portage-2.1.11.50: no way to JUST DAMN INSTALL a package2013-02-21 04:04:32
458480Core systemvserver-devsUNCONFIRMEDsys-cluster/util-vserver with sys-apps/openrc - conflict in cgroups management2013-02-20 16:30:03
458494Keywording and StabilizationdotnetUNCONFIRMEDmedia-sound/banshee-2.6.0 stabilization request2013-02-20 21:52:39
458496Core systembase-systemUNCONFIRMEDsys-apps/util-linux-2.22.2 install fails with: unable to read SONAME from libmount.so2013-02-20 20:32:45
458518Core systembase-systemUNCONFIRMED=net-misc/iputils-20121221-r1 needs sys-libs/libcap in pkg_postinst()2013-02-21 10:14:40
458530GamesgamesUNCONFIRMEDsuggest new package: games-rpg/deliantra2013-02-21 03:19:42
458574Keywording and StabilizationvoyageurUNCONFIRMEDPlease stabilize net-ftp/filezilla-3.6.0.22013-02-21 12:14:55


back



Support us on Content Nation

New Packages

- as rdf newsfeed
- as rss newsfeed
- as Atom newsfeed
2023-09-25
fceux - 2.6.6
Ebuild name:

games-emulation/fceux-2.6.6

Description

Portable Famicom/NES emulator, an evolution of the original FCE Ultra

Added to portage

2023-09-25

libnvme - 1.5-r2
Ebuild name:

sys-libs/libnvme-1.5-r2

Description

C Library for NVM Express on Linux

Added to portage

2023-09-25

numad - 0.5_p20180531-r2
Ebuild name:

sys-process/numad-0.5_p20180531-r2

Description

The NUMA daemon that manages application locality

Added to portage

2023-09-25

2023-09-24
Business-ISBN-Data - 20230923.1.0
Ebuild name:

dev-perl/Business-ISBN-Data-20230923.1.0

Description

Data pack for Business

Added to portage

2023-09-24

PPI - 1.277.0
Ebuild name:

dev-perl/PPI-1.277.0

Description

Parse, Analyze, and Manipulate Perl (without perl)

Added to portage

2023-09-24

Tk - 804.36.0-r2
Ebuild name:

dev-perl/Tk-804.36.0-r2

Description

A Perl Module for Tk

Added to portage

2023-09-24

apache-rat - 0.13
Ebuild name:

dev-java/apache-rat-0.13

Description

Release audit tool, focused on licenses

Added to portage

2023-09-24

argh - 0.29.4
Ebuild name:

dev-python/argh-0.29.4

Description

A simple argparse wrapper

Added to portage

2023-09-24

astroid - 2.15.7
Ebuild name:

dev-python/astroid-2.15.7

Description

Abstract Syntax Tree for logilab packages

Added to portage

2023-09-24

astyle - 3.4.8
Ebuild name:

dev-util/astyle-3.4.8

Description

Artistic Style is a re-indenter and reformatter for C++, C and Java source co

Added to portage

2023-09-24

cryptominisat - 5.11.14
Ebuild name:

sci-mathematics/cryptominisat-5.11.14

Description

Advanced SAT solver with C++ and command-line interfaces

Added to portage

2023-09-24

devilutionx - 1.5.1
Ebuild name:

games-engines/devilutionx-1.5.1

Description

Diablo engine for modern operating systems

Added to portage

2023-09-24

dist-kernel - 5.10.197
Ebuild name:

virtual/dist-kernel-5.10.197

Description

Virtual to depend on any Distribution Kernel

Added to portage

2023-09-24

dist-kernel - 5.15.133
Ebuild name:

virtual/dist-kernel-5.15.133

Description

Virtual to depend on any Distribution Kernel

Added to portage

2023-09-24

dist-kernel - 5.4.257
Ebuild name:

virtual/dist-kernel-5.4.257

Description

Virtual to depend on any Distribution Kernel

Added to portage

2023-09-24

dist-kernel - 6.1.55
Ebuild name:

virtual/dist-kernel-6.1.55

Description

Virtual to depend on any Distribution Kernel

Added to portage

2023-09-24

dist-kernel - 6.5.5
Ebuild name:

virtual/dist-kernel-6.5.5

Description

Virtual to depend on any Distribution Kernel

Added to portage

2023-09-24

dkms - 3.0.12
Ebuild name:

sys-kernel/dkms-3.0.12

Description

Dynamic Kernel Module Support

Added to portage

2023-09-24

dotnet-runtime-nugets - 8.0.0_rc1234194
Ebuild name:

dev-dotnet/dotnet-runtime-nugets-8.0.0_rc1234194

Description

.NET runtime nugets

Added to portage

2023-09-24

dotnet-sdk - 8.0.0_rc1234194
Ebuild name:

dev-dotnet/dotnet-sdk-8.0.0_rc1234194

Description

.NET is a free, cross-platform, open-source developer platfor

Added to portage

2023-09-24

ffaker - 2.23.0
Ebuild name:

dev-ruby/ffaker-2.23.0

Description

Faster Faker, generates dummy data

Added to portage

2023-09-24

ffi - 1.16.0
Ebuild name:

dev-ruby/ffi-1.16.0

Description

Ruby extension for programmatically loading dynamic libraries

Added to portage

2023-09-24

gcc - 13.2.1_p20230923
Ebuild name:

sys-devel/gcc-13.2.1_p20230923

Description

The GNU Compiler Collection

Added to portage

2023-09-24

gentoo-kernel - 5.10.197
Ebuild name:

sys-kernel/gentoo-kernel-5.10.197

Description

Linux kernel built with Gentoo patches

Added to portage

2023-09-24

gentoo-kernel - 5.15.133
Ebuild name:

sys-kernel/gentoo-kernel-5.15.133

Description

Linux kernel built with Gentoo patches

Added to portage

2023-09-24

gentoo-kernel - 5.4.257
Ebuild name:

sys-kernel/gentoo-kernel-5.4.257

Description

Linux kernel built with Gentoo patches

Added to portage

2023-09-24

gentoo-kernel - 6.1.55
Ebuild name:

sys-kernel/gentoo-kernel-6.1.55

Description

Linux kernel built with Gentoo patches

Added to portage

2023-09-24

gentoo-kernel - 6.5.5
Ebuild name:

sys-kernel/gentoo-kernel-6.5.5

Description

Linux kernel built with Gentoo patches

Added to portage

2023-09-24

gentoo-kernel-bin - 5.10.197
Ebuild name:

sys-kernel/gentoo-kernel-bin-5.10.197

Description

Pre-built Linux kernel with Gentoo patches

Added to portage

2023-09-24

gentoo-kernel-bin - 5.15.133
Ebuild name:

sys-kernel/gentoo-kernel-bin-5.15.133

Description

Pre-built Linux kernel with Gentoo patches

Added to portage

2023-09-24

gentoo-kernel-bin - 5.4.257
Ebuild name:

sys-kernel/gentoo-kernel-bin-5.4.257

Description

Pre-built Linux kernel with Gentoo patches

Added to portage

2023-09-24

gentoo-kernel-bin - 6.1.55
Ebuild name:

sys-kernel/gentoo-kernel-bin-6.1.55

Description

Pre-built Linux kernel with Gentoo patches

Added to portage

2023-09-24

gentoo-kernel-bin - 6.5.5
Ebuild name:

sys-kernel/gentoo-kernel-bin-6.5.5

Description

Pre-built Linux kernel with Gentoo patches

Added to portage

2023-09-24

gnucash - 5.3
Ebuild name:

app-office/gnucash-5.3

Description

A personal finance manager

Added to portage

2023-09-24

graphicsmagick - 1.3.42
Ebuild name:

media-gfx/graphicsmagick-1.3.42

Description

Collection of tools and libraries for many image formats

Added to portage

2023-09-24

hugin - 2022.0.0-r1
Ebuild name:

media-gfx/hugin-2022.0.0-r1

Description

GUI for the creation & processing of panoramic images

Added to portage

2023-09-24

icalendar - 5.0.9
Ebuild name:

dev-python/icalendar-5.0.9

Description

Package used for parsing and generating iCalendar files (RFC 2445)

Added to portage

2023-09-24

imagemagick - 6.9.12.96
Ebuild name:

media-gfx/imagemagick-6.9.12.96

Description

A collection of tools and libraries for many image formats

Added to portage

2023-09-24

imagemagick - 7.1.1.18
Ebuild name:

media-gfx/imagemagick-7.1.1.18

Description

A collection of tools and libraries for many image formats

Added to portage

2023-09-24

ipmitool - 1.8.19-r1
Ebuild name:

sys-apps/ipmitool-1.8.19-r1

Description

Utility for controlling IPMI enabled devices

Added to portage

2023-09-24

libid3tag - 0.16.3
Ebuild name:

media-libs/libid3tag-0.16.3

Description

The MAD id3tag library, Tenacity fork

Added to portage

2023-09-24

linux-sources - 3-r7
Ebuild name:

virtual/linux-sources-3-r7

Description

Virtual for Linux kernel sources

Added to portage

2023-09-24

man-db - 2.12.0
Ebuild name:

sys-apps/man-db-2.12.0

Description

A man replacement that utilizes dbm instead of flat files

Added to portage

2023-09-24

meson - 1.2.1-r2
Ebuild name:

dev-util/meson-1.2.1-r2

Description

Open source build system

Added to portage

2023-09-24

mold - 2.2.0
Ebuild name:

sys-devel/mold-2.2.0

Description

A Modern Linker

Added to portage

2023-09-24

moto - 4.2.4
Ebuild name:

dev-python/moto-4.2.4

Description

Mock library for boto

Added to portage

2023-09-24

neochat - 23.04.3-r1
Ebuild name:

net-im/neochat-23.04.3-r1

Description

Client for Matrix, the decentralized communication protocol

Added to portage

2023-09-24

neochat - 23.08.1-r1
Ebuild name:

net-im/neochat-23.08.1-r1

Description

Client for Matrix, the decentralized communication protocol

Added to portage

2023-09-24

postfix - 3.9_pre20230923
Ebuild name:

mail-mta/postfix-3.9_pre20230923

Description

A fast and secure drop-in replacement for sendmail

Added to portage

2023-09-24

psycopg - 3.1.11
Ebuild name:

dev-python/psycopg-3.1.11

Description

PostgreSQL database adapter for Python

Added to portage

2023-09-24

pytest-xprocess - 0.23.0
Ebuild name:

dev-python/pytest-xprocess-0.23.0

Description

Manage external processes across test runs

Added to portage

2023-09-24

python-lsp-jsonrpc - 1.1.2
Ebuild name:

dev-python/python-lsp-jsonrpc-1.1.2

Description

JSON RPC 2.0 server library

Added to portage

2023-09-24

pyupgrade - 3.13.0
Ebuild name:

dev-python/pyupgrade-3.13.0

Description

Tool + pre-commit hook to automatically upgrade syntax for newer Python

Added to portage

2023-09-24

qemu - 7.2.6
Ebuild name:

app-emulation/qemu-7.2.6

Description

QEMU + Kernel-based Virtual Machine userland tools

Added to portage

2023-09-24

qemu - 8.0.5
Ebuild name:

app-emulation/qemu-8.0.5

Description

QEMU + Kernel-based Virtual Machine userland tools

Added to portage

2023-09-24

qemu - 8.1.1
Ebuild name:

app-emulation/qemu-8.1.1

Description

QEMU + Kernel-based Virtual Machine userland tools

Added to portage

2023-09-24

qore - 1.19.0
Ebuild name:

dev-lang/qore-1.19.0

Description

Qore, the embeddable multithreaded scripting language

Added to portage

2023-09-24

rapidjson - 1.1.0-r4
Ebuild name:

dev-libs/rapidjson-1.1.0-r4

Description

A fast JSON parser/generator for C++ with both SAX/DOM style API

Added to portage

2023-09-24

recurring-ical-events - 2.1.0
Ebuild name:

dev-python/recurring-ical-events-2.1.0

Description

Repeat ICalendar events by RRULE, RDATE and EXDATE

Added to portage

2023-09-24

s4cmd - 2.1.0-r2
Ebuild name:

net-misc/s4cmd-2.1.0-r2

Description

Super S3 command line tool

Added to portage

2023-09-24

scribus - 1.5.8-r6
Ebuild name:

app-office/scribus-1.5.8-r6

Description

Desktop publishing (DTP) and layout program

Added to portage

2023-09-24

sdl2-mixer - 2.6.3-r1
Ebuild name:

media-libs/sdl2-mixer-2.6.3-r1

Description

Simple Direct Media Layer Mixer Library

Added to portage

2023-09-24

spacemacs-theme - 0.3
Ebuild name:

app-emacs/spacemacs-theme-0.3

Description

Emacs color theme that started as a theme for Spacemacs

Added to portage

2023-09-24

system-monitoring-center - 2.22.2
Ebuild name:

sys-apps/system-monitoring-center-2.22.2

Description

Multi-featured system monitor GUI written in Python

Added to portage

2023-09-24

systemd-cron - 2.1.3-r1
Ebuild name:

sys-process/systemd-cron-2.1.3-r1

Description

systemd units to create timers for cron directories and crontab

Added to portage

2023-09-24

tor - 0.4.7.15
Ebuild name:

net-vpn/tor-0.4.7.15

Description

Anonymizing overlay network for TCP

Added to portage

2023-09-24

toybox - 0.8.10
Ebuild name:

sys-apps/toybox-0.8.10

Description

Common linux commands in a multicall binary

Added to portage

2023-09-24

unionfs-fuse - 3.4
Ebuild name:

sys-fs/unionfs-fuse-3.4

Description

Self-syncing tree-merging file system based on FUSE

Added to portage

2023-09-24

vanilla-kernel - 5.10.197
Ebuild name:

sys-kernel/vanilla-kernel-5.10.197

Description

Linux kernel built from vanilla upstream sources

Added to portage

2023-09-24

vanilla-kernel - 5.15.133
Ebuild name:

sys-kernel/vanilla-kernel-5.15.133

Description

Linux kernel built from vanilla upstream sources

Added to portage

2023-09-24

vanilla-kernel - 5.4.257
Ebuild name:

sys-kernel/vanilla-kernel-5.4.257

Description

Linux kernel built from vanilla upstream sources

Added to portage

2023-09-24

vanilla-kernel - 6.1.55
Ebuild name:

sys-kernel/vanilla-kernel-6.1.55

Description

Linux kernel built from vanilla upstream sources

Added to portage

2023-09-24

vanilla-kernel - 6.5.5
Ebuild name:

sys-kernel/vanilla-kernel-6.5.5

Description

Linux kernel built from vanilla upstream sources

Added to portage

2023-09-24

warning - 1.3.0
Ebuild name:

dev-ruby/warning-1.3.0

Description

Custom processing for warnings

Added to portage

2023-09-24

xapian - 1.4.23
Ebuild name:

dev-libs/xapian-1.4.23

Description

Xapian Probabilistic Information Retrieval library

Added to portage

2023-09-24

xapian-bindings - 1.4.23
Ebuild name:

dev-libs/xapian-bindings-1.4.23

Description

SWIG and JNI bindings for Xapian

Added to portage

2023-09-24

xapian-omega - 1.4.23
Ebuild name:

app-text/xapian-omega-1.4.23

Description

An application built on Xapian, consisting of indexers and a CGI searc

Added to portage

2023-09-24

yt-dlp - 2023.09.24
Ebuild name:

net-misc/yt-dlp-2023.09.24

Description

youtube-dl fork with additional features and fixes

Added to portage

2023-09-24

zeitwerk - 2.6.11-r1
Ebuild name:

dev-ruby/zeitwerk-2.6.11-r1

Description

Efficient and thread-safe code loader for Ruby

Added to portage

2023-09-24

zeroconf - 0.113.0
Ebuild name:

dev-python/zeroconf-0.113.0

Description

Pure Python Multicast DNS Service Discovery Library (Bonjour/Avahi comp

Added to portage

2023-09-24

rdf newsfeed | rss newsfeed | Atom newsfeed
- Powered by LeopardCMS - Running on Gentoo -
Copyright 2004-2020 Sascha Nitsch Unternehmensberatung GmbH
Valid XHTML1.1 : Valid CSS : buttonmaker
- Level Triple-A Conformance to Web Content Accessibility Guidelines 1.0 -
- Copyright and legal notices -
Time to create this page: 31.7 ms