from small one page howto to huge articles all in one place
 

search text in:




Other .linuxhowtos.org sites: www.linuxhowtos.org
toolsntoys.linuxhowtos.org



Last additions:
How to make X listen on port 6000

How to make X listen on port 6000

words:

34

views:

68026

userrating:

average rating: 1.2 (8 votes) (1=very good 6=terrible)


May, 25th 2007:
April, 26th 2007:
Apr, 10th. 2007:
Druckversion . pdf icon
You are here: Portage


Details of www-apps/rt:

Description: RT is an enterprise-grade ticketing system
Homepage:
https://www.bestpractical.com/rt/

available versions:

releasesalphaamd64armhppaia64mipsppcppc64ppc macoss390shsparcx86USE-Flagsdependenciesebuild warnings
rt-4.4.4-r3 -~-----------mysql
+postgres
fastcgi
lighttpd
show
If you are upgrading from an existing RT installation
make sure to read the related upgrade documentation in
${ROOT}usr/share/doc/${PF}.
${FILESDIR}
Missing Perl dependency!
${T}
Please run perl-cleaner. If the problem persists,
please file a bug in the Gentoo Bugzilla with the information above
show
Legend:
+ stable
~ testing
- not available
some ebuild warning depend on specific use-flags or architectures, all ebuild-warnings are shown.

Known bugs:
bug IDcomponentassigned tostatusdescriptionlast change
209617OpenRCopenrcUNCONFIRMEDsys-apps/openrc-0.8.2-r1: user should be able to interrupt service start/stop pressing Ctrl+C2013-02-18 09:41:51
237994Applicationsbase-systemUNCONFIRMEDadd support for microcode loading with linux-2.6.27+2013-02-17 17:39:21
266311Applicationsford_prefectUNCONFIRMEDmedia-sound/pulseaudio is lacking suspend support for sys-power/pm-utils (?)2012-10-19 12:32:55
307401ApplicationspachoUNCONFIRMEDmedia-gfx/xsane crashes during startup if xinerama is enabled2012-03-02 11:17:03
331685Prefix SupportsysadminUNCONFIRMEDnet-analyzer/nrpe, net-analyzer/nagios-plugins: Gentoo Prefix support2012-08-24 13:27:59
333285Toolstools-portageUNCONFIRMEDapp-portage/gentoolkit: revdep-rebuild: add variable to make.conf default emerge options for revdep-2013-01-18 16:29:12
364941Ebuildsnet-dialupUNCONFIRMEDnet-dialup/rp-pppoe kernel-mode PPPoE support2011-04-26 19:48:13
365263Core systembase-systemUNCONFIRMEDsys-apps/less - auto convert UTF16/UTF32 inputs to active encoding2011-05-02 01:45:04
365371Enhancement/Feature Requeststools-portageUNCONFIRMEDapp-portage/gentoolkit: equery - add EQUERY_DEFAULTS_OPTIONS for default global options2012-12-25 01:54:54
365589HardenedhardenedUNCONFIRMEDdev-db/mysql: Doesn't starting.2012-02-02 03:06:50
365643Ebuildspolynomial-cUNCONFIRMEDapp-emulation/virtualbox-additions-4.* License wrongly stated as PUEL2012-07-18 02:27:12
365655Unclassifieddev-portageUNCONFIRMEDsys-apps/portage implicit pointer check is broken with gcc-4.52011-05-06 02:51:27
366051Ebuildsmaintainer-wantedUNCONFIRMEDAdd ebuild for NOC, Operation Support System (OSS) and Enterprise Network Operation Centers.2012-09-01 12:24:51
366215Applicationspolynomial-cUNCONFIRMEDapp-emulation/virtualbox has incomplete dependencies2013-01-01 09:29:16
366513Unclassifieddev-portageUNCONFIRMEDportage-2.1.9.48 fails to install after successfull build.2011-05-09 07:41:30
366891OpenRCopenrcUNCONFIRMEDsys-apps/openrc-0.8.2-r1 will not restart over a broken NFS share.2011-12-19 18:01:59
367199Applicationsportage-utilsUNCONFIRMEDapp-portage/portage-utils 'qlop' - gauge option's description is vague and misleading2011-05-17 10:12:02
367203Toolstools-portageUNCONFIRMEDapp-portage/gentoolkit equery d --name-only (as with option b) would be useful2011-05-20 16:39:30
367319Applicationsx11UNCONFIRMEDx11-base/xorg-server: After a change my keyboard to USB model, no X-programs starts and Xorg log con2011-05-16 08:42:50
367443Ebuildspolynomial-cUNCONFIRMEDapp-emulation/virtualbox-9999 sets RPATH to /opt/VirtualBox but is installed to /usr/lib/virtualbox2011-05-17 17:41:46
367699Ebuildsmedia-videoUNCONFIRMEDmedia-video/winki - winki: [..] ImportError: No module named gnome (missing RDEPEND?)2011-05-17 23:55:09
367717OpenRCopenrcUNCONFIRMEDsys-apps/openrc: services which need net aren't starting on boot2011-06-29 16:46:02
367787GamesgamesUNCONFIRMEDrevenge-of-the-titans-1.80.12 doesn't support humble bundle installation files.2012-12-27 10:32:12
367799ApplicationsvadimkUNCONFIRMEDapp-emulation/vmware-player doesn't install thnuclnt (thinprint), so virtual printers do not work (b2011-05-18 00:14:08
368001Applicationsrobbat2UNCONFIRMEDapp-portage/g-cpan fails to install Sys::Filesystem2011-05-19 16:12:27
368053Ebuildsmaintainer-wantedUNCONFIRMEDnew ebuild : net-dns/yaddns - ddns is a small ddns client with multiple ddns server supports and a h2011-05-19 20:48:37
368161Applicationsx11UNCONFIRMEDx11-apps/xinit w/ sys-apps/openrc-0.8.2-r1 start-stop-daemon ignores PAM settings for user root2011-05-24 18:46:56
368377JavajavaUNCONFIRMEDjava-config should support JNI related native config options and ld.so.conf pathes2012-04-04 14:19:10
368659Unspecifiedpolynomial-cUNCONFIRMEDapp-emulation/virtualbox - add USE flag for net-misc/vde2011-11-23 09:07:24
368835Core systembase-systemUNCONFIRMEDapp-admin/sysklogd - no way to disable startup of klogd when sysklogd is used in a vserver2011-05-31 23:48:08
368997Ebuildsarmin76UNCONFIRMEDnet-misc/tightvnc: /etc/ini.d/vnc failes to start when media-fonts/font-misc-misc is installed with 2012-06-23 17:45:55
369159Servernet-mailUNCONFIRMEDmail-filter/postgrey init script fails startup under sys-apps/openrc-0.8.2-r12013-01-14 07:23:32
369225Applicationsportage-utilsUNCONFIRMEDapp-portage/portage-utils: Request for atom support in qatom/qlist2011-10-03 00:54:56
369241EbuildssciUNCONFIRMEDsci-misc/boinc-6.12.26-r1.ebuild (Patch for PS3 Support)2012-06-26 16:01:33
369399Ebuildsmaintainer-wantedUNCONFIRMEDgames-action/descent2-vertigo ebuild submission2012-09-15 02:57:38
369811ApplicationsopenrcUNCONFIRMEDsys-apps/openrc: Patch to measure time required for starting daemons (was: delay to sys-auth/console2012-05-20 13:25:32
370203Core systemcron-bugsUNCONFIRMEDsys-process/anacron should not RDEPEND on virtual/cron2011-06-06 01:57:41
370275Applicationsmedia-videoUNCONFIRMEDmedia-video/libav-0.7_pre20110327 error: selected processor does not support ARM mode2011-10-26 17:48:22
370581ApplicationssoundUNCONFIRMEDmedia-sound/freebirth-0.3.2-r1 - /bin/sh: line 1: 19963 Segmentation fault ./fusebirth > fused_2011-06-09 22:50:31
370631Ebuildsmaintainer-wantedUNCONFIRMEDdev-php/php-smarty-framework-plugin ebuild request2013-02-04 12:40:03
370711Serverproxy-maintUNCONFIRMEDmedia-sound/teamspeak-server-bin-3.0.0_beta30: Crashes when starting from stock init script - Virtua2012-11-18 10:17:00
371083ApplicationsbilllUNCONFIRMEDmedia-video/ogmrip - add support for ogg container2012-03-26 09:37:04
371447Core - Configurationdev-portageUNCONFIRMEDportage-2.2.0_alpha40 :: emerge ignores wget bind_address option2011-06-16 09:56:45
371635EbuildspatrickUNCONFIRMEDapp-portage/getdelta picks bad source file names2011-06-15 01:13:14
371841Libraryx11UNCONFIRMEDx11-libs/libdrm-2.4.25 assertion failure triggered by sci-astronomy/stellarium-0.10.62011-06-17 09:33:02
371985Prefix SupportprefixUNCONFIRMEDdev-php5/pecl-imagick: add prefix support2012-10-18 08:27:51
372049Applicationstools-portageUNCONFIRMEDRequest for app-portage/gentoolkit to show (for a use flag) status of the flag in installed packages2012-12-25 01:55:20
372285ApplicationsxmwUNCONFIRMEDapp-admin/makepasswd-1.10 does not support the option "--crypt-md5"2011-06-21 00:38:51
372453EbuildsdotnetUNCONFIRMEDapp-portage/eclass-manpages - Documentation for mono.eclass is awfull (one line)2011-06-29 10:17:45
372475Ebuildspolynomial-cUNCONFIRMEDRename app-emulation/virtualbox-additions to app-emulation/virtualbox-[guest-]additions[-bin]2012-04-08 19:23:25
373105ApplicationsjavaUNCONFIRMEDdev-util/eclipse-sdk-3.5.1-r1 GLib, Gtk, Gdk assertions fail2013-02-04 12:40:26
373441Core systemdev-portageUNCONFIRMEDportage-2.1.9.42: portage --pretend doesn't2012-09-04 03:45:51
373823Toolstools-portageUNCONFIRMEDapp-portage/gentoolkit-0.3.0.4: `euse -i` dumps errors about missing repo_name files2012-12-25 01:55:28
373847ApplicationshannoUNCONFIRMEDmedia-gfx/gimp-2.6.11-r1: crash on startup with error GLib-WARNING ignoring no-arg, optional-arg or 2011-10-22 18:15:20
373891EbuildsramerethUNCONFIRMEDnet-misc/stunnel build fails: #error OpenSSL library compiled without thread support2012-12-25 04:27:10
373979EbuildspatrickUNCONFIRMEDapp-emulation/virtualbox-modules-4.0.10 does not compile if KBUILD_OUTPUT != KERNEL_DIR2012-09-11 09:29:19
374021Toolstools-portageUNCONFIRMEDapp-portage/gentoolkit-0.3.0.4 - eclean-pkg traceback on unknown file2012-12-25 01:55:36
374943ApplicationsmattmUNCONFIRMEDmedia-gfx/cutycapt-0_p20110502-r2 unable to ignore invalid ssl certificate2012-04-16 01:32:13
375249Ebuildsmaintainer-wantedUNCONFIRMEDapp-misc/xmind-portable (new package)2011-07-17 07:03:26
375311Toolstools-portageUNCONFIRMEDequery list - does not show status for packages in /etc/portage/package.keywords2012-12-25 01:55:50
375789ApplicationsdolsenUNCONFIRMED[TRACKER] app-portage/layman-2.0.12013-01-11 18:31:17
375879Ebuildsqmail-bugsUNCONFIRMED[PATCH] mail-mta/netqmail: Add SMTP authentication support (AUTH LOGIN) to qmail-remote2012-02-24 13:11:27
376155Applicationsmaintainer-wantedUNCONFIRMEDnet-firewall/rtsp-conntrack: new ebuild for 2.6.26 and 2.6.362011-07-25 09:17:08
376767Ebuildsrobbat2UNCONFIRMEDapp-portage/g-cpan-0.16.4 creates non-existent categories file without newline (inconsistent)2011-08-03 01:16:53
376775Ebuildsrobbat2UNCONFIRMEDapp-portage/g-cpan-0.16.4 handling of overlays2011-08-03 01:16:10
377177ApplicationsfuzzyrayUNCONFIRMEDapp-portage/elogviewer-0.6.2-r1 - elogviewer fails to start for ordinary user in the portage group2011-08-27 17:52:02
377285Applicationspolynomial-cUNCONFIRMEDapp-emulation/virtualbox-4.0.12 - Windows guest has USB disk woes2012-10-18 13:10:29
377395Libraryx11UNCONFIRMED[drm:radeon_crtc_page_flip] *ERROR* failed to reserve new rbo buffer before flip2011-08-03 08:59:16
377663Enhancement/Feature Requeststools-portageUNCONFIRMEDapp-portage/gentoolkit: Support "equery depends pkg[use]"2011-08-04 07:28:50
377831Ebuildsmaintainer-wantedUNCONFIRMEDsys-kernel/rtai-sources - Real Time Application Interface kernel sources2011-08-12 14:51:57
377833Ebuildsmaintainer-wantedUNCONFIRMEDNew ebuild for RTAI-lib modules for RTAI2011-08-05 22:24:39
377863Toolstools-portageUNCONFIRMEDapp-portage/gentoolkit: euse works improperly on g/fbsd2011-08-06 10:12:39
377933ApplicationsopenofficeUNCONFIRMEDapp-office/libreoffice-3.4.2.3 Impress text boxes become inaccessible when containing RTL text2012-04-03 23:26:53
377939Applicationsqmail-bugsUNCONFIRMEDnet-mail/vpopmail - added PostgreSQL support and USE flag2012-04-11 04:19:05
378013Applicationsmaintainer-wantedUNCONFIRMEDapp-crypt/pvk - Converts PVK files to PEM files and back again2011-08-07 13:57:30
378559Applicationsdev-portageUNCONFIRMEDsys-apps/portage-2.1.10.10 add support for stripping PE322011-08-11 07:34:53
378633Core systemopenrcUNCONFIRMEDrestarting one interface complains that dhcpcd is already running, even if in fact it is not (race c2011-08-13 14:26:13
379001LibrarygnomeUNCONFIRMEDsys-libs/ldb-1.1.4 fails on portage-multilib because of waflib module's python support2013-01-01 18:40:16
379003LibrarypatrickUNCONFIRMEDsys-libs/tevent-0.9.12 fails on portage-multilib because of waflib module's python support2012-12-25 21:03:18
379201Core systemmultilibUNCONFIRMED[multilib overlay] /dev-libs/libxml2-2.7.7 USE=lib32 - /usr/include/python2.7/pyport.h:849:2: ??????2011-08-15 07:34:05
379441Applicationsx11UNCONFIRMEDx11-apps/xinit: startx leaks .serverauth.???? files2011-10-27 13:53:49
379691Ebuildsmaintainer-wantedUNCONFIRMEDPlease add telepathy-ring ebuild into portage2013-01-18 10:49:26
379967Applicationspolynomial-cUNCONFIRMEDapp-emulation/virtualbox-modules-4.0.12 doesn't check kernel config on compatibility2011-08-22 12:36:13
380295Conceptual/Abstract Ideasdev-portageUNCONFIRMED[patch] sys-apps/portage: Enhanced output for emerge --pretend --fetchonly2012-09-06 20:12:21
380301Applicationspolynomial-cUNCONFIRMEDapp-emulation/virtualbox-4.1.2 crashes when compiling with -O2 option2012-02-01 09:06:12
380379DevmanualqaUNCONFIRMEDQuickstart ebuild guide is outdated re: emake2011-08-23 15:27:47
380389Enhancement/Feature Requestsdev-portageUNCONFIRMEDebuild skips EAPI unsupported phases silently2011-08-26 03:07:11
380647UnspecifieddolsenUNCONFIRMEDapp-portage/layman-2.0.0: More complete support for CVS2012-02-28 05:33:36
380795Core systembase-systemUNCONFIRMEDsys-fs/cryptsetup: dm-crypt-start.sh: get keys via custom pipe2011-09-23 15:26:00
381365Core systemhannoUNCONFIRMEDsys-auth/pam_mount uses all virtual memory with app-cdr/k3b-2.0.2-r12013-01-08 13:37:30
381647Ebuildsmaintainer-wantedUNCONFIRMEDapp-vim/vst - Vim reStructured Text support2011-09-06 02:47:15
381655GamesjokerUNCONFIRMEDPlease port patches for mupen64plus 1.5 from debian2012-05-28 22:08:43
381759Ebuildssci-geosciencesUNCONFIRMEDsci-geosciences/grass-6.4.1 wxwidgets GUI does not start with Python32013-01-24 22:56:15
381969Ebuildsmaintainer-wantedUNCONFIRMEDAsus Notebook keyboard/backlight support kernel modules package2011-09-08 16:02:28
381973GamesgamesUNCONFIRMEDdev-games/physfs-2.0.2-r1 doesn't support 7z2012-01-07 19:54:58
382009Applicationstools-portageUNCONFIRMEDapp-portage/gentoolkit-0.3.0.4: revdep-rebuild does not try to re-create /var/cache/revdep-rebuild2012-12-25 01:56:04
382099Ebuildsmaintainer-wantedUNCONFIRMEDmedia-gfx/mitsuba - An extensible rendering framework written in portable C++ (ebuild request)2011-09-07 04:01:42
382231Toolstools-portageUNCONFIRMEDapp-portage/gentoolkit-0.3.0.4 euse -i has undocumented output2011-09-19 18:28:14
382237ApplicationsmozillaUNCONFIRMEDwww-client/icecat-3.6.16-r3 inoperable remember ssl client certificate choice function2013-01-28 05:45:18
382339Ebuildsmaintainer-wantedUNCONFIRMED[ebuild request] app-office/dunnart - constraint-based diagram editor2011-09-09 07:53:17
382451Core systembase-systemUNCONFIRMEDapp-misc/ca-certificates-20110502: older verisign cert breaks with newer verisign cert2011-10-08 19:36:05
382589Toolstools-portageUNCONFIRMEDapp-portage/gentoolkit-0.3.0.4-r4: revdep-rebuild --library '/usr/lib/libgmp.so.3' doesn#t work2011-12-14 06:43:22
382807ApplicationsjavaUNCONFIRMED[java-overlay] app-text/languagetool-0.9.8 needs >=virtual/ooo-3.02011-12-09 23:13:42
382827Coredev-portageUNCONFIRMEDsys-apps/portage-2.1.10.11 crashes with confusing error when out of memory: TypeError: an integer is2011-09-14 13:56:03
383323Javadev-portageUNCONFIRMEDsys-apps/portage: emerges pulls in older jdk slot when newer slot is masked (newer masked slot remai2012-09-06 19:32:08
383339Applicationsbase-systemUNCONFIRMEDapp-admin/syslog-ng-3.2.4: init script fails to start with ethernet bonding2011-09-19 10:38:08
383581Core systemtoolchainUNCONFIRMED[Request] sys-devel/gcc-4.x: Re-add support for the D language2012-07-15 05:58:15
383669Applicationspolynomial-cUNCONFIRMEDapp-emulation/virtualbox-4.1.2: fails to compile due to Java name clash2011-12-21 14:52:14
383699ApplicationslackUNCONFIRMEDx11-plugins/screenlets-0.1.2 some parts depend on gconf-python2011-09-20 04:04:24
383725Enhancement/Feature Requestsdev-portageUNCONFIRMEDsys-apps/portage include digital signature in xpak2011-09-19 23:52:27
384167Prefix SupportprefixUNCONFIRMEDsys-devel/crossdev: prefix support2012-09-12 10:42:10
384537EbuildsgraphicsUNCONFIRMEDgraphviz 2.26.3-r3 and ocaml support2011-10-09 03:02:09
384603Core systempam-bugsUNCONFIRMEDsys-auth/pam_ssh-1.97-r2 (and r3) forgets to set gids in session start2011-10-09 03:06:42
385087GCC PortingtoolchainUNCONFIRMEDsys-devel/gcc-4.4.5: gcj seem to not install needed ca-certificates (/usr/lib/security/cacerts)2012-09-24 06:08:56
385153Prefix SupportprefixUNCONFIRMEDx11-libs/mesa: Support building our own OpenGL library on Mac OS X2011-10-01 07:56:36
385601Other documentsdocs-teamUNCONFIRMEDVirtual Mail Howto: MySQL Script Varies From Instructions2012-07-08 23:24:50
385713Ebuildsmaintainer-wantedUNCONFIRMEDdev-util/smartgit-2.0.6: new package2012-07-07 13:08:49
385741Applicationsfreedesktop-bugsUNCONFIRMEDsys-power/pm-utils-1.4.1-r2: delay upon starting xsession resulting in harddrive error2011-10-14 00:25:12
386019ApplicationsgraphicsUNCONFIRMEDmedia-gfx/openclipart-2.3 version bump2012-06-19 16:44:15
386037DevelopmentqtUNCONFIRMEDapp-crypt/qca-ossl-2.0.0_beta3-r2: fails to build x86-abi with portage-multilib enabled2013-01-12 22:18:36
386059Libraryarfrever.ftaUNCONFIRMEDnet-libs/neon uses deprecated function gnutls_certificate_verify_peers() of gnutls2012-04-01 12:04:01
386467Applicationsx11UNCONFIRMEDmedia-libs/mesa-7.11 causes X to fail to start2011-10-11 00:34:59
386661DevelopmentadaUNCONFIRMED[portage-multilib] dev-lang/gnat-gcc: configure error for x85-abi due to gnatboot-4.4-amd64.tar.bz22012-12-25 21:03:35
386707Gamesx11UNCONFIRMEDx11-libs/libdrm-2.4.26: assertion fails at intel_bufmgr_gem.c:13612011-10-18 05:30:06
386909Applicationsmaintainer-wantedUNCONFIRMEDmedia-libs/libshairport: new package (used by xbmc + --enable-airtunes)2013-02-21 14:38:48
387167Ebuildsmaintainer-wantedUNCONFIRMEDwww-apps/concerto - Concerto Digital Signage2011-10-18 15:41:38
387213Applicationstools-portageUNCONFIRMEDapp-portage/gentoolkit-0.3.0.4-r4 - revdep-rebuild: replace "requires" with "was linked against"2011-10-18 16:20:34
387567ApplicationsjlecUNCONFIRMEDx11-terms/terminator-0.96: Segmentation fault when starting2011-10-24 05:16:07
387803Core systemvadimkUNCONFIRMEDProcesses start hanging in "D" state on Gentoo guest under vmware host2011-10-26 00:12:42
388267Conceptual/Abstract Ideasdev-portageUNCONFIRMEDpropagation of USE flags to virtuals2011-10-26 03:35:36
388575Ebuildsmaintainer-wantedUNCONFIRMEDatem-0.3.2.ebuild - Fast command line tool that converts MetaStock financial binary data to CSV/text2011-11-03 18:46:04
389419Applicationsnet-proxyUNCONFIRMEDnet-proxy/ntlmaps - add multiple configuration support2011-11-03 15:39:17
389647Applicationstools-portageUNCONFIRMEDapp-portage/gentoolkit: revdep-rebuild does not understand symlinks2011-12-20 14:54:27
389675Applicationsnet-proxyUNCONFIRMEDnet-proxy/polipo-1.0.4.1 reports timeout for domains that are available2011-11-08 03:18:20
389735Core - Dependenciesdev-portageUNCONFIRMEDsys-apps/portage-2.2.0_alpha72 fails to do --deep correctly2011-11-08 16:17:05
389843Coredev-portageUNCONFIRMEDemerge --skipfirst without --resume tries to emerge wrong packages with portage 2.2.0_alpha722011-11-08 01:14:55
389853Applicationsshell-toolsUNCONFIRMEDapp-misc/fdupes-1.40 no longer in portage tree2012-07-06 07:28:27
389873Applicationsmaintainer-wantedUNCONFIRMEDnet-mail/mb2md - convert mbox to maildir2011-11-08 21:32:58
389905EbuildsRicardo.CordeiroUNCONFIRMEDnet-p2p/btpd-0.15: btpd can't start if BTPDUSER is "root"2011-11-08 21:44:58
390363Core systemhardened-kernelUNCONFIRMEDsys-kernel/hardened-sources-2.6.32-r42/r68/r73 - Problem with support OCFS2 filesystems2011-12-24 02:47:23
390399JavajavaUNCONFIRMEDicedtea-bin-1.10.4 always redownloads web start application2011-12-05 12:55:11
390571CoreqaUNCONFIRMEDdev-perl/CDDB_get 2.27 - environment: line 345: pushd: /var/tmp/portage/dev-perl/CDDB_get-2.27/work/2011-11-22 19:19:25
391067JavajavaUNCONFIRMEDicedtea-7.2.0-r1 with javascript requires virtual/jdk:1.62012-09-16 15:08:31
391317Enhancement/Feature Requestsdev-portageUNCONFIRMEDsys-apps/portage: Multiple, consistent verbosity levels for emerge2011-11-22 13:28:07
391407Eclasses and ProfilespatrickUNCONFIRMEDapache-2.eclass - support user patches & user configure2013-02-16 14:10:12
391771Core - Configurationdev-portageUNCONFIRMEDAlternative config (PORTAGE_CONFIGROOT) does not consider PORTAGE_CONFIGROOT/etc/make.profile2011-11-25 17:20:03
392769ApplicationspatrickUNCONFIRMEDapp-emulation/virtualbox-guest-additions-4.1.6-r1 fails to build from /etc/kernel/postinst.d - make[2012-03-14 22:38:37
393335Javagnu_andrewUNCONFIRMEDdev-java/icedtea-7.2.0-r3 - segmentation fault in /var/tmp/portage/dev-java/icedtea-7.2.0-r3/work/ic2011-12-25 05:58:41
393379EbuildsvoyageurUNCONFIRMEDx11-libs/qt-qt3support-4.7.4 fails to compile with sys-devel/dragonegg-3.02012-09-28 13:05:51
393391KDEvoyageurUNCONFIRMED[kde overlay] kde-base/katepart-9999 fails to compile with sys-devel/dragonegg-3.02012-09-28 13:05:52
394419Enhancement/Feature Requestsdev-portageUNCONFIRMEDportage: provide a make.conf option for changing to cgroups (configuring them if needed) on package 2011-12-19 18:43:41
394849GamesgamesUNCONFIRMEDgames-action/shank - A side scrolling beat 'em up with a comic book art style2012-09-23 17:44:45
394885Applicationsnet-p2pUNCONFIRMEDnet-p2p/rtorrent-0.8.9 fails to link because of missing lpthread for LIBS2011-12-16 02:48:12
395007Prefix SupportryaoUNCONFIRMEDImport net-misc/tor-0.2.2.34-r1 on x64-macos2012-08-10 18:51:21
395095genkernelgenkernelUNCONFIRMEDgenkernel add support for custom location of boot config file2011-12-17 22:26:49
395399UnspecifiedperlUNCONFIRMEDapp-portage/perl-info: can't print out error message if PORTDIR is not set2011-12-20 20:21:36
395429Ebuildspolynomial-cUNCONFIRMEDapp-emulation/virtualbox-modules: need check CONFIG_HZ=value2011-12-21 02:10:58
395529EbuildssambaUNCONFIRMEDnet-fs/samba - add support for samba-virusfilter2011-12-21 17:17:13
395801Applicationsmedia-videoUNCONFIRMEDmedia-video/libav-0.8_pre20111222 produces white noise with part of some music files2012-03-08 07:44:03
395927Applicationspolynomial-cUNCONFIRMEDapp-emulation/virtualbox-4.1.8, app-emulation/virtualbox-extpack-oracle-4.1.8 - broken /usr/lib64/vi2011-12-26 10:21:44
395939Ebuildsmaintainer-wantedUNCONFIRMEDHypertable 0.9.5.4 : ebuild request2012-11-15 17:27:46
396045Ebuildsnet-dialupUNCONFIRMEDnet-dialup/gnuradius should install startup files2011-12-26 23:56:22
396071Applicationsmaintainer-wantedUNCONFIRMEDB2Uconverter: a libreoffice's extension for Vietnamese2011-12-26 23:54:30
397403ApplicationspatrickUNCONFIRMEDwww-apps/otrs - add app-admin/webapp-config compatibility / webapp.eclass support2012-08-24 13:09:08
397587ApplicationshollowUNCONFIRMEDwww-servers/nginx - add Naxsi web application firewall support2013-02-21 09:09:26
398123EbuildsforensicsUNCONFIRMEDapp-forensics/rkhunter missed dependency on virtual/mailx2012-01-08 16:25:00
398137Ebuildsmaintainer-wantedUNCONFIRMEDitap rdp client - a closed source rdp client that supports (among other things) TS-Gateway servers2012-01-10 15:05:30
398151ApplicationschutzpahUNCONFIRMEDnet-mail/courier-imap-4.5.0 error in man page mkpop3dcert2012-01-08 16:37:08
398473genkernelgenkernelUNCONFIRMED[patch] sys-kernel/genkernel v86d support2012-01-12 17:13:07
398477genkernelgenkernelUNCONFIRMED[patch] sys-kernel/genkernel tuxonice-userui support2012-01-12 17:15:12
398491Ebuildsmaintainer-wantedUNCONFIRMEDmedia-sound/qloud-0.30 - Tool to measure loudspeaker frequency and step response, distortions' SPL a2012-01-11 17:10:33
398631EbuildsultrabugUNCONFIRMEDvirtual/logger should rdepend also on >=sys-apps/systemd-382013-01-26 22:46:00
398689EbuildsjavaUNCONFIRMEDRemove dev-java/servletapi replace with java-virtuals/servlet-api2012-09-29 09:01:54
398733Ebuildsmaintainer-wantedUNCONFIRMEDnet-fs/unfs3-0.9.22 A portable user-space implementation of the NFSv3 server specification2012-01-15 19:29:12
399115Ebuildsnet-p2pUNCONFIRMEDnet-p2p/rtorrent-0.8.9 - .../work/rtorrent-0.8.9/src/core/download.h:76:84: error: ‘class core::Down2012-04-08 10:10:28
399353ApplicationsjerUNCONFIRMEDapp-admin/sysstat-10.0.3 generated daily report file will be truncated by cron.daily (sys-process/vi2012-05-10 14:40:15
399443Developmentrobbat2UNCONFIRMEDapp-portage/g-cpan-0.16.2 refuses to install LWP::UserAgent2012-04-05 01:19:58
399481ApplicationsrafaelmartinsUNCONFIRMEDapp-portage/g-octave - g-octave/odepkg-0.6.10 octave-3.6.0 - odepkg_auxiliary_functions.cc:457:52: e2012-12-20 00:22:48
399577Core - Dependenciesdev-portageUNCONFIRMEDportage/emerge fails to compute dependencies and fails to report what triggered the problem2012-01-22 15:26:36
399687ApplicationshannoUNCONFIRMEDSVGs exported by app-office/libreoffice cause segmentation fault in media-gfx/gimp-2.6.11-r52012-01-23 09:36:24
399839EbuildsfauliUNCONFIRMEDapp-admin/tmpwatch reports "Cannot stat file" with --fuser on sufficiently loaded system2012-02-17 15:33:53
399899Developmentlang-miscUNCONFIRMEDdev-lang/fpc-2.6.0 USE=ide - fpcalc.pas(244,3) Fatal: Selected assembler reader not supported2012-02-15 16:20:16
400547DevelopmentvoyageurUNCONFIRMEDdev-libs/STLport-5.2.1 does not compile using clang++ due to error in stlport/stl/_locale.h2012-01-25 13:51:23
400721Installation Handbookdocs-teamUNCONFIRMEDPart about bonding should be reworked2012-09-05 11:11:12
400779GamesgamesUNCONFIRMEDgames-puzzle/lemmini - a Java port of Lemmings2012-01-25 20:53:58
401503Enhancement/Feature Requestsdev-portageUNCONFIRMEDemerge please ad short option to autounmask-write, -w suggested2012-01-30 17:48:55
401523Applicationsx11UNCONFIRMEDx11-apps/xdm-1.1.11: does not start from within a chrooted environment if LiveDVD was booted with no2012-01-31 19:37:14
401681Applicationsnet-p2pUNCONFIRMEDnet-misc/curl-7.24.0 with net-p2p/rtorrent-* leads to 100% CPU load.2013-01-01 14:36:36
402211Applicationsmaintainer-wantedUNCONFIRMEDapp-misc/freeplane (app-misc/freemind replacement) - software to support thinking, sharing informati2012-10-16 14:54:19
402245Core systembase-systemUNCONFIRMEDsys-fs/dosfstools-3.0.12 dosfslabel does not work if long file names are used in partition2013-01-23 19:12:35
402347OpenRCopenrcUNCONFIRMEDnet.wlan0 fails to auto-start with 2013-02-03 08:30:09
402415Third-Party ToolsmgornyUNCONFIRMEDapp-portage/flaggie breaks soft link after doing a cleanup2012-02-06 17:27:38
402645Developmentrobbat2UNCONFIRMEDapp-portage/g-cpan-0.16.4 fails to install Spreadsheet::XLSX due to "[in]correct package syntax"2012-02-13 21:18:27
402647Enhancement/Feature Requestsdev-portageUNCONFIRMEDsys-apps/portage emerge utility add layman sync functionality2012-02-09 06:29:42
402659DevelopmentpythonUNCONFIRMEDdev-python/pydb-1.26-r1 - ImportError: No module named fns2012-04-24 16:19:54
403051Applicationsmr_bones_UNCONFIRMEDmedia-gfx/gqview-2.1.5 - ld: pan-calendar.o: undefined reference to symbol 'sqrt@@GLIBC_2.0'2012-02-13 12:03:19
403123Unspecifiedshell-toolsUNCONFIRMEDapp-shells/gentoo-bashcomp - Add ebuild(1) --skip-manifest completion support2012-02-13 17:23:49
403135ApplicationsclusterUNCONFIRMEDsys-cluster/ipvsadm - libipvs does not report ipvs-backup-threads2012-02-14 17:09:34
403283GNOMEgnomeUNCONFIRMEDgnome-base/gdm-3.2.1.1-r2 partially loads2013-01-22 22:52:56
403407ApplicationspythonUNCONFIRMEDdev-python/rst2pdf - Add SVG support (IUSE=svg)2012-02-15 16:25:10
403473Applicationsidl0rUNCONFIRMEDmedia-plugins/vdr-xineliboutput-1.0.5-r1 - xine_post_audiochannel.c:97:7: error: ‘post_audio_port_t’2012-09-27 15:47:31
403697Coredev-portageUNCONFIRMEDsys-apps/portage-2.1.10.46: TypeError: an integer is required2012-02-18 05:35:08
403841EbuildshwoarangUNCONFIRMEDdev-embedded/openocd-9999 - refactor and improve device support2012-11-05 12:32:05
404157Coredev-portageUNCONFIRMEDsys-apps/portage : die in pkg_pretend() stops --keep-going from working2012-03-19 16:35:13
404345Applicationspolynomial-cUNCONFIRMEDapp-emulation/virtualbox-modules-4.1.4 - work/vboxpci/linux/VBoxPci-linux.c:989:9: Fehler: Zu wenige2012-02-18 16:57:37
404445Core - Dependenciesdev-portageUNCONFIRMEDsys-apps/portage-2.1.10.44 tries to pull in dev-lang/perl-5.10.1 for virtual/perl-Time-Local-1.19.012012-02-18 22:44:10
404453EbuildspchristUNCONFIRMED=dev-lang/swig-2.0.4-r1 - Invalid conversion breaks PHP 5.4 support2012-12-28 19:37:35
405151ApplicationspatrickUNCONFIRMEDapp-emulation/virtualbox-guest-additions-4.1.4-r1: Failure to build with 3.2 kernel2012-04-02 07:44:24
405183ApplicationspythonUNCONFIRMEDdev-python/reportlab should not depend on media-fonts/ttf-bitstream-vera2012-02-22 18:19:40
405549LibrarysrinclanUNCONFIRMEDdev-python/pywebkitgtk-1.1.8 crashes at start when using Pax/Hardened2012-06-10 01:24:13
405765ApplicationsnetmonUNCONFIRMEDnet-analyzer/rrdtool-1.4.5-r2 - main.c:(.text+0x26c): undefined reference to `rrd_xport'2012-08-26 06:23:55
406085ServerfloppymUNCONFIRMEDnet-misc/openswan-2.6.37 with USE +caps fails to find cacert (X.509)2012-04-06 22:44:01
406187LibrarypatrickUNCONFIRMEDsys-libs/talloc-2.0.7 - [Errno 2] No such file or directory: '/var/tmp/portage/sys-libs/talloc-2.0.72012-03-29 20:03:40
406321ApplicationsrafaelmartinsUNCONFIRMEDapp-portage/g-octave - control package not found2012-05-21 11:33:34
406367GNOMEmedia-videoUNCONFIRMEDmedia-libs/libdvdnav: assertion in set_PTT() triggered (was: media-video/totem-3.2.1: Crashes when p2012-03-01 03:04:44
406645Toolstools-portageUNCONFIRMEDapp-portage/gentoolkit-0.3.0.5 please consider renaming the revdep-rebuild scripts2012-03-05 12:52:29
406757ApplicationshwoarangUNCONFIRMEDmedia-video/rtmpdump crashes with gnutls[nettle]2012-03-24 09:19:49
406775Applicationsmedia-tvUNCONFIRMEDapp-misc/lirc - lircd reports "read invalid data from device /dev/lirc0" and no more output afterwar2012-03-05 19:44:56
406805ApplicationstitanofoldUNCONFIRMEDnet-dns/ddclient-3.8.1-r4 - Multiple interface support is broken2012-12-26 12:36:00
406811Coredev-portageUNCONFIRMEDFeature request: enhance portage with "buildsrcpkg" that captures all source files for GPL complianc2012-03-04 07:20:32
407163LibraryproaudioUNCONFIRMEDmedia-libs/portmidi needs kernel config checks for CONFIG_SND_USB_AUDIO, CONFIG_SND_SEQUENCER2012-03-07 16:40:02
407277Core systemsystemdUNCONFIRMEDsys-fs/mdadm - add support for systemd2013-02-04 15:19:48
407471Applicationsmaintainer-wantedUNCONFIRMEDsys-cluster/blcr: a checkpoint and restart kernel support2012-03-09 15:14:37
408139Core systembase-systemUNCONFIRMEDsys-fs/mdadm-3.2.1 sends ioctl 1261 (BLKFLSBUF) to partition when displaying array details2012-11-11 22:39:56
408263ApplicationsnetmonUNCONFIRMED=net-analyzer/fail2ban-0.8.6 iptables bans lost on restart2012-03-15 15:16:00
408607Applicationspolynomial-cUNCONFIRMEDapp-emulation/virtualbox - make --disable-vmmraw optional2012-03-18 05:32:07
408611Applicationspolynomial-cUNCONFIRMEDx11-drivers/xf86-video-virtualbox-4.1.10 - work/VirtualBox-4.1.10/include/iprt/types.h:112:30: fatal2013-01-31 09:32:22
409011Applicationsrobbat2UNCONFIRMEDapp-portage/g-cpan-0.16.4 'g-cpan -u' fails with Invalid ebuild name: /var/lib/cpan/perl-gcpan/Best/2012-03-23 07:38:06
409119ApplicationscppUNCONFIRMEDdev-libs/STLport-5.2.1 - Fatal error: can't create obj/gcc/so/dll_main.o: No such file or directory2012-03-21 09:41:23
409441Coredev-portageUNCONFIRMEDportage-2.1.10.49 elog ignoring PORTAGE_ELOG_CLASSES2012-03-23 13:26:59
409555Applicationsnet-imUNCONFIRMEDnet-im/gg-transport-2.2.4 segmentation fault in local_translate (str=0x34eb52fbcac "\203=\365\377\062012-12-16 14:28:04
409787OpenRCopenrcUNCONFIRMEDsys-apps/openrc-0.9.9.3: "rc-status -a" doesn't display all started services2012-11-07 15:40:11
409867EbuildsjmbsvicettoUNCONFIRMEDnet-misc/vde-2.3.2 version bump including Python support2012-06-08 13:16:39
409869Ebuildsmaintainer-wantedUNCONFIRMEDapp-emulation/virtualbricks-0.6.352 - A GTK frontend for VDE and QEMU/KVM2012-12-08 17:33:25
409961Applicationspolynomial-cUNCONFIRMEDapp-emulation/virtualbox-4.1.10[vboxwebsrv] with net-libs/gsoap-2.8.8[gnutls] - /usr/lib64/libgsoaps2012-03-28 12:53:46
410033Core systemmaintainer-neededUNCONFIRMEDsys-power/cpufreqd crashes on AC transition or startup with ACPI battery support2012-11-18 12:15:37
410037Core systemmaintainer-neededUNCONFIRMEDsys-power/cpufreqd config parser prevents usage of multi-cpu profile support2012-11-18 12:15:58
410053Applicationsidella4UNCONFIRMEDapp-emulation/xen-tools-4.1.2-r2 init script throws: option 'a' not supported2012-06-08 07:16:47
410271OpenRCopenrcUNCONFIRMEDnet init scripts fail to add route source address to tunnel interface: "RTNETLINK answers: Invalid a2012-04-02 01:31:02
410321ApplicationsfloppymUNCONFIRMEDwww-client/google-chrome-18.0.1025.142_p129054: "While your browser seems to support WebGL, it is di2012-07-24 04:30:58
410333ApplicationssoundUNCONFIRMEDmedia-sound/milkytracker-0.90.85 - In member function ‘virtual bool DecompressorGZIP::decompress(con2013-01-30 18:31:25
410343Ebuildsmaintainer-neededUNCONFIRMEDnet-wireless/broadcom-sta - modprobe wl: ERROR: could not insert 'wl': No such file or directory2013-02-03 13:03:43
410371ApplicationslackUNCONFIRMEDwww-plugins/adobe-flash-11.2.202.228 segmentation fault in mozalloc_abort(char const*) () from /usr/2012-12-15 19:35:06
410389ApplicationstomjbeUNCONFIRMEDmedia-radio/fldigi segfaults at start up2012-04-07 22:14:10
410451ApplicationspatrickUNCONFIRMEDwww-servers/apache-2.4.1-r1 APACHE2_MPMS="itk" - configure: error: MPM itk is not supported on this 2013-02-16 13:20:37
410553UnspecifiedswaponUNCONFIRMEDx11-drivers/xf86-video-virtualbox / app-emulation/virtualbox-guest-additions fail to cross-compile2012-04-03 15:23:22
410699ApplicationspatrickUNCONFIRMEDwww-servers/apache-2.4.1-r2 /etc/init.d/apache2 start complains about Config variable ${SVN_REPOS_LO2013-02-16 13:32:09
410981ToolsdolsenUNCONFIRMEDapp-portage/etc-proposals with dev-lang/python-2.7[-berkdb] - raise error, "db type could not be det2012-04-09 20:36:29
411099GamesgamesUNCONFIRMEDgames-simulation/tpt_merbo-1.0 - A mod of The Powder Toy, a particle simulator2012-04-07 15:00:08
411461OpenRCopenrcUNCONFIRMEDsys-apps/openrc-0.9.8.4: services fail to start at boot because of "stalled" deptree cache2012-04-10 12:21:07
411687ApplicationscjkUNCONFIRMEDapp-i18n/ibus-mozc: support uim-mozc (Mozc engine for app-i18n/uim)2012-04-12 23:00:50
411747Ebuildsx11UNCONFIRMEDx11-drivers/xf86-video-ati 6.14.3-6.14.4: Vertical pixel-line display artifacts from fvwm desktop m2012-12-15 18:54:01
412579Core systembase-systemUNCONFIRMEDnet-misc/wget-1.13.4-r1 - Add libproxy support2012-04-21 05:34:30
412695ApplicationsvirtualizationUNCONFIRMED[virtualization overlay] app-emulation/xen-tools-9999 fails to unpack2012-04-21 17:28:46
413191VulnerabilitiessecurityUNCONFIRMEDapp-portage/pfl - /usr/bin/e-file is too trusting of HTTP response.2012-06-18 06:04:49
413263Keywording and StabilizationperlUNCONFIRMEDPlease stabilize =perl-core/MIME-Base64-3.130.0 and virtual/perl-MIME-Base64-3.130.0-r22012-11-01 08:46:25
413467Applicationspolynomial-cUNCONFIRMEDapp-emulation/virtualbox-4.1.12: parallel build sometimes fails2013-01-07 06:25:45
413515DevelopmentsciUNCONFIRMEDsci-libs/scipy - import failures due to missing symbols in clapack.so2013-02-07 13:44:35
413623ApplicationsproaudioUNCONFIRMEDmedia-sound/terminatorx 3.82 and 3.84 - tX_midiin.cc:452:2: error: cannot convert ‘gzFile_s**’ to ‘g2013-01-06 04:23:20
414289Prefix SupportprefixUNCONFIRMEDeselect-rails-0.18 support2012-05-23 20:25:13
414535EbuildsflameeyesUNCONFIRMEDapp-emulation/lxc should support doc use flag2013-01-12 02:20:44
414549Libraryamd64UNCONFIRMEDapp-emulation/emul-linux-x86-*; support for running PCSX2 32-bit released binary (or own)2012-07-18 15:48:39
414655Toolstools-portageUNCONFIRMEDapp-portage/gentoolkit - eshowkw undocumented output2012-12-25 01:56:31
414815PMS/EAPIpms-bugsUNCONFIRMED[Future EAPI] Support for repository dependencies in DEPEND, PDEPEND and RDEPEND and atoms passed to2013-01-12 13:12:54
414817PMS/EAPIpms-bugsUNCONFIRMED[Future EAPI] Support for make.defaults, use.force, use.stable.force, use.mask, use.stable.mask, pac2013-01-12 13:13:11
414829Applicationseric.joshua.martinUNCONFIRMEDwww-apps/rt-4.0.5: Generated.pm configured directories point to /usr/share/webapps instaed of webapp2012-05-06 22:45:45
414967Core systemtoolchainUNCONFIRMEDsys-devel/gcc-4.6.3 in dev-lang/gforth-0.7.0 - ./engine.c:460:1: internal compiler error: in simplif2012-06-28 17:14:55
415053Documentationdev-portageUNCONFIRMEDMinor manpage bug re: /etc/portage/bashrc2012-05-07 22:43:58
415089Applicationsx11UNCONFIRMEDx11-drivers/xf86-input-evdev - add utouch support2012-05-10 10:28:51
415359Core systemhsggebhardtUNCONFIRMED[systemd overlay] sys-apps/systemd-units: Support kexec2012-05-10 23:45:09
415367ApplicationsopenofficeUNCONFIRMEDapp-office/libreoffice selecting part of a file name does not work when using "LibreOffice file dial2012-05-10 13:37:24
415399EbuildsfauliUNCONFIRMEDapp-portage/g-ctan-2011.1 does not list pgfplots in CTAN database2012-12-16 13:13:12
415911Enhancement/Feature Requestsdev-portageUNCONFIRMED/var/log/portage/ not owned by an ebuild2012-05-15 15:24:41
415913GamesgamesUNCONFIRMEDgames-sports/speed-dreams new version 2.0 available - please update2013-01-28 08:07:00
415931ApplicationslackUNCONFIRMEDapp-admin/gkrellm patch for ATI radeon temperature support2012-05-15 16:33:50
416147Prefix SupportprefixUNCONFIRMEDeix-0.25.4 fails to install with chown: invalid user: ‘portage:portage’2012-05-22 16:31:08
416269Prefix SupportprefixUNCONFIRMEDdev-python/reportlab-2.5-r1 fails to build : libart.h : No such file or directory2012-05-23 15:49:39
416439JavajavaUNCONFIRMEDdev-java/rxtx cannot connect to serial port2012-07-30 18:07:11
416573EbuildsswaponUNCONFIRMEDx11-drivers/xf86-video-virtualbox - invalid conversion from ‘void*’ to ‘RTHEAPSIMPLEBLOCK*’ [-fpermi2012-06-16 18:59:56
416757Core systemtoolchainUNCONFIRMEDcross-arm-elf/gcc-4.5.3-r2 - checking machine/endian.h usability... // .../work/gcc-4.5.3/libiberty/2012-06-17 17:06:03
416835ApplicationsgraphicsUNCONFIRMEDmedia-gfx/nip2 should support USE="compat examples"2013-02-16 14:13:54
416903ApplicationslivecdUNCONFIRMEDsys-block/parted-3.1 fails tests [t8001-loop-blkpg.sh t2100-zerolen.sh]2012-05-21 14:59:50
417295Ebuildsmaintainer-wantedUNCONFIRMEDmedia-video/sview-12.05 - a universal stereoscopic player which supports image viewing and movie pla2012-10-14 10:12:17
417395ApplicationsproaudioUNCONFIRMEDmedia-plugins/ir_lv2 - make & install "convert4chan"-tool2012-05-24 16:48:34
417515Unclassifieddev-portageUNCONFIRMEDsys-apps/portage-2.1.10.49 etc-update finds rc.conf twice2012-05-27 21:31:38
417597Repomandev-portageUNCONFIRMEDsys-apps/portage: repoman: Improve description of {P,R}DEPEND.suspect (rename .suspect to .blacklist2012-05-26 11:26:14
417687ApplicationsmozillaUNCONFIRMEDmail-client/thunderbird www-client/seamonkey segfault at startup if nss_ldap/openldap are installed2012-10-22 16:13:48
417785Ebuildsrobbat2UNCONFIRMEDapp-portage/g-cpan-0.16.4 broken regexp building for some cpan modules2012-05-30 09:21:46
418285Ebuildsmaintainer-wantedUNCONFIRMEDmedia-libs/dcmtk - DCMTK - a collection of libraries and applications implementing large parts the D2012-05-30 18:44:00
418317Applicationsmr_bones_UNCONFIRMEDapp-admin/syslog-ng-3.3.5 - add systemd support2013-01-31 20:52:53
418353Ebuildsmaintainer-wantedUNCONFIRMEDdev-php/pecl-dbase - DBASE support removed from PHP 5.32012-05-31 14:59:48
418403Ebuildsmaintainer-wantedUNCONFIRMEDapp-admin/puppet-dashboard - a web interface providing node classification and reporting features fo2012-10-09 03:21:48
419381Core - Interface (emerge)dev-portageUNCONFIRMEDsys-apps/portage-2.2.0_alpha109: emerge autounmask comment shows confusing "required by" dependency 2013-02-18 21:17:14
419415Applicationsnet-imUNCONFIRMEDnet-im/pidgin: Freeze on startup2012-06-16 22:36:00
419557GamesgamesUNCONFIRMEDgames-action/cortex-command-0.25 new ebuild2012-06-06 20:46:34
419591FreeBSDbsdUNCONFIRMEDCreate an OpenJDK ebuild based on the FreeBSD port2012-06-04 09:05:30
419755GamesgamesUNCONFIRMEDSupport amd64 for games-strategy/heroes32012-09-04 02:13:09
419841ApplicationshannoUNCONFIRMEDsci-geosciences/merkaartor-0.17.2 - In member function 'virtual void QGPSDDevice::run()': GPS/qgpsde2012-06-08 15:52:51
419955Applicationsmedia-videoUNCONFIRMEDmedia-video/vlc-2.0.1 - src_test(): srtp-test-aes / srtp-test-recv: Libgcrypt warning: missing initi2012-09-19 13:11:08
419963DevelopmentperlUNCONFIRMEDdev-lang/perl-5.16.0 should PDEPEND virtual/perl-ExtUtils-ParseXS2012-06-07 02:24:27
420271ApplicationspythonUNCONFIRMED=dev-python/twisted-11.0.0: fails test wrt twisted.test.test_udp.Server2012-06-11 10:59:36
420495ApplicationsfauliUNCONFIRMEDapp-portage/g-ctan should provide explicit database update options2012-06-11 11:20:54
420505ApplicationsfauliUNCONFIRMEDapp-portage/g-ctan does not honour PORTDIR2012-06-11 11:20:25
420521ApplicationsfauliUNCONFIRMEDapp-portage/g-ctan does not allow to install all packages2012-11-29 14:49:37
420577Portage Documentationdev-portageUNCONFIRMEDsys-apps/portage: Polish manuals are severely outdated2013-01-05 13:26:13
420617Applicationsrobbat2UNCONFIRMEDapp-portage/g-cpan-0.16.4 does not read /etc/portage/make.conf2012-06-17 12:50:11
420641PrintingprintingUNCONFIRMEDapp-text/ghostscript-gpl-9.05-r1 - libgs.so gets built with _start etc2012-10-24 09:21:47
420733Applicationsx11UNCONFIRMEDx11-drivers/ati-drivers-12.4 - fgrlx module crash on startx2012-06-13 09:46:44
420819Applicationsnet-imUNCONFIRMEDnet-im/pidgin add support for mxit protocol2012-07-10 19:40:02
420941OpenRCopenrcUNCONFIRMEDsys-apps/openrc: add l2tp support2012-11-13 08:05:04
421135Ebuildsapache-bugsUNCONFIRMEDwww-servers/apache-2.4* - add support for mod_proxy_fcgi2013-02-20 00:33:10
421159DevelopmentperlUNCONFIRMEDvirtual/perl-libnet needs updated RDEPEND2012-06-15 15:36:15
421289ApplicationsultrabugUNCONFIRMEDdev-db/mongodb-2.0.6: Add support for USE="ssl"2012-12-23 14:34:12
421623DevelopmenthaskellUNCONFIRMEDdev-lang/ghc-7.4.1-r1: unable to compile with portage because it results in a segmentation fault.2012-06-19 16:29:37
421845ApplicationsqemuUNCONFIRMEDapp-emulation/qemu: ABI=x32 support2012-12-13 22:09:00
422459Applicationsphp-bugsUNCONFIRMEDdev-php/smarty-2.6.26 version bump request2013-01-21 18:16:37
423145ApplicationspatrickUNCONFIRMEDnet-irc/quassel support for syslog in init script2012-06-25 20:11:44
423313Toolstools-portageUNCONFIRMEDrevdep-rebuild does not fix /usr/lib/libstartup-notification-1.so.0 // www-client/firefox-10.0.5 - l2012-08-03 11:54:41
423355Applicationspolynomial-cUNCONFIRMEDapp-emulation/virtualbox - remove `-f' from VBox_load_modules2012-07-26 14:30:14
423817DevelopmentflameeyesUNCONFIRMEDdev-util/dwarves-1.9: ostra-cg cannot find python module ostra: ImportError: No module named ostra2012-06-27 18:54:10
423827KDEkdeUNCONFIRMEDkde-base/kdm fails to start using binpkgs2013-02-17 22:50:42
424365EbuildsnirbheekUNCONFIRMEDdev-python/pypy-1.9-r1: AssertionError: must come from an argument to the function, got <-88;esp>2012-07-03 14:41:31
424461EbuildssciUNCONFIRMED[science overlay] app-portage/g-octave-9999 fails running with ImportError: cannot import name Confi2012-07-02 10:57:20
424463EbuildsrafaelmartinsUNCONFIRMEDapp-portage/g-octave please provide an updated database2012-08-03 22:03:54
424657Applicationsrobbat2UNCONFIRMEDapp-portage/g-cpan-0.16.4-r1 uses code that is depreciated in perl-5.16.02012-07-18 05:39:50
424699EbuildsflameeyesUNCONFIRMEDdev-perl/google-api-adwords-perl gzip support USE flag2012-07-08 19:56:15
424797EbuildspatrickUNCONFIRMEDapp-emulation/virtualbox-guest-additions-4.1.12: Successfully built on no-multilib amd642012-07-06 04:27:50
424816ApplicationspatrickUNCONFIRMEDapp-emulation/virtualbox-guest-additions-4.1.12 and x11-drivers/xf86-video-virtualbox-4.1.12 fail to2012-12-26 21:09:46
424854Ebuildsnet-mailUNCONFIRMEDdev-libs/cyrus-2.1.25-r2: subversion lose support for SASL with DIGEST-MD5 after upgrade cyrus-sasl 2012-07-05 06:54:33
424862Core systembase-systemUNCONFIRMEDsys-apps/logwatch - please add support for postscreen postfix service from upstream patch2012-08-28 08:48:18
424870Enhancement/Feature Requestsdev-portageUNCONFIRMEDsys-*/ upgrade notification in Portage2012-09-04 05:42:54
425022Core systembase-systemUNCONFIRMEDsys-apps/pciutils - lib/configure: Looking for access methods... Unfortunately, your OS is not suppo2012-07-10 09:18:23
425030EbuildscedkUNCONFIRMEDdev-util/nsis-2.4.6 - am64 support (no multilib)2012-07-06 13:37:44
425222Prefix SupportprefixUNCONFIRMEDopenexr/openexr-1.7.0-r1.ebuild with support for prefix2012-08-20 19:34:56
425554Core systemdev-portageUNCONFIRMEDsys-apps/portage-2.2.0_alpha116: Ctrl+C during --jobs simply halts progress w/o quitting2012-12-25 21:05:58
425758EbuildsroxUNCONFIRMEDrox-base/rox-lib - Deprecation Warning: Usage of python_mod_optimize() in packages not support......2012-07-18 09:48:32
426356ApplicationsnetmonUNCONFIRMEDnet-analyzer/mrtg-2.17.4: /etc/init.d/mrtg restart: overload arg '..' is invalid at /usr/lib/perl5/v2012-07-25 14:42:22
426358Core systembase-systemUNCONFIRMEDsys-block/partimage server crashes with pthread error when client attempts to download image2012-07-18 00:00:36
426362ApplicationsgraphicsUNCONFIRMEDmedia-gfx/graphviz-2.28.0 media-gfx/graphviz-2.28.0 enables qt, despite USE=-qt4 builds Qt support2012-07-18 00:01:30
426514UnspecifiedswaponUNCONFIRMEDx11-drivers/xf86-video-virtualbox-4.1.12 - /usr/src/linux-3.3.8-gentoo/arch/x86/include/asm/unistd.h2012-09-11 23:56:28
426586Ebuildsdev-embeddedUNCONFIRMEDsci-electronics/sigrok - a portable, cross-platform, Free/Libre/Open-Source signal analysis software2012-11-04 22:54:31
426640EbuildsdotnetUNCONFIRMEDdev-dotnet/smartirc4net-0.4.5.1: fails to build2012-07-21 10:25:06
426656Ebuildspolynomial-cUNCONFIRMEDapp-emulation/virtualbox-4.18 should depend on >=dev-util/kbuild-0.1.9998_pre20110817-r12012-07-18 15:40:35
426736Applicationsx11UNCONFIRMEDx11-base/xorg-server segfaults at startup with x11-drivers/xf86-video-ati-6.14.4-r12012-07-18 21:13:12
426744FreeBSDbsdUNCONFIRMEDopenistgt -- an enterprise iscsi target port for FreeBSD2012-07-15 20:52:56
426898Applicationspolynomial-cUNCONFIRMED=app-emulation/virtualbox-modules-4.1.12 with sys-kernel/vanilla-sources-3.4.5 - src_test(): .../wor2012-11-13 17:18:09
426980Ebuildsmaintainer-neededUNCONFIRMEDdev-lang/gforth-0.7.0: fails to build2012-07-23 17:43:24
427062EbuildsxmwUNCONFIRMEDapp-admin/bcfg2-1.2.2-r1 - add support for Dynamic Reporting System2012-07-19 15:58:15
427194ApplicationshollowUNCONFIRMEDwww-servers/nginx: add rtmp module support2012-11-26 08:04:35
427334Ebuildsmaintainer-wantedUNCONFIRMEDmail-client/mutt-kz - a fork of mutt with added support for net-mail/notmuch2012-08-03 06:29:47
427528Applicationsnet-p2pUNCONFIRMEDnet-p2p/deluge-1.3.3 and 1.3.5 segfaults on start2012-07-23 18:53:18
427632Applicationsx11UNCONFIRMEDx11-drivers/xf86-input-evdev-2.7.0 breaks y-direction emulateWheel for Kensington Expert Mouse2012-07-25 22:35:22
427668Ebuildssci-geosciencesUNCONFIRMEDsci-geosciences/osm2pgsql-99999999 - support for *.pbf files2012-07-24 14:32:27
427748Core systemdev-portageUNCONFIRMEDsys-apps/portage-2.2.0_alpha120 crashing when compile fails2012-07-23 18:57:51
427808EbuildsvoyageurUNCONFIRMEDx11-base/xorg-server-1.12.3 crashing at start-up when compiled with sys-devel/clang2012-12-31 12:32:19
427946Eclasses and ProfilespatrickUNCONFIRMEDapache-2.eclass: Proposed enhancement: USE_EXPAND of APACHE2_MODULES should support IUSE-DEFAULTS2013-02-17 09:25:03
427974Applicationspolynomial-cUNCONFIRMEDapp-emulation/virtualbox-4.1.12 - .../work/VirtualBox-4.1.12/src/VBox/Devices/PC/Etherboot-src/arch/2012-07-25 02:41:01
427990EbuildsperlUNCONFIRMEDvirtual/perl-File-Spec-3.330.0-r1 tries to downgrade dev-lang/perl-5.16.02012-09-25 19:42:06
428024Ebuildsmaintainer-wantedUNCONFIRMEDdev-libs/breakpad -- An open-source multi-platform crash reporting system2012-08-17 21:05:56
428124Applicationspolynomial-cUNCONFIRMEDapp-emulation/virtualbox-4.1.12: "Failed to create the VirtualBox COM object"2012-09-21 15:25:00
428220ApplicationstoolchainUNCONFIRMEDwww-client/firefox-10.0.5 - ld: BFD (GNU Binutils) 2.21.1 internal error, aborting at /var/tmp/porta2012-07-27 17:14:46
428378ServerbluenessUNCONFIRMEDapp-admin/webapp-config-1.50.19 - fix paludis support2012-07-29 16:01:32
428678Core - Configurationdev-portageUNCONFIRMEDsys-apps/portage-2.1.10.65 omits some variables from cascaded profiles make.defaults2012-08-07 05:00:31
428682HardenedhardenedUNCONFIRMEDSystem.map has an incorrect kernel version reported when grsec enabled2012-08-03 15:29:25
429286GamesgamesUNCONFIRMEDMouse behavior in games-fps/quake2-icculus is inverted in both x and y axis.2012-08-01 00:20:46
429462Core systembase-systemUNCONFIRMEDnet-misc/rsync - add --copy-devices support2012-08-02 11:50:17
429616LibraryopenofficeUNCONFIRMEDdev-libs/icu-49.1.2 - ../sysdeps/unix/sysv/linux/getpagesize.c:32: __getpagesize: Assertion `_rtld_g2012-11-02 15:22:44
429926Coredev-portageUNCONFIRMEDportage should add --nodeps when using -f2012-08-05 06:20:02
429998Third-Party ToolsfauliUNCONFIRMEDapp-portage/g-ctan-2011.1 blocks >=app-text/texlive-20122012-11-23 15:46:37
430132Core - Dependenciesdev-portageUNCONFIRMEDVersioned virtuals cause slot conflict when weak block dependencies could resolve with uninstall2012-08-08 07:44:32
430178Prefix SupportprefixUNCONFIRMEDnet-libs/libtirpc : port to Gentoo Prefix request2013-01-04 18:53:51
430564Applicationsmedia-videoUNCONFIRMEDmedia-video/devede - when converting mkv, devede passes an obsolete options to mencoder2012-08-09 23:46:58
430690EbuildsmattmUNCONFIRMEDnet-libs/wt-3.2.2 - Aborting due to QA concerns: 4 files installed in /tmp/portage/net-libs/wt-3.2.22012-09-17 06:33:36
430812Toolstools-portageUNCONFIRMEDapp-portage/gentoolkit - after recent binutils upgrade, revdep-rebuild did not catch libbfd-2.21.1.s2012-08-22 19:36:59
430862Ebuildsmaintainer-wantedUNCONFIRMEDx11-misc/pdfpc - a presenter console with multi-monitor support for PDF files2012-08-12 20:07:52
430912Core systemsystemdUNCONFIRMEDvirtual/init - add RDEPEND on sys-apps/systemd-sysv-utils2012-08-15 00:27:49
430928Ebuildsmaintainer-wantedUNCONFIRMEDnet-wireless/rtl8712-firmware: new ebuild2012-08-11 18:57:10
430960Applicationsmedia-videoUNCONFIRMEDmedia-video/vlc[vaapi] should depend on virtual/ffmpeg[vaapi]2013-01-26 17:56:56
431058Eclasses and ProfilespythonUNCONFIRMEDdev-util/gdbus-codegen-2.32.4 - /usr/portage/eclass/python-distutils-ng.eclass: line 206: syntax err2012-08-12 16:45:06
431080Toolsrobbat2UNCONFIRMEDapp-portage/g-cpan-0.16.4-r1 does not handle quotes in description properly2012-08-13 01:48:00
431082BugzillabugzillaUNCONFIRMEDIt is not possible to set attachment type/patch flag in expert mode enter_bug2012-08-12 13:58:16
431214CatalystcatalystUNCONFIRMEDdev-util/catalyst: add qemu support2012-08-16 21:52:46
431252Ebuildsnet-fsUNCONFIRMEDnet-fs/nfs-utils unable to run nfs client only (nfs4), without server support in kernel2012-08-14 12:57:57
431430LibraryfontsUNCONFIRMEDmedia-fonts/libertine-ttf-5.3.0.20120702 version bump2013-01-01 22:02:26
431484Coredev-portageUNCONFIRMEDsys-apps/portage-2.1.11.10 is slow2012-08-30 07:43:24
431566Ebuildsmaintainer-wantedUNCONFIRMEDdev-tex/blahtexml - Blahtex and Blahtexml: Converting TeX equations into MathML2012-08-17 23:46:19
431608Keywording and StabilizationpythonUNCONFIRMEDStabilize dev-python/virtualenvwrapper2013-01-04 01:17:32
431872Ebuildsmaintainer-wantedUNCONFIRMEDx11-terms/kmscon - Linux KMS/DRM based virtual Console Emulator2012-12-13 01:07:28
431912InstallCDreleaseUNCONFIRMEDinstall-x86-minimal-20120710.iso - boot hangs while looking for cdrom when encounters swap partition2013-02-21 02:38:59
431958Unclassifiedshell-toolsUNCONFIRMEDapp-shells/zsh-completion-20091203-r1 is broken because =sys-apps/portage-2.2.0_alpha121 does not in2013-01-28 08:57:32
431978Coredev-portageUNCONFIRMEDsys-apps/portage: FEATURES=preserve-libs missed dependency (libmpc.so.2) in /usr/libexec/gcc/x86_64-2012-12-25 20:59:53
432326EbuildspatrickUNCONFIRMEDapp-emulation/virtualbox-guest-additions should add group "vboxsf" to support automount shared folde2012-10-23 10:19:47
432418PrintingprintingUNCONFIRMEDnet-print/gutenprint should optionally support Epson printers2012-11-09 14:13:17
432620Enhancement/Feature Requestspms-bugsUNCONFIRMEDdobin: automatic support of EXEEXT2012-08-24 18:51:54
432712Ebuildsmaintainer-wantedUNCONFIRMEDsci-geosciences/gpx2svg – Convert GPX formatted geodata to Scalable Vector Graphics (SVG)2012-08-26 20:33:26
432884Ebuildspolynomial-cUNCONFIRMEDapp-emulation/virtualbox-modules: undeclared 'VM_RESERVED'2013-01-24 15:45:20
432964ApplicationspatrickUNCONFIRMEDwww-servers/apache - init.d script fails to detect server check/startup problem2013-02-16 13:23:59
432992Core - Ebuild Supportrobbat2UNCONFIRMEDsys-apps/portage-2.2.0_alpha121 breaks g-cpan (/etc/make.globals symlink is gone)2013-01-04 22:46:36
433070KDEkdeUNCONFIRMEDapp-editors/kile-2.1.2-r1 - index.docbook:124: parser error : Entity 'ged.vertaald' not defined2013-02-17 22:53:14
433171ApplicationserasUNCONFIRMEDnet-proxy/squid - add epatch_user support2012-09-02 18:19:17
433385LibrarysoundUNCONFIRMEDmedia-libs/nas-1.9.2 should depend on sys-devel/flex and sys-devel/bison (virtual/yacc?)2012-09-03 14:11:42
433511Enhancement/Feature Requestsdev-portageUNCONFIRMEDadd multilib support (from portage multilib branch in git) to master branch2012-11-06 06:43:19
433515Prefix SupportprefixUNCONFIRMEDemerge app-doc/NaturalDocs-1.52 : request Prefix support2012-10-10 12:41:47
433531Prefix SupportprefixUNCONFIRMEDfox.eclass: request for Prefix support2012-09-29 14:02:59
433864Ebuildsmaintainer-wantedUNCONFIRMEDapp-misc/format-junkie - a program that can convert your media files (audio files, videos and pictur2012-09-10 17:00:15
433942Applicationsnet-p2pUNCONFIRMEDnet-p2p/amule - amule fails to start when an empty ~/.aMule/statistics.dat file is present2012-09-04 15:33:37
434074KDEkdeUNCONFIRMEDkde-base/krossruby add ruby-1.9 support2012-09-07 13:39:08
434076KDEkdeUNCONFIRMEDkde-base/qtruby add ruby-1.9 support2012-09-07 14:02:46
434078KDEkdeUNCONFIRMEDkde-base/korundum add ruby-1.9 support2012-09-07 14:02:46
434110Applicationsrobbat2UNCONFIRMEDapp-admin/cancd-0.1.0-r2: netconsole init script fails to start due to wrong ifconfig path2012-09-06 14:20:31
434148GamesgamesUNCONFIRMEDgames-sports/vdrift version bump 2012-07-222012-12-20 19:10:16
434440PrintingprintingUNCONFIRMEDnet-print/cups-1.6.1 should pull in virtual/libusb:1 with USE=usb instead of libusb:02012-09-09 16:02:09
434496Toolstools-portageUNCONFIRMEDapp-portage/gentoolkit-0.3.0.6-r3 - equery crashes on unhandled exception portage.exception.InvalidD2012-09-10 06:45:50
434526Applicationsx11UNCONFIRMEDx11-base/xorg-server message should be updated since sets are in stable portage2012-10-26 06:41:59
434536Core systemtools-portageUNCONFIRMEDapp-portage/gentoolkit: revdep-rebuild doesn't handle USE=multislot2013-01-28 11:04:57
434574Toolstools-portageUNCONFIRMEDapp-portage/genlop: bashcomp script fails when make.conf is in /etc/portage/2012-12-13 16:13:07
434902EbuildsultrabugUNCONFIRMEDapp-admin/rsyslog - add proper kerberos init.d script support2012-10-29 16:10:32
434916ApplicationsbluenessUNCONFIRMEDapp-admin/webapp-config, SELinux support: set 'server-owned' file as rw content2012-09-21 18:37:35
435024Ebuildsmaintainer-wantedUNCONFIRMEDsys-fs/diskdevcmds-540.1 - HFS and HFS+ utils ported from OSX, supplies mkfs and fsck2012-09-14 14:23:28
435044Prefix SupportprefixUNCONFIRMEDbootstrap-prefix.txt fails on comilation of portage/app-editors/nano-2.3.1-r22012-10-01 14:08:25
435092GamesgamesUNCONFIRMEDgames-fps/quake2-data update - support expansion packs2012-09-15 04:21:45
435144Ebuildsmaintainer-wantedUNCONFIRMEDsci-electronics/bitscope-dso - a suite of high performance mixed signal virtual test, measurement an2012-09-16 16:13:50
435146Ebuildsmaintainer-wantedUNCONFIRMEDsci-electronics/bitscope-chart - a frequency and voltage logger designed for use with the BitScope P2012-09-16 15:52:10
435212BugzillabugzillaUNCONFIRMEDgentoo's bugzilla does not support xz compressed patches2012-11-28 14:34:32
435284Ebuildsmaintainer-wantedUNCONFIRMEDapp-text/pdf2htmlEX - A PDF to HTML converter2012-10-07 21:07:55
435304Unspecifiedrobbat2UNCONFIRMEDapp-portage/g-cpan-0.16.4-r1 generates broken ebuild depending on perl-g-cpan instead of dev-perl mo2013-02-21 07:50:32
435336Applicationsx11UNCONFIRMED>x11-base/xorg-server-1.9.5 - panning across virtual resolution does not work2012-12-06 21:04:54
435350DevelopmentradhermitUNCONFIRMEDcrossdev-20120721 msp430 target missing libcrt02012-09-19 08:59:37
435482GamesgamesUNCONFIRMEDgames-fps/rtcw-1.41b - error on game launch - ui/menddef.h not found2012-12-16 14:37:33
435528Prefix SupportprefixUNCONFIRMEDant-apache-bsf USE=javascript ~x64-macos prefix support2013-01-01 10:21:40
435596Ebuildsmaintainer-wantedUNCONFIRMEDdev-ruby/rainbow - extension to ruby's String class adding support for colorizing text on ANSI termi2012-10-03 17:50:28
435602Ebuildsmaintainer-wantedUNCONFIRMEDdev-ruby/sourcify - Workarounds before ruby-core officially supports Proc#to_source (& friends)2012-10-03 17:54:40
435620ApplicationsspingUNCONFIRMEDapp-portage/fetchcommandwrapper-0.7.1 has path "/etc/make.conf" hardcoded2012-09-20 14:44:27
435648FreeBSDbsdUNCONFIRMEDSegmentation fault always occurs when starting X, using later versions xf86-video-vesa-2.3.0-r12012-09-23 13:02:11
435660Ebuildsmaintainer-wantedUNCONFIRMEDx11-themes/beefy-miracle-background - Fedora's official background artwork2012-09-20 15:36:51
435762ApplicationsnirbheekUNCONFIRMEDnet-misc/networkmanager-0.9.6.0 disconnects shortly after establishing connection2012-10-26 23:03:17
436012JavajavaUNCONFIRMEDdev-java/ant-core-1.8.4-r1 can't override system properties for ant2012-09-23 18:13:25
436062Developmentrobbat2UNCONFIRMEDapp-portage/g-cpan - perl-gcpan/RT-Extension-Nginx-0.02 - mkdir /usr/etc: Permission denied at /usr/2012-09-24 11:14:58
436140GamesgamesUNCONFIRMEDgames-action/descent3 - updated ebuild to support installation from GOG package2012-09-24 22:54:46
436218EbuildsclusterUNCONFIRMEDnet-misc/pssh with dev-lang/python-3.2 - pssh --help: ImportError: No module named version2013-01-04 06:31:50
436266OpenRCopenrcUNCONFIRMEDsys-apps/openrc-0.9.8.4: start in LXC brings down lxc-initialized interface2012-10-05 14:00:02
436360Applicationspolynomial-cUNCONFIRMEDwww-client/seamonkey-2.12.1 - /bin/sh: line 1: 24652 Aborted .../work/comm-release/seamonk/suite/ins2012-09-28 14:44:46
436448Applicationsdesktop-miscUNCONFIRMEDx11-misc/parcellite-1.0.2_rc5 generates too many interrupts (as seen in powertop)2012-10-08 19:44:07
436744Eclasses and ProfilesvimUNCONFIRMEDvim.eclass - add lua support2013-01-16 08:12:28
436898Prefix SupportprefixUNCONFIRMEDnet-misc/connect-100 Interix support2012-10-02 00:52:10
436920Ebuildsmaintainer-wantedUNCONFIRMEDsci-electronics/smartsim: new ebuild2012-10-03 05:26:27
436986Applicationsrobbat2UNCONFIRMEDapp-portage/g-cpan - perl-gcpan/Finance-QuoteHist-1.16 attempts to pull in perl-gcpan/Date-Manip, ig2012-10-02 17:09:49
437106Ebuildsmaintainer-wantedUNCONFIRMEDapp-misc/stiki - a tool for reverting vandalism on Wikipedia2012-10-04 06:58:58
437114Core systembase-systemUNCONFIRMEDnet-misc/dhcp does not work on virtual machines that use virtio2012-10-04 03:36:06
437316Core systemtoolchainUNCONFIRMEDsys-devel/prelink-20120628: read-only files (mounts) trigger abort: Could not rename temporary to ..2013-01-23 11:03:37
437458InstallCDreleaseUNCONFIRMEDinstall-amd64-minimal-20120917.iso doesn't autodetect VirtIO blockdevice/network devices2012-12-16 06:09:55
437624Developmentdev-zeroUNCONFIRMED=dev-php/libvirt-php-0.4.6: too few arguments to function ‘set_error’2012-11-08 01:34:50
437894GamesgamesUNCONFIRMEDgames-emulation/virtualjaguar-1.0.7 -> 2.0.2 ebuild submission2013-02-10 05:05:50
437958ApplicationsxmwUNCONFIRMEDnet-misc/minidlna - add epatch_user support2012-10-11 13:47:33
437976Toolstools-portageUNCONFIRMEDProblems with "euse --active" from app-portage/gentoolkit-0.3.0.6-r32012-10-11 14:02:48
438084ApplicationspatrickUNCONFIRMEDwww-servers/apache-2.4 - add auth_form support2013-02-16 14:07:33
438164Unspecifiedpolynomial-cUNCONFIRMEDapp-emulation/virtualbox - EQ overflow in X server when virtualbox starts with Wacom tablet's mouse 2012-10-14 18:22:06
438262Core systemrobbat2UNCONFIRMEDsys-fs/lvm2-2.02.97 /etc/init.d/device-mapper does not support multi-line volumes in /etc/dmtab2013-01-28 12:11:27
438464UnspecifiedsysadminUNCONFIRMEDnet-analyzer/nagios-3.3.1: apache-2.4.3 fails to start with Syntax error on line 6 of /etc/apache2/2012-12-14 16:11:32
438620GNOMEgnomeUNCONFIRMEDdev-libs/glib-2.32.4-r1 - src_test(): FAIL: run-assert-msg-test.sh2012-10-17 17:36:06
438708ApplicationsroxUNCONFIRMED2012-10-17 14:29:58
438740ApplicationssciUNCONFIRMEDsci-misc/boinc - start /etc/init.d/boinc later2012-10-25 17:40:08
438816Coredev-portageUNCONFIRMEDsys-apps/portage-2.1.11.9 : /var/tmp/portage/._unmerge_/ directory not cleaned up2012-10-18 17:51:53
438848ApplicationsqtUNCONFIRMEDsci-astronomy/stellarium crashes/hangs on start: QEglContext::swapBuffers(): "Bad surface (0x300D)"2012-10-26 20:08:07
438872ApplicationslackUNCONFIRMEDapp-admin/gkrellm - chart rendering bug2012-10-19 15:01:23
438930Ebuildspolynomial-cUNCONFIRMEDapp-emulation/virtualbox-4.2 USE=vnc - vnc module is built but not installed2012-12-21 18:07:10
439344GNOMEgnomeUNCONFIRMEDdev-libs/glib USE=-utils should not install gtester-report man page2012-10-23 10:09:12
439406Ebuildsnet-p2pUNCONFIRMEDnet-p2p/amule - add epatch_user support2012-10-25 01:07:21
439540ApplicationscardoeUNCONFIRMEDapp-emulation/qemu fails to handle a usb serial port with a specific vendorid - qdev_prop_set: prope2013-02-10 17:43:13
439844EbuildsaballierUNCONFIRMEDmedia-libs/stk-4.4.4 - In file included from RtAudio.cpp:6750:0: include/soundcard.h:106:28: fatal e2013-01-23 16:33:32
440218Conceptual/Abstract Ideaspms-bugsUNCONFIRMEDportage should have a ebuild-accessible variable for the USE flags of previously-installed versions2012-10-30 16:30:36
440286Ebuildsnet-fsUNCONFIRMEDnet-nds/rpcbind - add support for warm restarts of rpcbind daemon2013-01-10 20:33:08
440302EbuildsswegenerUNCONFIRMEDnet-irc/irssi - support static-libs and proxy USE flags2012-12-15 13:36:01
440308DevelopmenttoolchainUNCONFIRMEDcross-avr/gcc-4.7.2 - libgcc/configure: /var/tmp/portage/cross-avr/gcc-4.7.2/work/build/./gcc/as: li2012-10-30 19:53:50
440420Toolsportage-utilsUNCONFIRMEDapp-portage/portage-utils-0.10: some elog messages should only be shown for the first install.2012-10-31 15:59:24
440532Applicationspolynomial-cUNCONFIRMEDapp-emulation/virtualbox-modules-4.1.22: some elog messages should only be shown when upgrading from2012-10-31 16:22:12
440960ApplicationsgraphicsUNCONFIRMEDmedia-gfx/wings crashes at startup with incorrect version of erl_driver.h2012-11-02 17:02:33
441610Ebuildsmaintainer-wantedUNCONFIRMEDsys-block/flashbench - Identifies the properties of SD cards and other media2012-11-04 18:48:03
441760Ebuildssci-geosciencesUNCONFIRMEDsci-geosciences/gpsd-3.7 - NameError: name 'gps_regress' is not defined: File "/var/tmp/portage/sc2012-11-07 02:15:55
441862ApplicationsalexxyUNCONFIRMEDsys-apps/gptfdisk-0.8.5 - In function `GPTPart::GetDescription()': gptpart.cc:(.text+0x179): undefin2013-02-12 11:55:19
442092ApplicationsspingUNCONFIRMEDmedia-gfx/gimp-9999 - Portage patch failed to apply (ltmain.sh version 2.4.2)!2012-11-10 00:24:49
442102genkernelgenkernelUNCONFIRMEDAdd bepo keymap support to genkernel2012-11-06 20:57:30
442104Ebuildsmaintainer-wantedUNCONFIRMEDsci-geosciences/osmconvert - Tool for converting and processing OpenStreetMap files2012-11-06 21:45:24
442162ApplicationsdjcUNCONFIRMEDnet-misc/openvpn-2.1.4 - src_install: rmdir: failed to remove ‘/var/tmp/portage/net-misc/openvpn-2.12012-11-07 14:09:59
442232Ebuildsmaintainer-wantedUNCONFIRMEDsys-fs/hammer-{linux,read} - a port of the HAMMER File System from DragonFly BSD2012-11-07 19:44:43
442294Ebuildsgnome-officeUNCONFIRMEDapp-office/dia-0.97.2 - Added support for >=gnome-3.002012-11-08 01:05:22
442346Applicationsmysql-bugsUNCONFIRMEDdev-db/mysql-5.5.28 - InnoDB: Assertion failure in thread 140230384047936 in file trx0rseg.c line 332012-11-08 22:04:30
442406Toolsportage-utilsUNCONFIRMEDapp-portage/portage-utils-0.10: 'qlop -c' should show current package order number2012-11-09 17:24:59
442544Applicationsshell-toolsUNCONFIRMEDapp-shells/bash-completion-1.3 - No support for XZ compression with Okular.2012-11-11 16:23:59
442594OpenRCopenrcUNCONFIRMEDsys-apps/openrc-0.11.4: ifconfig module doesn't support ipv6 routes without explicit prefix2012-12-25 09:18:25
442610ServerhollowUNCONFIRMEDwww-servers/nginx - Feature support request for dav-ext-module.2012-11-26 20:05:19
442874Applicationsnet-proxyUNCONFIRMEDnet-proxy/http-replicator - local rsync server reports install flash player as wrong size2012-11-14 00:16:31
442876Applicationspolynomial-cUNCONFIRMEDapp-emulation/virtualbox-4.2.4: after upgrade some VMs do not start anymore2013-01-02 19:55:58
442880EbuildssciUNCONFIRMED[science overlay] sci-libs/trilinos-10.12.2 - Version bump; install location fix; prefix support.2012-11-12 19:00:06
443480OpenRCopenrcUNCONFIRMEDsys-apps/openrc: iproute2 net module: add xfrm ( ipsec ) support2012-11-17 08:02:46
443498LibrarydilfridgeUNCONFIRMEDmedia-libs/opencv - python/src2/cv2.cpp:1: /usr/include/python2.7/pyport.h:849:2: ??????: #error "LO2013-02-04 22:23:56
443502EbuildssysadminUNCONFIRMEDnet-analyzer/nagios-plugins-1.4.16-r2 check_http Plugin does not support checking certificates2012-12-03 20:28:53
443630ApplicationsselinuxUNCONFIRMEDSELinux + >app-emulation/libvirt-0.9.13-r1 - Segfault starting qemu domains.2013-02-16 18:03:09
443744Toolstools-portageUNCONFIRMEDapp-portage/gentoolkit -- euse displays a lot of error messages on Gentoo/FreeBSD2012-11-19 09:11:08
443958Server Problemmirror-adminUNCONFIRMEDrsync.nl.gentoo.org / 195.241.77.98 (tiscali) often reports "@ERROR: max connections (15) reached --2012-11-19 21:19:27
444004Applicationsrobbat2UNCONFIRMEDapp-portage/g-cpan-0.16.4-r1 should use default $PORTDIR2013-02-15 13:12:08
444064Ebuildsx11UNCONFIRMEDvirtual/glu - sys-apps/paludis' cave fails to resolve a usable depset2012-11-20 18:00:08
444135Applicationsmaintainer-neededUNCONFIRMEDapp-misc/gpsdrive-2.11-r3 with boost-1.52.0-r3: /var/tmp/portage/app-misc/gpsdrive-2.11-r3/work/gpsd2013-01-11 19:10:30
444218ApplicationspatrickUNCONFIRMEDwww-servers/apache-2.4.3 - init script doesn't handle failed start correctly2013-02-16 13:19:08
444238Ebuildskernel-miscUNCONFIRMEDsys-kernel/linux-headers: Out of kernel builds seems not supported2012-11-23 04:59:46
444390ServersysadminUNCONFIRMEDnet-analyzer/nagios - Directory permissions for /etc/nagios are wrong, apache can't start2012-11-23 17:41:24
444442Applicationsx11UNCONFIRMEDx11-drivers/xf86-video-sis with xorg-server-1.13.0-r1 - X segfaults at startup2012-11-25 11:46:37
444448Third-Party Toolstools-portageUNCONFIRMEDapp-portage/genlop: 'genlop -i' should print last merge time too2012-11-23 15:57:18
444464Applicationspolynomial-cUNCONFIRMEDapp-emulation/virtualbox-4.1.22 - .../work/VirtualBox-4.1.22/src/VBox/Runtime/common/err/errmsg.sed 2012-12-23 18:15:49
444524DevelopmentembeddedUNCONFIRMEDcrossdev: emerge-wrapper: arm-unknown-linux-gnueabi-emerge virtual/init fail becaus of missing USE-f2012-11-26 17:26:27
444568PMS/EAPIpms-bugsUNCONFIRMED[Future EAPI] Export XDG_* variables in ebuild environment2013-01-03 05:44:14
444602ApplicationsvirtualizationUNCONFIRMEDapp-emulation/virtinst-0.600.3 - Exception in thread Checking storage allocation2013-02-16 18:03:56
444660Ebuildssci-geosciencesUNCONFIRMEDsci-geosciences/mapserver - add www-servers/nginx support(?)2012-12-02 12:31:33
444692ApplicationsxmwUNCONFIRMEDnet-misc/aiccu systemd support2012-12-27 21:50:10
444700Applicationsnet-p2pUNCONFIRMEDnet-p2p/rtorrent-0.9.2 could not start initscript2012-12-29 14:14:37
444808Applicationsandreis.vinogradovsUNCONFIRMEDapp-misc/hivex-1.3.6-r2 USE=ruby - rake aborted! / / cannot load such file -- rake/rdoctask2012-12-05 04:45:09
444932genkernelgenkernelUNCONFIRMEDsys-kernel/genkernel-3.4.45: no rtc support with newer kernels2013-02-20 03:36:21
444934genkernelgenkernelUNCONFIRMEDsys-kernel/genkernel-3.4.45: no support for iptables target LOG with gentoo-sources-3.5.72012-12-13 12:03:26
444964Applicationsx11UNCONFIRMEDx11-drivers/xf86-video-ati-7.0.0 with x11-base/xorg-server-1.13 - second X server fails to start on 2012-12-15 18:49:10
445004Ebuildsmaintainer-wantedUNCONFIRMEDapp-text/sgml-base - SGML infrastructure and SGML catalog file support2012-11-27 22:29:18
445014Ebuildsmaintainer-wantedUNCONFIRMEDdev-libs/xml-core - XML catalog infrastructure support2012-11-30 22:13:51
445120LibrarypatrickUNCONFIRMEDsys-libs/tdb-1.2.10 - Compilatin phase failed - [Errno 2] No such file or directory: '/var/tmp/porta2012-12-08 15:46:16
445132Core systemtoolchainUNCONFIRMEDsys-devel/gdb-7.5: build fails w/-ftracer on amd64: linux-x86-low.c:2939: Error: symbol 'start_i386_2012-11-29 19:36:23
445222Core systemkernelUNCONFIRMEDsys-kernel/vanilla-sources uli526x module incompatible with GART_IOMMU2012-12-11 12:37:18
445248Applicationstools-portageUNCONFIRMEDapp-portage/genlop-0.30.8-r2 - Package name comes too late.2012-11-30 12:00:23
445324KDEkdeUNCONFIRMEDkde-base/ksplash should depend on kde-base/kde-base-artwork2013-02-14 20:17:03
445540ApplicationstomjbeUNCONFIRMED>=app-backup/bacula-5.0.3 - Upstream doesn't officially support SQLite.2012-12-03 05:48:57
445722DevelopmentcppUNCONFIRMEDdev-libs/STLport-9999 - add a live ebuild2012-12-03 11:24:22
446016LibrarypythonUNCONFIRMEDdev-python/python-gnutls-1.2.4 does not support >=net-libs/gnutls-32012-12-05 01:13:29
446028Ebuildsmaintainer-wantedUNCONFIRMEDdev-python/python-backports-1.0.1 - Backported python features2012-12-06 08:27:46
446142EbuildsmattschUNCONFIRMEDnet-misc/openconnect-4.07 - after 30 minutes the VPN reconnects but only has a partially working con2013-01-09 13:33:21
446186Applicationsnet-p2pUNCONFIRMEDnet-p2p/rtorrent-0.9.2: bad configure check prevents cross-compilation2012-12-06 05:03:19
446198Ebuildsmaintainer-wantedUNCONFIRMEDdev-python/python-xcaplib-1.0.17 - Client for managing full or partial XML documents on XCAP servers2012-12-06 21:23:53
446204Core systemvapierUNCONFIRMEDsys-devel/crossdev: cross-emerge: support multiple parallel SYSROOTs for a single target2012-12-06 22:15:24
446275KDEkdeUNCONFIRMEDpython ABI deps support for system-config-printer-kde and printer-applet2012-12-11 14:07:52
446312ApplicationsxmwUNCONFIRMEDapp-shells/autojump-21.1.0 causes startDM.sh to segfault during system start2013-01-25 08:51:42
446344Core - Interface (emerge)dev-portageUNCONFIRMEDsys-apps/portage - `emerge --info' should include the rc_sys value of /etc/rc.conf2012-12-07 15:47:17
446356ApplicationssciUNCONFIRMEDsci-visualization/mayavi-4.2.0 - /var/tmp/portage/sci-visualization/mayavi-4.2.0/temp/environment: l2012-12-27 09:32:14
446498Core - Configurationdev-portageUNCONFIRMEDsys-apps/portage should handle typos in make.conf like those at the command line2012-12-08 17:10:05
446734EbuildshollowUNCONFIRMEDwww-servers/nginx - init script changes owner and mode of /var/log/nginx on each startup/restart2013-01-21 03:28:06
446934Eclasses and ProfileshattyaUNCONFIRMEDsubversion.eclass v1.83 drops local checkout if svn client fails (on transport errors)2012-12-12 01:48:29
447006Enhancement/Feature Requestsportage-utilsUNCONFIRMEDapp-portage/portage-utils' "qgrep" should parse multiple args over entire file for broader search re2012-12-12 17:20:02
447120Server Problemmirror-adminUNCONFIRMEDrsync://mirrors.eu.kernel.org/gentoo-portage/ out of sync2012-12-13 15:39:56
447280HardenedhardenedUNCONFIRMEDsys-apps/haveged readd support2012-12-14 20:01:22
447302Applicationspolynomial-cUNCONFIRMEDapp-emulation/virtualbox-modules-4.2.4 with gentoo-sources-3.7.0 - Header files were moved and re-or2013-02-03 19:32:07
447352Unspecifiedmaintainer-neededUNCONFIRMEDapp-laptop/tp_smapi-0.41 with kernel 3.7 - modprobe: FATAL: Error inserting tp_smapi (/lib/modules/32013-01-02 20:30:53
447356Unspecifiedpolynomial-cUNCONFIRMEDapp-emulation/virtualbox-modules-4.2.4 with kernel 3.7 - modprobe: FATAL: Error inserting vboxdrv (/2013-02-14 10:04:16
447436Applicationstools-portageUNCONFIRMED=app-portage/genlop-0.30.8-r2 - Use of uninitialized value in concatenation (.) or string at /usr/b2012-12-17 07:12:11
447530Ebuildsbase-systemUNCONFIRMEDnet-firewall/iptables[netlink] - please add support for loading fingerprint definitions from pf.os f2013-02-16 14:09:37
447534Applicationspolynomial-cUNCONFIRMEDapp-emulation/virtualbox-4.1.22-r1 - VBox/Runtime/common/string/strformatrt.cpp:829:19: internal com2012-12-23 18:30:14
447538Toolstools-portageUNCONFIRMED=app-portage/gentoolkit-0.3.0.7: equery doesn't report package description2012-12-17 01:10:30
447556Mac OSXprefixUNCONFIRMEDdev-python/virtualenv-1.8.4 emerge failed with error virtualenv-3.3 already exists2013-01-19 18:48:58
447656KDEkdeUNCONFIRMEDxinput --map-to-output 10 (pointer device) VGA1 (crtc) text cursor disappears and doesn't reappear u2012-12-28 13:57:55
447682Core systemhardened-kernelUNCONFIRMEDsys-kernel/hardened-sources-3.7.0 on ia64 - drivers/built-in.o: In function `show_yoffset': bgrt.c:(2012-12-19 09:12:02
447694Applicationsford_prefectUNCONFIRMEDmedia-sound/pulseaudio-2.99.3 USE=-system-wide - * Starting D-BUS system messagebus ... Unknown user2013-01-30 07:04:04
447780EbuildspatrickUNCONFIRMEDnet-analyzer/snort init scripts snort.rc1* still use opts variable2012-12-19 02:35:38
447996Applicationsldap-bugsUNCONFIRMEDnet-nds/openldap tries to start before net.eth0 and fails2012-12-22 13:00:56
448104DevelopmentperlUNCONFIRMEDdev-perl/PortageXS-0.02.10-r2 - test-suite fails - Cannot open file /etc/portage/make.conf at lib//P2012-12-24 09:37:14
448110DevelopmentsciUNCONFIRMEDdev-python/rpy-2.2.6-r1 fails test testInterruptR - AssertionError: True is not false2013-01-23 17:03:53
448138Coredev-portageUNCONFIRMEDsys-apps/portage no longer works with dev-lang/python-2.52012-12-22 07:22:48
448172Core systemtoolchainUNCONFIRMEDsys-devel/gcc-4.1.2 - /usr/lib64/libart_lgpl_2.so: could not read symbols: File in wrong format /// 2012-12-25 15:17:16
448206Core systemlu_zeroUNCONFIRMEDflag-o-matic.eclass: `CHOST=${CTARGET} strip-unsupported-flags` doesn't strip flags2013-01-07 17:18:12
448208EbuildsvoyageurUNCONFIRMEDsys-devel/{llvm,clang} support for C++11 (both), doxygen docs and python (clang) USE flags2013-02-02 22:02:57
448294Applicationspolynomial-cUNCONFIRMEDapp-emulation/virtualbox-4.2.6: cannot open shared object libstdc++.so.62012-12-24 10:19:17
448334Core systembase-systemUNCONFIRMEDsys-apps/hdparm: add support for disk id in /etc/init.d/hdparm2013-01-09 18:41:41
448698ApplicationsvoipUNCONFIRMEDnet-voip/ekiga wipes out ~/.config/ekiga.conf on start2012-12-26 23:42:19
448988LibraryswaponUNCONFIRMEDnet-libs/gsoap should support USE=ntlm2012-12-28 14:47:42
449352Gamesrich0UNCONFIRMEDgames-rpg/eternal-lands Assertion `self' failed (runtime error)2013-01-03 00:24:17
449436Applicationspolynomial-cUNCONFIRMEDapp-emulation/virtualbox-4.1.22-r1 - Checking for Mesa / GLU: Mesa not found at -L/usr/X11R6/lib 2012-12-31 16:33:12
449474Librarymaintainer-wantedUNCONFIRMEDdev-tex/fontpro - LaTeX support for Adobe's Pro opentype fonts2013-01-11 22:14:05
449512Third-Party ToolsdolsenUNCONFIRMEDapp-portage/porthole with python3 - File "/usr/lib/portage/pym/portage/__init__.py", line 224, in __2013-02-10 22:16:25
449716ApplicationsaballierUNCONFIRMEDnet-nntp/hellanzb.0.13-r8 - hellanzb.py: ImportError: cannot import name _NO_FILENO2013-01-02 10:57:50
449730Prefix SupportprefixUNCONFIRMEDapp-misc/fixdos: ~x64-macos and ~x86-linux prefix support2013-01-02 07:49:42
449732Prefix SupportprefixUNCONFIRMEDapp-misc/getopt: ~x86-linux prefix support2013-01-02 08:35:00
449776Serverldap-bugsUNCONFIRMEDnet-nds/openldap - add support for slapd-mdb backend2013-01-03 00:24:21
449780ApplicationssoundUNCONFIRMEDmedia-sound/exaile should support USE=dbus2013-01-03 00:19:45
449786Prefix SupportprefixUNCONFIRMEDPlease keyword dev-perl/Exporter-Lite and dev-perl/Sys-CPU on ~ppc-macos2013-01-02 17:26:29
449822Third-Party Toolstools-portageUNCONFIRMEDapp-portage/genlop - genlop -itc shows two emerge jobs when it is only one2013-01-03 00:07:55
449950Applicationsnet-dialupUNCONFIRMED=net-dialup/pptpd-1.3.4-r1 incorrect restart: no matching processes found2013-01-17 06:58:53
450084Keywording and StabilizationpythonUNCONFIRMEDPlease stabilize =dev-python/virtualenv-clone-0.2.42013-01-05 17:04:31
450326OpenRCopenrcUNCONFIRMEDsys-apps/openrc has no support for DHCPv62013-01-22 22:12:52
450452DevelopmentxfceUNCONFIRMED[xfce-dev overlay] xfce4-dev-tools-9999.ebuild -- portage patch fail2013-01-09 21:45:53
450536ServerhwoarangUNCONFIRMEDnet-ftp/vsftpd-3.0.2 prints warning: `vsftpd' uses 32-bit capabilities (legacy support in use) in ke2013-01-15 23:14:17
450772DevelopmentvoyageurUNCONFIRMEDsys-devel/llvm-9999 - subversion: can't fetch to /var/portage/distfiles/svn-src/llvm/trunk from http2013-01-09 19:43:43
450912Ebuildsmaintainer-wantedUNCONFIRMEDsci-libs/pg2plplot - Assist the transition from PGPlot to PLplot in Fortran programs2013-01-08 17:10:27
450986JavajavaUNCONFIRMEDNew Tomcat init script does not respect catalina.properties2013-02-04 16:01:01
451056DevelopmentjsbronderUNCONFIRMEDsys-cluster/mpich2-1.2.1_p1-r1 fails to crosscompile: configure: error: Unable to determine Fortran 2013-01-09 15:17:48
451080Enhancement/Feature Requestsdev-portageUNCONFIRMEDsys-apps/portage emerge.log should record fetch time2013-01-10 17:15:32
451326Corelu_zeroUNCONFIRMEDapp-emulation/qemu-user-1.1.0-r1: "qemu: Unsupported syscall: 373" for epoll syscall inside arm chro2013-01-20 17:32:15
451340Ebuildsmaintainer-wantedUNCONFIRMEDapp-office/elyxer: a LyX to HTML converter2013-01-11 16:28:57
451394Applicationsrobbat2UNCONFIRMEDsci-mathematics/nusmv-2.5.2 USE=minisat - SolverTypes.h:126:56: error: cast from 'void*' to 'int' lo2013-01-12 16:25:09
451478Core systemrobbat2UNCONFIRMEDsys-fs/lvm2 - /etc/init.d/lvm should support multiple volume groups - Command failed with status cod2013-01-31 02:20:00
451524Applicationssci-mathematicsUNCONFIRMEDsci-mathematics/octave-3.6.3 - libcruft/.libs/libcruft.so: undefined reference to `_gfortran_transfe2013-02-12 03:35:50
451574ApplicationsdjcUNCONFIRMEDnet-misc/openvpn-2.2.2: cannot open ifconfig-pool-persist file on startup2013-01-13 10:36:53
451584ApplicationscardoeUNCONFIRMEDapp-emulation/libvirt-1.0.1 - does not start LXC VM2013-02-05 17:25:51
451966Applicationsrobbat2UNCONFIRMEDapp-misc/g15daemon start-stop-daemon: fopen `/var/run/g15daemon.pid': No such file or directory2013-01-15 12:27:28
451978ApplicationsnaotaUNCONFIRMEDmedia-video/v4l2loopback-0.6.2 - Version bump to support kernel 3.72013-01-14 22:49:56
452190GamesgamesUNCONFIRMEDdownload links to rtlights in games-fps/darkplaces are down2013-01-22 18:38:53
452464GNOMEgnomeUNCONFIRMEDmedia-video/totem-3.6.x: nautilus warning: libtotem-properties-page.so: undefined symbol: bacon_vide2013-01-16 18:49:29
452578DevelopmentyamakuzureUNCONFIRMED[seden overlay] dev-util/eclipse-sdk-3.7.1-r9 fails to start when 2013-01-17 09:24:25
452618DevelopmentyamakuzureUNCONFIRMED[seden overlay] dev-util/eclipse-sdk-3.7.1-r10 - Bug fixes regarding incorrectly slotted virtual/jdk2013-01-17 17:45:18
452898DevmanualdevmanualUNCONFIRMEDPortage only does dependency checking on the latest slot2013-01-21 15:46:28
452910Core systemsystemdUNCONFIRMEDsys-apps/systemd-196[python] needs dev-python/pygobject:3 - ImportError: No module named gi.reposito2013-01-20 17:07:04
453020ApplicationstommyUNCONFIRMEDdev-vcs/subversion, please consider patch to fix paths reported for externals2013-01-19 19:26:52
453264All ISOreleaseUNCONFIRMEDFirewire hard drive support missing from Alpha install CD2013-01-21 01:54:43
453272LibraryalexxyUNCONFIRMEDdev-python/rtslib snapshot request2013-01-21 12:28:47
453278Core systemsystemdUNCONFIRMEDsys-apps/systemd - please port netcfg from Arch Linux for easier network configuration2013-01-21 20:21:49
453360[RU]docs-teamUNCONFIRMEDChange "??????" to Portage2013-01-21 15:56:55
453392GNOMEgnomeUNCONFIRMEDgnome-base/gdm-3.6 USE=plymouth prevents the automatic switch to vt7 on startup2013-02-12 09:11:09
453514Core systemtoolchainUNCONFIRMEDsys-libs/glibc-2.15-r3: nscd initscript fails while daemon starts2013-01-22 22:51:57
453516ApplicationspatrickUNCONFIRMEDapp-emulation/virtualbox-bin-4.2.6 - can not use Bridged Adapter in network config2013-01-23 14:33:55
453674Third-Party Toolstools-portageUNCONFIRMEDapp-portage/ufed: Shortening/cleaning flag descriptions by eliminating "[Enables/Adds/Includes] Supp2013-01-23 13:44:40
453774Third-Party Toolstools-portageUNCONFIRMEDapp-portage/genlop-9999: -u option does not filter2013-01-24 08:29:43
453780Applicationskondor6cUNCONFIRMEDwww-client/elinks-0.12_pre5-r2 USE=javascript with spidermonkey-1.8.5-r1 - elinks freezes on startup2013-02-01 11:12:46
453804JavajavaUNCONFIRMEDCreate ebuilds for jdk 8 (early access release), a current Java 8 partial implementation2013-01-24 12:02:05
453834Unclassifieddev-portageUNCONFIRMEDsys-apps/portage-2.1.11.xy - (anger at) handling of dir symlinks2013-01-24 20:23:11
453842GNOMEgnomeUNCONFIRMED[PATCH] gnome-base/gnome-shell-3.6.2-r1: Fix partialy memory leaks issues2013-02-12 09:35:27
453880Applicationsnet-fsUNCONFIRMEDnet-fs/autofs-5.0.6-r5: fails to stop and to start:2013-02-16 13:22:48
453900ApplicationssoundUNCONFIRMEDmedia-sound/abcde should depend on virtual/perl-Digest-SHA2013-01-26 01:40:48
453954DevelopmentpythonUNCONFIRMEDdev-python/psycopg - add python 3.3 support2013-01-26 15:33:56
454094Otherdocs-teamUNCONFIRMED[fa] /xml/htdocs/doc/fa/inserts.xml2013-01-26 02:34:07
454120OpenRCopenrcUNCONFIRMEDsys-apps/openrc-0.11.8: Service XY stop makes other services stop, but consequent start of XY leaves2013-01-26 09:43:51
454218CVS/SVN/Gitinfra-bugsUNCONFIRMEDUnconfirmed reports of anonvcs (specifically cvs) failing to sync entirely2013-01-26 22:06:35
454298Ebuildssci-mathematicsUNCONFIRMEDsci-mathematics/maxima - maxima cannot be started from wxmaxima or cantor2013-02-04 03:36:37
454460ApplicationsmozillaUNCONFIRMEDwww-client/firefox-18.0.1: undefined reference to `WebRtcAecm_WindowAndFFTNeon'2013-01-30 20:14:08
454492Toolstools-portageUNCONFIRMEDapp-portage/gentoolkit-0.3.0.7 - eclean-dist: UnboundLocalError: local variable 'cleaner' referenced2013-01-29 17:40:16
454582Ebuildsmaintainer-wantedUNCONFIRMEDnet-fs/davenport - an SMB WebDAV front end for SAMBA2013-01-29 22:57:35
454604Third-Party ToolsdolsenUNCONFIRMEDapp-portage/layman feature requests2013-01-30 02:01:26
454746Core systemrobbat2UNCONFIRMEDsys-fs/lvm2-2.02.97-r1, sys-fs/udev-197-r4: /dev/mapper entries absent for dm-crypt partitions mount2013-02-04 01:37:50
454808LibrarygnomeUNCONFIRMEDnet-libs/webkit-gtk-1.10.2-r300 - File "./Tools/Scripts/run-gtk-tests", line 168: Could not start ac2013-02-08 00:08:40
454900Developmentdev-zeroUNCONFIRMEDdev-php/libvirt-php-0.4.7 version bump and patches2013-02-04 09:50:47
455048Eclasses and ProfilesmgornyUNCONFIRMED[git-2.eclass] Add support for submodules in non-bare clones.2013-02-02 21:35:22
455222GNOMEgnomeUNCONFIRMEDnet-libs/webkit-gtk - add support for XT PaX marking2013-02-09 20:41:04
455238LibraryprintingUNCONFIRMEDmedia-libs/vigra-1.7.1-r1 failed (compile phase): ImportError: No module named nose2013-02-05 01:00:18
455282LibrarytitanofoldUNCONFIRMEDdev-libs/libpqxx-4.0.1 with python 3.x - TypeError: 'str' does not support the buffer interface2013-02-19 08:19:43
455518genkernelgenkernelUNCONFIRMEDsys-kernel/genkernel does not suppert hex numbers in root= kernel commandline2013-02-05 12:30:20
455582ServerclusterUNCONFIRMEDsys-cluster/ceph should be started before netmount2013-02-05 12:25:27
455632ApplicationsjdhoreUNCONFIRMEDsys-apps/lm_sensors: should support systemd2013-02-05 19:45:47
455636ApplicationscardoeUNCONFIRMEDapp-emulation/libvirt-1.0.2 USE=-libvirtd - node_device/node_device_udev.c:1608:37: error: unknown t2013-02-05 21:55:17
455830Developmentdev-embeddedUNCONFIRMEDadd support for atxmega16a4u / atxmega32a4u2013-02-08 05:48:56
455890Core systemlivecdUNCONFIRMEDsys-block/parted - parted binary should be installed in /usr/bin2013-02-07 02:12:12
455938GNOMEgnomeUNCONFIRMED=gnome-base/gdm-3.6* - Fails to start when access to /proc is restricted.2013-02-07 02:11:03
455986ApplicationsvoyageurUNCONFIRMEDnet-misc/gogoc - Introduce warning when bridge support is missing in kernel2013-02-07 11:47:29
455990Applicationsbase-systemUNCONFIRMEDapp-shells/bash=4.2_p37 - segfault when script aborted - *** glibc detected *** double free or corru2013-02-08 23:10:35
456048ServerultrabugUNCONFIRMEDwww-servers/uwsgi-1.4.5 init script race condition if starting multiple uwsgi instances with differe2013-02-07 16:47:54
456230KDEkdeUNCONFIRMEDapp-cdr/k3b-2.0.2-r4: complains about "process can't started. Calling of In/Output module not possib2013-02-10 15:13:30
456270Enhancement/Feature Requestsdev-portageUNCONFIRMEDExpand portage acceptable version specifiers2013-02-18 04:33:36
456308Core systembase-systemUNCONFIRMEDgrub2 won't launch memtest86 and memtest86+ if / and /boot are separated partitions and grub2 graphi2013-02-13 22:19:39
456354Applicationspolynomial-cUNCONFIRMEDapp-emulation/virtualbox-4.2.6-r1 fails to build. kmk_builtin_mv shows options help. kmk error 642013-02-11 17:25:35
456780LibrarygraphicsUNCONFIRMEDmedia-libs/icclib-2.14: iccdump segfaults on startup2013-02-12 15:13:03
456784ApplicationslxnayUNCONFIRMED[sabayon overlay] net-wireless/blueman-1.23-r2: Failed Patch: blueman-1.21-fix-segfault-startup.patc2013-02-12 15:10:18
456846ApplicationscardoeUNCONFIRMEDapp-emulation/libvirt-1.0.2-r1 has broken python bindings2013-02-12 22:17:07
456908Core systempam-bugsUNCONFIRMEDsys-libs/pam-1.1.6-r2: /usr/lib64/portage/bin/isolated-functions.sh: line 215: wait: `Failed Running2013-02-16 21:10:14
456912Core systemtoolchainUNCONFIRMEDsys-libs/glibc-2.17 - remove patch 6600_mips_librt-mips.patch2013-02-18 19:15:45
456922UnspecifiedhardenedUNCONFIRMEDUnable to start any java-vm on hardened gentoo icedtea-bin-6.1.11.5: Could not reserve enough space 2013-02-13 15:13:44
456980ApplicationsopenofficeUNCONFIRMEDapp-office/libreoffice-4.0.0.3 - inserting movie or sound in impress fails with "The format of the s2013-02-13 19:08:21
457104KernelsecurityUNCONFIRMEDDriver of cypress corrupts file-system and partition table of external hard drives with M6116 SATA B2013-02-14 15:53:16
457172Eclasses and ProfilesmaxUNCONFIRMEDssl-cert.eclass should use more secure defaults for crypto functions / keylengths2013-02-19 06:49:28
457504EbuildstomjbeUNCONFIRMEDapp-backup/bacula-5.2.12: add support for installing examples into docdir2013-02-14 15:48:10
457546Ebuildsmaintainer-wantedUNCONFIRMEDNew ebuild: dev-db/torndb-0.1 - A lightweight wrapper around MySQLdb. Originally part of the Tornado2013-02-14 15:34:22
457670Otherdocs-teamUNCONFIRMED[fa] handbook/hb-net-start.xml2013-02-15 08:34:05
457678Enhancement/Feature RequestssecurityUNCONFIRMEDAdd security information to the portage tree2013-02-15 16:57:18
457708Core systemhardened-kernelUNCONFIRMEDapp-emulation/virtualbox-4.{1.22,2.6}-r1 on sys-kernel/hardened-sources - Can't start virtual machin2013-02-16 21:53:53
457726Third-Party Toolstools-portageUNCONFIRMEDapp-portage/layman-2.0.0 - buggy quiet mode2013-02-15 16:56:10
457732KDEkdeUNCONFIRMEDkde-base/kwin - Hyperthreading enabled + Java = Kwin unresponsive2013-02-17 17:49:19
457768Core systembase-systemUNCONFIRMEDeselect-sh should be pulled in by @system or virtual/shell or app-shells/* or (...)2013-02-18 05:52:51
457770ApplicationsprefixUNCONFIRMEDdev-lang/R not linking to correct (Prefix) gfortran library2013-02-18 19:16:23
457798ApplicationsbillieUNCONFIRMEDapp-portage/pfl-2.3-r2: cron-script doesn't run since 'python2' is not supported.2013-02-20 18:57:15
457876Applicationsmaintainer-neededUNCONFIRMEDmedia-gfx/argyllcms - drop toolchain-funcs and virtual/pkgconfig2013-02-17 17:50:06
457968Third-Party ToolsmpaganoUNCONFIRMEDapp-portage/portpeek overlooks some(?) package atom(s)2013-02-17 17:03:04
458034ApplicationsjsbronderUNCONFIRMEDnet-nntp/sabnzbd-0.7.11 initscript always reports crashed status2013-02-19 20:05:09
458066ApplicationsangelosUNCONFIRMEDmedia-sound/xnoise-9999 (and possibly other versions) should depend on certain gst-plugins-*-package2013-02-19 20:18:26
458104PrintingprintingUNCONFIRMEDapp-text/acroread-9.5.1-r1 - acroread creates $HOME/fontconfig directory on startup2013-02-18 13:45:46
458108Applicationsbug-wranglersUNCONFIRMEDvirtual/ssh-askpass package that manages the /usr/lib/ssh-askpass link2013-02-21 12:29:46
458176DevelopmentcalchanUNCONFIRMEDdev-lang/R - USE=X should not manage both X11 driver support and HTTP-Help support2013-02-21 06:57:03
458254ApplicationsvoyageurUNCONFIRMEDapp-cdr/cdrtools-3.01_alpha12 with sys-devel/clang-3.2 - sha2.c:1006:2: error: call to 'SHA384Pad' i2013-02-21 02:51:12
458262baselayoutrobbat2UNCONFIRMEDsys-fs/lvm2 Failed to find sysfs mount point when starting2013-02-20 16:20:15
458284Core - Dependenciesdev-portageUNCONFIRMEDsys-apps/portage-2.1.11.52: 'emerge --depclean' does not remove old gentoo-sources2013-02-20 11:35:04
458346Ebuildsmaintainer-wantedUNCONFIRMEDdev-db/libodb-boost - ODB boost support library (dependency of dev-db/odb)2013-02-19 22:10:48
458366Ebuildsmaintainer-wantedUNCONFIRMEDdev-db/libodb-qt - ODB Qt support library (dependency of dev-db/odb)2013-02-20 13:24:27
458380LibraryphosphanUNCONFIRMEDmedia-libs/jasper: ebuild patch for multilib support2013-02-20 21:19:41
458386ApplicationsbugsUNCONFIRMEDapp-admin/collectd-5.2.0 - Assert error in VSM_n_Arg(), [...]/work/varnish-3.0.3/lib/libvarnishapi/v2013-02-20 14:29:22
458440ApplicationspatrickUNCONFIRMEDapp-office/openerp-6.1.1-r1 USE=-postgres - sed: can't read /var/tmp/portage/app-office/openerp-6.1.2013-02-20 15:16:18
458464Core - Interface (emerge)dev-portageUNCONFIRMEDsys-apps/portage-2.1.11.50: no way to JUST DAMN INSTALL a package2013-02-21 04:04:32
458468ApplicationssoundUNCONFIRMEDmedia-sound/easytag-2.1.8-r1 with experimental gtk3 support2013-02-20 15:11:47
458514ApplicationsxboxUNCONFIRMEDmedia-tv/xbmc USE=airplay should depend on net-dns/avahi[dbus] and media-libs/libshairport2013-02-21 12:39:06
458546Ebuildsbug-wranglersUNCONFIRMEDtortoisehg requires "svg" use flag2013-02-21 07:58:25
458568Applicationsbug-wranglersUNCONFIRMEDUdisks2 fails to mount flash drive when ACL isn't supported in kernel2013-02-21 13:23:05
458570FreeBSDbsdUNCONFIRMEDfreebsd.eclass: please add svn ebuild support2013-02-21 11:37:52


back



Support us on Content Nation

New Packages

- as rdf newsfeed
- as rss newsfeed
- as Atom newsfeed
2024-07-13
PyQt-builder - 1.16.4
Ebuild name:

dev-python/PyQt-builder-1.16.4

Description

The PEP 517 compliant PyQt build system

Added to portage

2024-07-13

conky - 1.21.4
Ebuild name:

app-admin/conky-1.21.4

Description

An advanced, highly configurable system monitor for X

Added to portage

2024-07-13

gcc - 11.4.1_p20240712
Ebuild name:

sys-devel/gcc-11.4.1_p20240712

Description

The GNU Compiler Collection

Added to portage

2024-07-13

gcc - 12.4.1_p20240711
Ebuild name:

sys-devel/gcc-12.4.1_p20240711

Description

The GNU Compiler Collection

Added to portage

2024-07-13

gcc - 13.3.1_p20240712
Ebuild name:

sys-devel/gcc-13.3.1_p20240712

Description

The GNU Compiler Collection

Added to portage

2024-07-13

incus - 6.3-r1
Ebuild name:

app-containers/incus-6.3-r1

Description

Modern, secure and powerful system container and virtual machine manage

Added to portage

2024-07-13

konsole - 24.05.2-r1
Ebuild name:

kde-apps/konsole-24.05.2-r1

Description

KDE's terminal emulator

Added to portage

2024-07-13

mercurial - 6.8
Ebuild name:

dev-vcs/mercurial-6.8

Description

Scalable distributed SCM

Added to portage

2024-07-13

obs-studio - 30.2.0
Ebuild name:

media-video/obs-studio-30.2.0

Description

Software for Recording and Streaming Live Video Content

Added to portage

2024-07-13

speed-dreams - 2.3.0-r1
Ebuild name:

games-sports/speed-dreams-2.3.0-r1

Description

Fork of the famous open racing car simulator TORCS

Added to portage

2024-07-13

tokodon - 24.05.2-r2
Ebuild name:

net-im/tokodon-24.05.2-r2

Description

Mastodon client for Plasma and Plasma Mobile

Added to portage

2024-07-13

yubikey-manager - 5.5.1
Ebuild name:

app-crypt/yubikey-manager-5.5.1

Description

Python library and command line tool for configuring a YubiKey

Added to portage

2024-07-13

yubikey-manager-qt - 1.2.5
Ebuild name:

app-crypt/yubikey-manager-qt-1.2.5

Description

Cross-platform application for configuring any YubiKey over all

Added to portage

2024-07-13

yubioath-flutter-bin - 6.1.0-r3
Ebuild name:

app-crypt/yubioath-flutter-bin-6.1.0-r3

Description

Yubico Authenticator for TOTP

Added to portage

2024-07-13

yubioath-flutter-bin - 6.4.0-r1
Ebuild name:

app-crypt/yubioath-flutter-bin-6.4.0-r1

Description

Yubico Authenticator for TOTP

Added to portage

2024-07-13

yubioath-flutter-bin - 7.0.0
Ebuild name:

app-crypt/yubioath-flutter-bin-7.0.0

Description

Yubico Authenticator for TOTP

Added to portage

2024-07-13

2024-07-12
PyQt5-sip - 12.15.0
Ebuild name:

dev-python/PyQt5-sip-12.15.0

Description

sip extension module for PyQt5

Added to portage

2024-07-12

PyQt6-sip - 13.8.0
Ebuild name:

dev-python/PyQt6-sip-13.8.0

Description

sip module support for PyQt6

Added to portage

2024-07-12

asteval - 1.0.1
Ebuild name:

dev-python/asteval-1.0.1

Description

Evaluator of Python expression using ast module

Added to portage

2024-07-12

astroid - 3.2.3
Ebuild name:

dev-python/astroid-3.2.3

Description

Abstract Syntax Tree for logilab packages

Added to portage

2024-07-12

attica - 6.4.0
Ebuild name:

kde-frameworks/attica-6.4.0

Description

Framework providing access to Open Collaboration Services

Added to portage

2024-07-12

automake - 1.17-r1
Ebuild name:

dev-build/automake-1.17-r1

Description

Used to generate Makefile.in from Makefile.am

Added to portage

2024-07-12

automake-vanilla - 1.17
Ebuild name:

dev-build/automake-vanilla-1.17

Description

Used to generate Makefile.in from Makefile.am

Added to portage

2024-07-12

baloo - 6.4.0
Ebuild name:

kde-frameworks/baloo-6.4.0

Description

Framework for searching and managing metadata

Added to portage

2024-07-12

bluez-qt - 6.4.0
Ebuild name:

kde-frameworks/bluez-qt-6.4.0

Description

Qt wrapper for Bluez 5 DBus API

Added to portage

2024-07-12

breeze-icons - 6.4.0
Ebuild name:

kde-frameworks/breeze-icons-6.4.0

Description

Breeze SVG icon theme

Added to portage

2024-07-12

cattrs - 23.2.4_pre20240627
Ebuild name:

dev-python/cattrs-23.2.4_pre20240627

Description

Composable complex class support for attrs and dataclasses

Added to portage

2024-07-12

cfn-lint - 1.6.0
Ebuild name:

dev-python/cfn-lint-1.6.0

Description

CloudFormation Linter

Added to portage

2024-07-12

claws-mail - 3.21.0-r1
Ebuild name:

mail-client/claws-mail-3.21.0-r1

Description

An email client (and news reader) based on GTK+

Added to portage

2024-07-12

colored-traceback - 0.4.1
Ebuild name:

dev-python/colored-traceback-0.4.1

Description

Automatically color Python's uncaught exception tracebacks

Added to portage

2024-07-12

coverage - 7.6.0
Ebuild name:

dev-python/coverage-7.6.0

Description

Code coverage measurement for Python

Added to portage

2024-07-12

crystal - 1.13.0
Ebuild name:

dev-lang/crystal-1.13.0

Description

The Crystal Programming Language

Added to portage

2024-07-12

database_cleaner-active_record - 2.2.0
Ebuild name:

dev-ruby/database_cleaner-active_record-2.2.0

Description

Strategies for cleaning databases using ActiveRecord

Added to portage

2024-07-12

devcontainer - 0.66.0
Ebuild name:

app-containers/devcontainer-0.66.0

Description

Reference implementation of the Development Containers specifica

Added to portage

2024-07-12

element - 1.11.70
Ebuild name:

www-apps/element-1.11.70

Description

A glossy Matrix collaboration client for the web

Added to portage

2024-07-12

ena-driver - 2.12.3
Ebuild name:

net-misc/ena-driver-2.12.3

Description

Amazon EC2 Elastic Network Adapter (ENA) kernel driver

Added to portage

2024-07-12

executing - 2.0.2_pre20240626
Ebuild name:

dev-python/executing-2.0.2_pre20240626

Description

Get information about what a Python frame is currently doing

Added to portage

2024-07-12

extra-cmake-modules - 6.4.0
Ebuild name:

kde-frameworks/extra-cmake-modules-6.4.0

Description

Extra modules and scripts for CMake

Added to portage

2024-07-12

fantomas - 6.3.10
Ebuild name:

dev-dotnet/fantomas-6.3.10

Description

FSharp source code formatter

Added to portage

2024-07-12

frameworkintegration - 6.4.0
Ebuild name:

kde-frameworks/frameworkintegration-6.4.0

Description

Framework for integrating Qt applications with KDE Plasma

Added to portage

2024-07-12

gnubiff - 2.2.17-r3
Ebuild name:

net-mail/gnubiff-2.2.17-r3

Description

A mail notification program

Added to portage

2024-07-12

haproxy - 3.0.3
Ebuild name:

net-proxy/haproxy-3.0.3

Description

A TCP/HTTP reverse proxy for high availability environments

Added to portage

2024-07-12

hcloud - 1.44.2
Ebuild name:

app-admin/hcloud-1.44.2

Description

A command-line interface for Hetzner Cloud

Added to portage

2024-07-12

httpd-cgi - 0-r5
Ebuild name:

virtual/httpd-cgi-0-r5

Description

Virtual for CGI-enabled webservers

Added to portage

2024-07-12

hypothesis - 6.106.0
Ebuild name:

dev-python/hypothesis-6.106.0

Description

A library for property based testing

Added to portage

2024-07-12

incus - 6.0.1-r1
Ebuild name:

app-containers/incus-6.0.1-r1

Description

Modern, secure and powerful system container and virtual machine mana

Added to portage

2024-07-12

irc - 20.4.2
Ebuild name:

dev-python/irc-20.4.2

Description

IRC client framework written in Python

Added to portage

2024-07-12

itunespy - 1.6.1
Ebuild name:

dev-python/itunespy-1.6.1

Description

A simple library to fetch data from the iTunes Store API

Added to portage

2024-07-12

karchive - 6.4.0
Ebuild name:

kde-frameworks/karchive-6.4.0

Description

Framework for reading, creation, and manipulation of various archive

Added to portage

2024-07-12

kauth - 6.4.0
Ebuild name:

kde-frameworks/kauth-6.4.0

Description

Framework to let applications perform actions as a privileged user

Added to portage

2024-07-12

kbookmarks - 6.4.0
Ebuild name:

kde-frameworks/kbookmarks-6.4.0

Description

Framework for managing bookmarks stored in XBEL format

Added to portage

2024-07-12

kcalendarcore - 6.4.0
Ebuild name:

kde-frameworks/kcalendarcore-6.4.0

Description

Library for interfacing with calendars

Added to portage

2024-07-12

kcmutils - 6.4.0
Ebuild name:

kde-frameworks/kcmutils-6.4.0

Description

Framework to work with KDE System Settings modules

Added to portage

2024-07-12

kcodecs - 6.4.0
Ebuild name:

kde-frameworks/kcodecs-6.4.0

Description

Framework for manipulating strings using various encodings

Added to portage

2024-07-12

kcolorscheme - 6.4.0
Ebuild name:

kde-frameworks/kcolorscheme-6.4.0

Description

Framework for downloading and sharing additional application data

Added to portage

2024-07-12

kcompletion - 6.4.0
Ebuild name:

kde-frameworks/kcompletion-6.4.0

Description

Framework for common completion tasks such as filename or URL comp

Added to portage

2024-07-12

kconfig - 6.4.0
Ebuild name:

kde-frameworks/kconfig-6.4.0

Description

Framework for reading and writing configuration

Added to portage

2024-07-12

kconfigwidgets - 6.4.0
Ebuild name:

kde-frameworks/kconfigwidgets-6.4.0

Description

Framework providing an assortment of configuration-related widg

Added to portage

2024-07-12

kcontacts - 6.4.0
Ebuild name:

kde-frameworks/kcontacts-6.4.0

Description

Address book API based on KDE Frameworks

Added to portage

2024-07-12

kcoreaddons - 6.4.0
Ebuild name:

kde-frameworks/kcoreaddons-6.4.0

Description

Framework for solving common problems such as caching, randomisati

Added to portage

2024-07-12

kcrash - 6.4.0
Ebuild name:

kde-frameworks/kcrash-6.4.0

Description

Framework for intercepting and handling application crashes

Added to portage

2024-07-12

kdav - 6.4.0
Ebuild name:

kde-frameworks/kdav-6.4.0

Description

DAV protocol implemention with KJobs

Added to portage

2024-07-12

kdbusaddons - 6.4.0
Ebuild name:

kde-frameworks/kdbusaddons-6.4.0

Description

Framework for registering services and applications per freedeskto

Added to portage

2024-07-12

kdeclarative - 6.4.0
Ebuild name:

kde-frameworks/kdeclarative-6.4.0

Description

Framework providing integration of QML and KDE work spaces

Added to portage

2024-07-12

kded - 6.4.0
Ebuild name:

kde-frameworks/kded-6.4.0

Description

Central daemon of KDE workspaces

Added to portage

2024-07-12

kdesu - 6.4.0
Ebuild name:

kde-frameworks/kdesu-6.4.0

Description

Framework to handle super user actions

Added to portage

2024-07-12

kdnssd - 6.4.0
Ebuild name:

kde-frameworks/kdnssd-6.4.0

Description

Framework for network service discovery using Zeroconf

Added to portage

2024-07-12

kdoctools - 6.4.0
Ebuild name:

kde-frameworks/kdoctools-6.4.0

Description

Tools to generate documentation in various formats from DocBook file

Added to portage

2024-07-12

kfilemetadata - 6.4.0
Ebuild name:

kde-frameworks/kfilemetadata-6.4.0

Description

Library for extracting file metadata

Added to portage

2024-07-12

kglobalaccel - 6.4.0
Ebuild name:

kde-frameworks/kglobalaccel-6.4.0

Description

Framework to handle global shortcuts

Added to portage

2024-07-12

kguiaddons - 6.4.0
Ebuild name:

kde-frameworks/kguiaddons-6.4.0

Description

Framework providing assorted high-level user interface components

Added to portage

2024-07-12

kholidays - 6.4.0
Ebuild name:

kde-frameworks/kholidays-6.4.0

Description

Library to determine holidays and other special events for a geograp

Added to portage

2024-07-12

ki18n - 6.4.0
Ebuild name:

kde-frameworks/ki18n-6.4.0

Description

Framework based on Gettext for internationalizing user interface text

Added to portage

2024-07-12

kiconthemes - 6.4.0
Ebuild name:

kde-frameworks/kiconthemes-6.4.0

Description

Framework for icon theming and configuration

Added to portage

2024-07-12

kidletime - 6.4.0
Ebuild name:

kde-frameworks/kidletime-6.4.0

Description

Framework for detection and notification of device idle time

Added to portage

2024-07-12

kimageformats - 6.4.0
Ebuild name:

kde-frameworks/kimageformats-6.4.0

Description

Framework providing additional format plugins for Qt's image I/O

Added to portage

2024-07-12

kio - 6.4.0
Ebuild name:

kde-frameworks/kio-6.4.0

Description

Framework providing transparent file and data management

Added to portage

2024-07-12

kirigami - 6.4.0
Ebuild name:

kde-frameworks/kirigami-6.4.0

Description

Lightweight user interface framework for mobile and convergent applic

Added to portage

2024-07-12

kitemmodels - 6.4.0
Ebuild name:

kde-frameworks/kitemmodels-6.4.0

Description

Framework providing data models to help with tasks such as sorting

Added to portage

2024-07-12

kitemviews - 6.4.0
Ebuild name:

kde-frameworks/kitemviews-6.4.0

Description

Framework providing additional widgets for item models

Added to portage

2024-07-12

kjobwidgets - 6.4.0
Ebuild name:

kde-frameworks/kjobwidgets-6.4.0

Description

Framework providing assorted widgets for showing the progress of j

Added to portage

2024-07-12

knewstuff - 6.4.0
Ebuild name:

kde-frameworks/knewstuff-6.4.0

Description

Framework for downloading and sharing additional application data

Added to portage

2024-07-12

knotifications - 6.4.0
Ebuild name:

kde-frameworks/knotifications-6.4.0

Description

Framework for notifying the user of an event

Added to portage

2024-07-12

knotifyconfig - 6.4.0
Ebuild name:

kde-frameworks/knotifyconfig-6.4.0

Description

Framework for configuring desktop notifications

Added to portage

2024-07-12

kpackage - 6.4.0
Ebuild name:

kde-frameworks/kpackage-6.4.0

Description

Framework to install and load packages of non binary content

Added to portage

2024-07-12

kparts - 6.4.0
Ebuild name:

kde-frameworks/kparts-6.4.0

Description

Framework providing elaborate user-interface components

Added to portage

2024-07-12

kpeople - 6.4.0
Ebuild name:

kde-frameworks/kpeople-6.4.0

Description

KDE contact person abstraction library

Added to portage

2024-07-12

kplotting - 6.4.0
Ebuild name:

kde-frameworks/kplotting-6.4.0

Description

Framework providing easy data-plotting functions

Added to portage

2024-07-12

kpty - 6.4.0
Ebuild name:

kde-frameworks/kpty-6.4.0

Description

Framework for pseudo terminal devices and running child processes

Added to portage

2024-07-12

kquickcharts - 6.4.0
Ebuild name:

kde-frameworks/kquickcharts-6.4.0

Description

QtQuick plugin providing high-performance charts

Added to portage

2024-07-12

krunner - 6.4.0
Ebuild name:

kde-frameworks/krunner-6.4.0

Description

Framework for providing different actions given a string query

Added to portage

2024-07-12

kservice - 6.4.0
Ebuild name:

kde-frameworks/kservice-6.4.0

Description

Advanced plugin and service introspection

Added to portage

2024-07-12

kstatusnotifieritem - 6.4.0
Ebuild name:

kde-frameworks/kstatusnotifieritem-6.4.0

Description

Implementation of Status Notifier Items

Added to portage

2024-07-12

ksvg - 6.4.0
Ebuild name:

kde-frameworks/ksvg-6.4.0

Description

Components for handling SVGs

Added to portage

2024-07-12

ktexteditor - 6.4.0
Ebuild name:

kde-frameworks/ktexteditor-6.4.0

Description

Framework providing a full text editor component

Added to portage

2024-07-12

ktexttemplate - 6.4.0
Ebuild name:

kde-frameworks/ktexttemplate-6.4.0

Description

Library to allow separating the structure of documents from data

Added to portage

2024-07-12

ktextwidgets - 6.4.0
Ebuild name:

kde-frameworks/ktextwidgets-6.4.0

Description

Framework providing an assortment of widgets for displaying and e

Added to portage

2024-07-12

kunitconversion - 6.4.0
Ebuild name:

kde-frameworks/kunitconversion-6.4.0

Description

Framework for converting units

Added to portage

2024-07-12

kuserfeedback - 6.4.0
Ebuild name:

kde-frameworks/kuserfeedback-6.4.0

Description

Framework to collect user feedback for applications via telemetr

Added to portage

2024-07-12

kwallet - 6.4.0
Ebuild name:

kde-frameworks/kwallet-6.4.0

Description

Framework providing desktop-wide storage for passwords

Added to portage

2024-07-12

kwidgetsaddons - 6.4.0
Ebuild name:

kde-frameworks/kwidgetsaddons-6.4.0

Description

An assortment of high-level widgets for common tasks

Added to portage

2024-07-12

kwindowsystem - 6.4.0
Ebuild name:

kde-frameworks/kwindowsystem-6.4.0

Description

Framework providing access to properties and features of the win

Added to portage

2024-07-12

kxmlgui - 6.4.0
Ebuild name:

kde-frameworks/kxmlgui-6.4.0

Description

Framework for managing menu and toolbar actions in an abstract way

Added to portage

2024-07-12

libbpf - 1.3.2
Ebuild name:

dev-libs/libbpf-1.3.2

Description

Stand-alone build of libbpf from the Linux kernel

Added to portage

2024-07-12

libbpf - 1.4.5
Ebuild name:

dev-libs/libbpf-1.4.5

Description

Stand-alone build of libbpf from the Linux kernel

Added to portage

2024-07-12

libreoffice - 24.2.5.1
Ebuild name:

app-office/libreoffice-24.2.5.1

Description

A full office productivity suite

Added to portage

2024-07-12

markdown2 - 2.5.0
Ebuild name:

dev-python/markdown2-2.5.0

Description

Python Markdown language reimplementation

Added to portage

2024-07-12

modemmanager-qt - 6.4.0
Ebuild name:

kde-frameworks/modemmanager-qt-6.4.0

Description

ModemManager bindings for Qt

Added to portage

2024-07-12

msmtp - 1.8.26
Ebuild name:

mail-mta/msmtp-1.8.26

Description

An SMTP client and SMTP plugin for mail user agents such as Mutt

Added to portage

2024-07-12

neovim-ruby-client - 0.10.0
Ebuild name:

dev-ruby/neovim-ruby-client-0.10.0

Description

Ruby bindings for Neovim

Added to portage

2024-07-12

networkmanager-qt - 6.4.0
Ebuild name:

kde-frameworks/networkmanager-qt-6.4.0

Description

NetworkManager bindings for Qt

Added to portage

2024-07-12

nextcloud-client - 3.13.2
Ebuild name:

net-misc/nextcloud-client-3.13.2

Description

Desktop Syncing Client for Nextcloud

Added to portage

2024-07-12

odoc-parser - 2.4.2
Ebuild name:

dev-ml/odoc-parser-2.4.2

Description

Parser for ocaml documentation comments

Added to portage

2024-07-12

openmpi - 5.0.3
Ebuild name:

sys-cluster/openmpi-5.0.3

Description

A high-performance message passing library (MPI)

Added to portage

2024-07-12

path_expander - 1.1.2
Ebuild name:

dev-ruby/path_expander-1.1.2

Description

Pre-process CLI arguments expanding directories into their constituent

Added to portage

2024-07-12

pdfjs - 4.4.168
Ebuild name:

www-plugins/pdfjs-4.4.168

Description

A PDF reader in JavaScript

Added to portage

2024-07-12

pipewire - 1.2.1
Ebuild name:

media-video/pipewire-1.2.1

Description

Multimedia processing graphs

Added to portage

2024-07-12

poppler - 24.07.0
Ebuild name:

app-text/poppler-24.07.0

Description

PDF rendering library based on the xpdf-3.0 code base

Added to portage

2024-07-12

prison - 6.4.0
Ebuild name:

kde-frameworks/prison-6.4.0

Description

QRCode and data matrix barcode library

Added to portage

2024-07-12

pure-eval - 0.2.2-r1
Ebuild name:

dev-python/pure-eval-0.2.2-r1

Description

Safely evaluate AST nodes without side effects

Added to portage

2024-07-12

purpose - 6.4.0
Ebuild name:

kde-frameworks/purpose-6.4.0

Description

Library for providing abstractions to get the developer's purposes ful

Added to portage

2024-07-12

pytest-shell-utilities - 1.9.0-r1
Ebuild name:

dev-python/pytest-shell-utilities-1.9.0-r1

Description

pytest plugin fixtures and code to help with running she

Added to portage

2024-07-12

python-json-logger - 2.0.7-r1
Ebuild name:

dev-python/python-json-logger-2.0.7-r1

Description

Standard python logging to output log data as json objects

Added to portage

2024-07-12

pytools - 2024.1.8
Ebuild name:

dev-python/pytools-2024.1.8

Description

Collection of tools missing from the Python standard library

Added to portage

2024-07-12

qiskit - 1.1.1-r1
Ebuild name:

dev-python/qiskit-1.1.1-r1

Description

An open-source SDK for working with quantum computers

Added to portage

2024-07-12

qqc2-desktop-style - 6.4.0
Ebuild name:

kde-frameworks/qqc2-desktop-style-6.4.0

Description

Style for QtQuickControls 2 that uses QWidget's QStyle for

Added to portage

2024-07-12

qtwayland - 6.7.2-r2
Ebuild name:

dev-qt/qtwayland-6.7.2-r2

Description

Wayland platform plugin for Qt

Added to portage

2024-07-12

raspberrypi-image - 6.6.31_p20240529
Ebuild name:

sys-kernel/raspberrypi-image-6.6.31_p20240529

Description

Raspberry Pi (all versions) kernel and modules

Added to portage

2024-07-12

raspberrypi-sources - 6.6.31_p20240529
Ebuild name:

sys-kernel/raspberrypi-sources-6.6.31_p20240529

Description

Raspberry Pi kernel sources

Added to portage

2024-07-12

rime-data - 1.0.20240624
Ebuild name:

app-i18n/rime-data-1.0.20240624

Description

Added to portage

2024-07-12

rpm-sequoia - 1.7.0
Ebuild name:

app-crypt/rpm-sequoia-1.7.0

Description

Implementation of the RPM PGP interface using Sequoia

Added to portage

2024-07-12

rustworkx - 0.15.1-r2
Ebuild name:

dev-python/rustworkx-0.15.1-r2

Description

A high performance Python graph library implemented in Rust

Added to portage

2024-07-12

rutorrent - 4.3.6
Ebuild name:

www-apps/rutorrent-4.3.6

Description

ruTorrent is a front-end for the popular Bittorrent client rTorrent

Added to portage

2024-07-12

sip - 6.8.6
Ebuild name:

dev-python/sip-6.8.6

Description

Python bindings generator for C/C++ libraries

Added to portage

2024-07-12

solid - 6.4.0
Ebuild name:

kde-frameworks/solid-6.4.0

Description

Provider for platform independent hardware discovery, abstraction and ma

Added to portage

2024-07-12

sonnet - 6.4.0
Ebuild name:

kde-frameworks/sonnet-6.4.0

Description

Framework for providing spell-checking through abstraction of popular b

Added to portage

2024-07-12

stripe - 10.3.0
Ebuild name:

dev-python/stripe-10.3.0

Description

Stripe Python bindings

Added to portage

2024-07-12

syndication - 6.4.0
Ebuild name:

kde-frameworks/syndication-6.4.0

Description

Library for parsing RSS and Atom feeds

Added to portage

2024-07-12

syntax-highlighting - 6.4.0
Ebuild name:

kde-frameworks/syntax-highlighting-6.4.0

Description

Framework for syntax highlighting

Added to portage

2024-07-12

threadweaver - 6.4.0
Ebuild name:

kde-frameworks/threadweaver-6.4.0

Description

Framework for managing threads using job and queue-based interfac

Added to portage

2024-07-12

trimesh - 4.4.3
Ebuild name:

dev-python/trimesh-4.4.3

Description

Python library for loading and using triangular meshes

Added to portage

2024-07-12

unearth - 0.16.1
Ebuild name:

dev-python/unearth-0.16.1

Description

A utility to fetch and download python packages

Added to portage

2024-07-12

vdr-dvd - 0.3.7
Ebuild name:

media-plugins/vdr-dvd-0.3.7

Description

VDR Plugin DVD-Player

Added to portage

2024-07-12

wtfis - 0.10.0
Ebuild name:

net-analyzer/wtfis-0.10.0

Description

Passive hostname, domain and IP lookup tool for non-robots

Added to portage

2024-07-12

xdg-desktop-portal-gnome - 46.2
Ebuild name:

sys-apps/xdg-desktop-portal-gnome-46.2

Description

Backend implementation for xdg-desktop-portal using GNOME

Added to portage

2024-07-12

xl2tpd - 1.3.18-r2
Ebuild name:

net-dialup/xl2tpd-1.3.18-r2

Description

A modern version of the Layer 2 Tunneling Protocol (L2TP) daemon

Added to portage

2024-07-12

rdf newsfeed | rss newsfeed | Atom newsfeed
- Powered by LeopardCMS - Running on Gentoo -
Copyright 2004-2020 Sascha Nitsch Unternehmensberatung GmbH
Valid XHTML1.1 : Valid CSS : buttonmaker
- Level Triple-A Conformance to Web Content Accessibility Guidelines 1.0 -
- Copyright and legal notices -
Time to create this page: 26.8 ms