from small one page howto to huge articles all in one place
 

search text in:




Other .linuxhowtos.org sites: www.linuxhowtos.org
toolsntoys.linuxhowtos.org



Last additions:
How to make X listen on port 6000

How to make X listen on port 6000

words:

34

views:

62676

userrating:

average rating: 1.5 (4 votes) (1=very good 6=terrible)


May, 25th 2007:
April, 26th 2007:
Apr, 10th. 2007:
Druckversion . pdf icon
You are here: Portage


Details of sys-process/at:

Description: Queues jobs for later execution
Homepage:
http://blog.calhariz.com/index.php/tag/at https://packages.qa.debian.org/a/at.html

available versions:

releasesalphaamd64armhppaia64mipsppcppc64ppc macoss390shsparcx86USE-Flagsdependenciesebuild warnings
at-3.2.5-r1 ~~~~~~~~---~~pam
selinux
show
show
at-3.2.5 ~++~~~++---++pam
selinux
show
show
Legend:
+ stable
~ testing
- not available
some ebuild warning depend on specific use-flags or architectures, all ebuild-warnings are shown.

Known bugs:
bug IDcomponentassigned tostatusdescriptionlast change
52076Applicationsnet-mailUNCONFIRMEDdefault maildir location configuration variable2012-03-16 14:33:21
81424Ebuildsmaintainer-wantedUNCONFIRMEDgnome-translate-0.99.ebuild (New Package)2011-05-16 09:10:09
135923Applicationslu_zeroUNCONFIRMEDx11-drivers/ati-drivers: weird image rendering problems with www-client/firefox2012-06-06 13:44:40
146951Core systemalphaUNCONFIRMEDsys-fs/quota - value too large for defined data type on Alpha systems2011-12-02 19:03:44
211203GamesgamesUNCONFIRMEDgames-rpg/bass: script for getting bass translated2011-07-27 09:15:01
255644Ebuildsmaintainer-wantedUNCONFIRMEDapp-emulation/basiliskII-jit: a lot improved ebuild2012-12-14 15:37:41
256259ApplicationschutzpahUNCONFIRMEDwww-plugins/nspluginwrapper should allow native wrapping2012-04-18 08:47:57
298753EbuildsnetmonUNCONFIRMEDnet-analyzer/rrdtool - src_configure() hangs at: configure:19935: checking if msync with MS_ASYNC up2011-06-01 15:21:23
312935EbuildsgraphicsUNCONFIRMEDmedia-gfx/ufraw: Optionalize more dependencies and improve metadata.xml2011-10-09 07:35:16
313491ApplicationsgraphicsUNCONFIRMEDmedia-gfx/exact-image: Verify and potentially improve Python-related code2012-10-06 11:48:14
339725EbuildsaballierUNCONFIRMEDmedia-sound/lmms fails to build remote_vst_plugin: winebuild: as --32 failed with status 12011-04-19 16:10:52
350685Unspecifiedmaintainer-neededUNCONFIRMEDnet-misc/htpdate-1.0.4 segfaults with -b command line option2012-03-04 09:21:29
365321Eclasses and Profilesbase-systemUNCONFIRMEDeutils.eclass lacks eclass-to-man formatting for documentation of make_desktop_entry function2011-05-02 01:44:57
365643Ebuildspolynomial-cUNCONFIRMEDapp-emulation/virtualbox-additions-4.* License wrongly stated as PUEL2012-07-18 02:27:12
365665Ebuildsx11UNCONFIRMEDx11-base/xorg-server-1.9.5 CONFIGURE_OPTIONS are deprecated, use XORG_CONFIGURE_OPTIONS instead2011-11-19 01:13:08
365713ApplicationsclusterUNCONFIRMEDsys-cluster/maui-3.3.1 - mismatching spool dir in different files2011-05-08 19:17:50
365749Ebuildslu_zeroUNCONFIRMEDapp-emulation/bochs-2.4.5 unable to build in amd64 emulation on x86 platforms2011-05-10 21:14:05
365899.tbz2 supportpms-bugsUNCONFIRMEDautomatic RDEPEND for binpkgs using python2011-05-11 17:58:24
366051Ebuildsmaintainer-wantedUNCONFIRMEDAdd ebuild for NOC, Operation Support System (OSS) and Enterprise Network Operation Centers.2012-09-01 12:24:51
366159EbuildsnetmonUNCONFIRMEDnet-analyzer/hping: Patch to make hping's traceroute mode increment TTL after N retries2011-05-10 20:33:04
366215Applicationspolynomial-cUNCONFIRMEDapp-emulation/virtualbox has incomplete dependencies2013-01-01 09:29:16
366231LibrarycppUNCONFIRMEDdev-libs/ace doesn't build static libraries2011-07-20 15:29:14
366509Applicationsrobbat2UNCONFIRMEDdev-db/libdbi-drivers-0.8.3: uses incorrect query for listing tables on PostgreSQL database2011-05-12 18:58:07
366649Applicationsmaintainer-wantedUNCONFIRMEDCQRLOG - an advanced ham radio logger based on [the] Firebird database2011-05-12 21:53:26
366739Applicationsrich0UNCONFIRMEDdev-util/android-sdk-update-manager should install desktop entries2013-01-19 22:10:35
366757ApplicationshannoUNCONFIRMED=media-libs/gegl-0.1.6 - ff-load.c:79: error: duplicate case value2011-05-11 08:40:52
366763ApplicationssgmlUNCONFIRMEDapp-text/asciidoc-8.6.4 should RDEPEND on app-text/dblatex2012-03-25 20:53:34
366779OpenRCopenrcUNCONFIRMEDsys-apps/openrc - "cannot allocate memory" when overcommit is disabled2012-02-27 14:07:23
366875Ebuildsmaintainer-wantedUNCONFIRMED[new package] sys-fs/gdatafs - Gdatafs is a FUSE implemtation that mount picassa web and youtube to 2011-12-08 06:16:16
366923Ebuildsbase-systemUNCONFIRMEDapp-arch/tar-1.26 changes matching behavior2011-05-13 00:18:52
366975ApplicationssciUNCONFIRMED[science overlay] sci-biology/gbrowse-2.33 fails to install, due to ACCESS VIOLATION2012-01-04 08:07:11
366999InstallCDreleaseUNCONFIRMEDHostname should be relatively unique on each boot2011-05-12 16:56:32
367015Ebuildsshell-toolsUNCONFIRMEDapp-misc/dtach: scrollback buffer patch2013-01-20 10:32:16
367027Ebuildsmaintainer-wantedUNCONFIRMEDnet-analyzer/amun - Low-interaction honeypot, capture autonomous spreading malware in an automated f2012-03-08 02:09:36
367037JavajavaUNCONFIRMEDdev-java/piccolo2d-1.2.1-r2 did not build unable to find paths2011-05-13 05:12:20
367325Eclasses and Profilesbase-systemUNCONFIRMEDInconsist save/restore path in savedconfig.eclass2013-01-24 16:21:26
367331Ebuildsbase-systemUNCONFIRMEDsys-fs/quotatool-1.4.6: quotatool doesnt skip "rootfs / rootfs" mount entry2011-05-17 18:14:10
367427Ebuildsmaintainer-wantedUNCONFIRMEDmedia-sound/qjackmmc-4 - a Qt based program that can connect to a device or program that emits MIDI 2011-05-18 11:04:44
367443Ebuildspolynomial-cUNCONFIRMEDapp-emulation/virtualbox-9999 sets RPATH to /opt/VirtualBox but is installed to /usr/lib/virtualbox2011-05-17 17:41:46
367479Enhancement/Feature Requestsdev-portageUNCONFIRMEDemerge fetch function should be mirror-selective depending on ebuild location2012-12-07 05:07:03
367787GamesgamesUNCONFIRMEDrevenge-of-the-titans-1.80.12 doesn't support humble bundle installation files.2012-12-27 10:32:12
367793OpenRCopenrcUNCONFIRMED[TRACKER] packages with scripts that are not openrc compatible2011-12-12 05:30:39
367799ApplicationsvadimkUNCONFIRMEDapp-emulation/vmware-player doesn't install thnuclnt (thinprint), so virtual printers do not work (b2011-05-18 00:14:08
368251EbuildsevermindUNCONFIRMED[pro-audio overlay] media-libs/armstrong-9999 ebuild needs updating: distutils.eclass2011-05-23 08:42:25
368377JavajavaUNCONFIRMEDjava-config should support JNI related native config options and ld.so.conf pathes2012-04-04 14:19:10
368497ApplicationsradhermitUNCONFIRMEDapp-admin/lsyncd - add init.d and configuration files2012-11-24 08:30:17
368659Unspecifiedpolynomial-cUNCONFIRMEDapp-emulation/virtualbox - add USE flag for net-misc/vde2011-11-23 09:07:24
368819Ebuildsmaintainer-wantedUNCONFIRMEDapp-emacs/sepia - perl+emacs integration (New Package)2011-06-08 06:30:23
368955ApplicationsvadimkUNCONFIRMEDapp-emulation/open-vm-tools default scripts break network connectivity on pause/resume2011-12-03 05:48:53
368985Ebuildsmaintainer-wantedUNCONFIRMEDgames-kids/scratch: New ebuild for MIT's "scratch" programming environment for young people2012-11-21 10:11:11
369225Applicationsportage-utilsUNCONFIRMEDapp-portage/portage-utils: Request for atom support in qatom/qlist2011-10-03 00:54:56
369241EbuildssciUNCONFIRMEDsci-misc/boinc-6.12.26-r1.ebuild (Patch for PS3 Support)2012-06-26 16:01:33
369397GamesgamesUNCONFIRMEDgames-action/descent2-data ebuild update2012-09-21 03:30:51
369811ApplicationsopenrcUNCONFIRMEDsys-apps/openrc: Patch to measure time required for starting daemons (was: delay to sys-auth/console2012-05-20 13:25:32
369851ApplicationsnxUNCONFIRMEDnet-misc/nx-3.4.0-r3 *** stack smashing detected ***: nxagent - terminated2012-07-12 06:06:30
369923GamesgamesUNCONFIRMEDgames-action/trine-bin Filesize does not match recorded size2011-06-03 17:20:29
369925OpenRCopenrcUNCONFIRMED/etc/conf.d/net - Setting associate_timeout_ does not have any effect with net-wireless/wpa_s2013-01-01 17:01:05
370053Unspecifiedx11UNCONFIRMEDx11-drivers/ati-drivers: xorg doesn't exit on shutdown2011-09-09 00:54:14
370087Core systemtoolchainUNCONFIRMEDsys-libs/glibc-2.12.2: MAKEOPTS=-s: ld hits internal error at bfd/elf32-i386.c:2946:elf_i386_relocat2012-04-13 23:36:33
370445GNOMEmaintainer-wantedUNCONFIRMED[gnome overlay] Ebuild for gnome-shell-extensions-weather applet2011-12-30 11:49:48
370581ApplicationssoundUNCONFIRMEDmedia-sound/freebirth-0.3.2-r1 - /bin/sh: line 1: 19963 Segmentation fault ./fusebirth > fused_2011-06-09 22:50:31
370703Applicationsmysql-bugsUNCONFIRMEDdev-db/myodbc-5.1.6 - emerge --config fails: odbcinst: SQLWritePrivateProfileString failed with Gene2011-06-10 02:05:40
370761Ebuildsmaintainer-neededUNCONFIRMEDwww-apache/mod_auth_imap2 patch to fix compilation2013-01-04 14:14:29
370785Ebuildsmaintainer-wantedUNCONFIRMEDsteadyflow-0.1.7 - a GTK+ based download manager that aims for minimalism, ease of use, and a clean,2013-02-06 11:25:50
370865Other documentsdocs-teamUNCONFIRMEDX11 keyboard layout will not change that easily2011-06-10 13:49:58
370985Ebuildsdev-zeroUNCONFIRMEDnet-nds/gosa-core should depend on php[nls] rather when gettext.2011-06-10 15:16:59
371322Eclasses and ProfilesadaUNCONFIRMEDdev-lang/gnat-gcc-4.3.2 - work/gcc-4.3.2/libgcc/../gcc/unwind-pe.h:136: error: expected declaration 2012-03-19 19:22:36
371369Applicationsmysql-bugsUNCONFIRMEDmod-auth-mysql-4.3.9: LoadModule statement is wrong (with solution)2012-11-27 19:59:19
371373Ebuildsmaintainer-wantedUNCONFIRMEDapp-i18n/wordforge-0.8_rc1 - Offline translation and localization program working internally with XL2011-06-13 22:39:51
371637DevmanualqaUNCONFIRMEDarrow syntax (->) is missing in SRC_URI documentation2011-12-20 19:42:23
371707Ebuildsmaintainer-wantedUNCONFIRMEDdev-libs/librets - a Real Estate Transaction Standard (RETS) client library2013-01-15 00:37:53
371915Applicationspam-bugsUNCONFIRMEDwtmp contains duplicate log entries2011-06-16 23:05:59
372049Applicationstools-portageUNCONFIRMEDRequest for app-portage/gentoolkit to show (for a use flag) status of the flag in installed packages2012-12-25 01:55:20
372453EbuildsdotnetUNCONFIRMEDapp-portage/eclass-manpages - Documentation for mono.eclass is awfull (one line)2011-06-29 10:17:45
372475Ebuildspolynomial-cUNCONFIRMEDRename app-emulation/virtualbox-additions to app-emulation/virtualbox-[guest-]additions[-bin]2012-04-08 19:23:25
372551OpenRCopenrcUNCONFIRMEDsys-apps/openrc: rc.c:read_key() hangs waiting for input at Interactive? prompt (termios problem)2012-02-15 12:49:05
372693Keywording and StabilizationarmUNCONFIRMEDapp-emulation/lxc ~arm keyword request2012-06-18 10:54:01
372717Ebuildsnet-fsUNCONFIRMEDsys-libs/lwp-2.6: Rdsinit fails to initialize data and log2011-07-01 11:45:25
372949UnspecifiedpythonUNCONFIRMEDapp-admin/python-updater should depend on sys-apps/openrc2012-07-05 13:59:19
373039EbuildslackUNCONFIRMEDx11-plugins/gkrellmss — gkrellmss.h:23:30: fatal error: gkrellm2/gkrellm.h: No such file or director2011-07-03 16:43:54
373073Eclasses and ProfilesgamesUNCONFIRMEDcdrom.eclass: logic error in cdrom_get_cds path check2012-01-24 02:52:25
373281ApplicationsxemacsUNCONFIRMEDapp-editors/xemacs-21.5.31 fails to emerge, because check-features.el can not be loaded2013-02-17 11:58:08
373283ApplicationsnetmonUNCONFIRMEDnet-analyzer/netcat-110-r9: -c does execve() instead of system()2011-07-03 17:35:12
373333EbuildsvmwareUNCONFIRMEDapp-emulation/vmware-ovftool-2.0.1.260188: version bump2011-07-03 16:45:55
373635Ebuildsnet-dialupUNCONFIRMEDnet-dialup/ppp: add postinst message for break compatibility with dependent packages2011-07-01 01:38:55
373923LibraryjsbronderUNCONFIRMEDsys-cluster/openmpi-1.5.3-r1: mpirun hangs or fails with Segmentation faults2012-02-06 19:20:57
373979EbuildspatrickUNCONFIRMEDapp-emulation/virtualbox-modules-4.0.10 does not compile if KBUILD_OUTPUT != KERNEL_DIR2012-09-11 09:29:19
374085ApplicationsnetmonUNCONFIRMEDnet-analyzer/tcptrace cross compilation fix2011-07-08 19:12:28
374149DevelopmentperlUNCONFIRMEDMoose-2.1.0 conflicts with all existent versions of File-ChangeNotify, MooseX-Params-Validate, and M2011-07-10 03:47:03
374475GamesgamesUNCONFIRMEDnwn-data downloads 1.5GB of files only to tell me i need USE=cdinstall in order to proceed2012-10-07 11:42:43
374505ApplicationsbluenessUNCONFIRMEDdev-util/gperf-3.0.4: compile error collect2: ld returned 1 exit status2012-02-04 01:23:02
374901Applicationsarmin76UNCONFIRMED[embedded-cross overlay] dev-python/pyxml-0.8.4-r2: multiple Python ABIs in EAPI <=2 is deprecated a2011-11-05 18:47:19
374943ApplicationsmattmUNCONFIRMEDmedia-gfx/cutycapt-0_p20110502-r2 unable to ignore invalid ssl certificate2012-04-16 01:32:13
374949BugzillabugzillaUNCONFIRMEDSubmitting bugs with attachments without method to determine content type causes error but still cre2011-10-30 23:16:37
375117Libraryjmfo1982UNCONFIRMEDIf i686-pc-linux-gnu-windres is present, configure process detects it and attempts to cross-compile2011-12-12 16:27:25
375127Ebuildsmaintainer-wantedUNCONFIRMEDscratchbox-devkit-hashutils-squeeze-sdk (new ebuild)2011-07-14 09:46:58
375183GamesgamesUNCONFIRMEDgames-strategy/freecnc-20041219: version bump request2011-07-14 15:27:59
375237GamesgamesUNCONFIRMEDgames-strategy/netpanzer-0.8.4: version bump request2012-01-24 03:19:29
375311Toolstools-portageUNCONFIRMEDequery list - does not show status for packages in /etc/portage/package.keywords2012-12-25 01:55:50
375825Applicationsmaintainer-neededUNCONFIRMEDapp-admin/ulogd-2.0.0_beta4 fails to build with +doc USE flag if latex is not installed2012-09-16 09:14:45
375837EbuildsperlUNCONFIRMEDmail-filter/spamassassin-3.3.2 fails to build (Sandbox violation)2011-10-11 15:56:38
375879Ebuildsqmail-bugsUNCONFIRMED[PATCH] mail-mta/netqmail: Add SMTP authentication support (AUTH LOGIN) to qmail-remote2012-02-24 13:11:27
376201ApplicationsnirbheekUNCONFIRMEDx11-themes/murrine-themes-0.98.0: NOX theme shows "Murrine configuration option 'gradients' is no lo2011-08-27 23:06:28
376643ApplicationstommyUNCONFIRMEDdev-libs/libtommath-0.42.0 cross compilation fix2013-01-26 23:25:03
376697ApplicationsjavaUNCONFIRMEDdev-util/eclipse-sdk-3.5.1-r1 freezes at splash screen2013-02-04 12:40:47
376767Ebuildsrobbat2UNCONFIRMEDapp-portage/g-cpan-0.16.4 creates non-existent categories file without newline (inconsistent)2011-08-03 01:16:53
376823JavajavaUNCONFIRMEDdev-java/icedtea-6.1.10.3: I have problems when open Jdownloader program. A fatal error has been det2011-12-08 10:40:09
377105Applicationsweb-appsUNCONFIRMEDapp-admin/webapp-config-1.50.18: self.mkfile() dies while trying to delete a path to be created2011-08-04 02:04:41
377139GamesgamesUNCONFIRMEDgames-action/shadowgrounds[-survivor]-bin update2011-07-31 06:07:45
377179[FR]docs-teamUNCONFIRMEDUpdate need on the French documentation of Xen2012-07-21 15:05:04
377281ApplicationsforensicsUNCONFIRMEDapp-forensics/aide-0.15.1 will not run correctly when built statically.2013-02-03 13:02:19
377285Applicationspolynomial-cUNCONFIRMEDapp-emulation/virtualbox-4.0.12 - Windows guest has USB disk woes2012-10-18 13:10:29
377747Ebuildsmaintainer-wantedUNCONFIRMEDmedia-gfx/sK1 is an open-source illustration program2011-08-05 21:49:02
377811Ebuildsmaintainer-wantedUNCONFIRMEDGaalet - Geometric Algebra Library C++ (Expression Template)2011-08-13 16:40:09
377831Ebuildsmaintainer-wantedUNCONFIRMEDsys-kernel/rtai-sources - Real Time Application Interface kernel sources2011-08-12 14:51:57
377841Prefix SupportprefixUNCONFIRMEDXemake requires Xvfb from the host, but end users don't know that2011-08-05 02:05:43
377859Ebuildsmaintainer-wantedUNCONFIRMEDapp-misc/libspnav - A free, compatible alternative for 3Dconnexion's 3D input SDK2011-09-22 19:29:47
377925DevelopmentpythonUNCONFIRMEDdev-python/docutils-0.[78]: TypeError: can't use a bytes pattern on a string-like object2011-10-07 21:22:24
377957Gamesmaintainer-wantedUNCONFIRMEDgames-puzzle/vvvvvv - A 2D puzzle platform video game2012-06-06 20:42:27
378053Toolstools-portageUNCONFIRMEDgentoolkit: revdep-rebuild optimization2013-01-30 05:52:33
378067ApplicationsforensicsUNCONFIRMEDapp-forensics/aide-0.14.2 - aide fails if non-standard paths are used2013-02-03 13:02:31
378413Applicationsnet-newsUNCONFIRMED[patch] net-news/yarssr-0.2.2-r1: URL Handler fails to launch correct URL in web browser2011-08-11 15:04:02
378633Core systemopenrcUNCONFIRMEDrestarting one interface complains that dhcpcd is already running, even if in fact it is not (race c2011-08-13 14:26:13
378645DevelopmentperlUNCONFIRMEDdev-perl/math-pari ignores profile, and fails when compiling on2011-08-20 17:10:38
378987ApplicationsvimUNCONFIRMEDvim.eclass's unmatched useflags of perl and libperl message is outdated2011-08-13 04:29:52
378995LibrarysoundUNCONFIRMEDmedia-libs/faad2-2.7-r2: lrintf patch for gcc4.5 or greater2011-08-15 01:02:22
379033Serverqmail-bugsUNCONFIRMEDmail-filter/qmail-scanner: Causing problems with RBL-checks activated spamassassin on target when se2011-08-14 02:01:12
379429Ebuildsmaintainer-wantedUNCONFIRMEDnew ebuild for CProwl, a command-line utility to generate Prowl notifications2011-08-21 15:21:44
379475Applicationsmaintainer-neededUNCONFIRMEDwww-apache/mod_dnssd - Avahi: "invalid host name" error, always uses "localhost" no matter what2013-01-01 20:35:50
379691Ebuildsmaintainer-wantedUNCONFIRMEDPlease add telepathy-ring ebuild into portage2013-01-18 10:49:26
379701Ebuildsmaintainer-wantedUNCONFIRMEDfeedgenerator-1.2.1.ebuild(New Package)2011-09-16 05:46:30
379827Ebuildsx11UNCONFIRMEDx11-base/xorg-server Patch for Hotkey Release Layout Switching (unofficial solution to bug on freed2012-06-06 06:40:18
379967Applicationspolynomial-cUNCONFIRMEDapp-emulation/virtualbox-modules-4.0.12 doesn't check kernel config on compatibility2011-08-22 12:36:13
380021Ebuildsmaintainer-wantedUNCONFIRMEDNew ebuild: app-emulation/pearpc-0.52012-02-09 22:23:37
380105Core systempolynomial-cUNCONFIRMEDsys-libs/libsmbios - insecure RUNPATHs:/usr/sbin/smbios-sys-info-lite2011-08-25 12:50:02
380295Conceptual/Abstract Ideasdev-portageUNCONFIRMED[patch] sys-apps/portage: Enhanced output for emerge --pretend --fetchonly2012-09-06 20:12:21
380301Applicationspolynomial-cUNCONFIRMEDapp-emulation/virtualbox-4.1.2 crashes when compiling with -O2 option2012-02-01 09:06:12
380379DevmanualqaUNCONFIRMEDQuickstart ebuild guide is outdated re: emake2011-08-23 15:27:47
380693Applicationscommon-lispUNCONFIRMEDdev-lisp/clisp-2.48 - hangs in ./lisp.run -B . -N locale -E UTF-8 -Epathname 1:1 -Emisc 1:1 -norc -m2011-08-28 21:49:06
380857Applicationsapp-dictsUNCONFIRMEDapp-dicts/duali-data-0.1b -doins: stemsdb does not exist2011-10-23 14:29:09
380887GamesgamesUNCONFIRMEDgames-emulation/ssnes (plus libsnes) - SNES emulator based on bsnes (new ebuild)2012-09-04 21:28:30
381057Ebuildsx11UNCONFIRMEDkexec + x11-drivers/xf86-video-ati + sys-kernel/gentoo-sources-3.* + RadeonHD results in corrupted d2011-09-11 02:03:40
381201ApplicationsvmwareUNCONFIRMEDapp-emulation/vmware-player and app-emulation/vmware-workstation: verify if we can drop libsexy depe2011-08-31 12:14:50
381333ApplicationsjerUNCONFIRMEDx11-terms/rxvt-unicode feature request (disable underline and cursor behaviour)2012-02-26 18:39:51
381487Ebuildsmaintainer-wantedUNCONFIRMEDdev-python/DerApproximator - A python module for numerical optimization2011-09-05 11:36:51
381561DevelopmentperlUNCONFIRMEDdev-perl/DateTime-0.700.0 does not work with dev-lang/perl-5.14.1-r12011-09-03 16:16:11
381563Librarymaintainer-wantedUNCONFIRMEDSISL - "The SINTEF Spline Library", a comprehensive NURBS library for the modeling and interrogation2011-10-07 01:01:21
381595EbuildssciUNCONFIRMEDsci-libs/mkl-10.0.5.025 tarball verification fails2011-09-03 10:33:04
381655GamesjokerUNCONFIRMEDPlease port patches for mupen64plus 1.5 from debian2012-05-28 22:08:43
381693ServerjavaUNCONFIRMEDtomcat-6 init fails when CATALINA_TMPDIR does not exist2011-10-24 21:05:19
381809EbuildspythonUNCONFIRMEDgames-simulation/singularity-0.30c fails to run with Python32012-12-29 15:00:48
382009Applicationstools-portageUNCONFIRMEDapp-portage/gentoolkit-0.3.0.4: revdep-rebuild does not try to re-create /var/cache/revdep-rebuild2012-12-25 01:56:04
382121Otherdocs-teamUNCONFIRMEDThe Suggestion of the new Korean translation for the related documentation2011-09-07 07:25:44
382137ApplicationsmozillaUNCONFIRMEDmail-client/thunderbird will not terminate if browser process remains active2012-01-28 09:09:10
382211LibraryjdhoreUNCONFIRMEDdev-libs/libmcs-0.7.2 - ld: mcs_getconfval.o: relocation R_X86_64_32 against `.rodata.str1.1' can no2012-02-03 06:39:29
382237ApplicationsmozillaUNCONFIRMEDwww-client/icecat-3.6.16-r3 inoperable remember ssl client certificate choice function2013-01-28 05:45:18
382451Core systembase-systemUNCONFIRMEDapp-misc/ca-certificates-20110502: older verisign cert breaks with newer verisign cert2011-10-08 19:36:05
382719Ebuildsidl0rUNCONFIRMEDmedia-video/nvidia-settings hangs with three connected displays [patch]2012-02-17 05:16:12
383013JavajavaUNCONFIRMEDOnline bank security apple refuses to work unless I create a '/etc/.java' folder2011-09-15 18:53:28
383169Ebuildsmaintainer-wantedUNCONFIRMEDwww-apps/statusnet ebuild request2012-06-19 10:49:02
383299Ebuildsmaintainer-wantedUNCONFIRMED[ebuild request] degate - IC digital logic reverse engineering tool2011-09-17 10:44:18
383363UnspecifiedbilllUNCONFIRMEDmedia-video/ogmrip-0.13.6 needs threads patch to enable multithreading2011-09-19 18:57:43
383395UnspecifiedwineUNCONFIRMEDapp-emulation/wine-1.3.28 can't find gecko2012-08-18 09:34:28
383455Ebuildsmaintainer-wantedUNCONFIRMEDapp-misc/openplacos/openplacos-0.3.0.ebuild New ebuild, latest stable releases on x86 and amd642012-10-11 17:25:44
383669Applicationspolynomial-cUNCONFIRMEDapp-emulation/virtualbox-4.1.2: fails to compile due to Java name clash2011-12-21 14:52:14
383725Enhancement/Feature Requestsdev-portageUNCONFIRMEDsys-apps/portage include digital signature in xpak2011-09-19 23:52:27
384031ApplicationschutzpahUNCONFIRMEDnet-analyzer/pchar[pcap] fails to build (possibly glibc version related)2012-08-20 03:39:32
384311ApplicationsgregkhUNCONFIRMEDnet-misc/bti add patch to allow compilation on non-GNU systems2012-09-23 09:36:41
384313Applicationsmedia-videoUNCONFIRMEDmedia-video/vlc vlc-cache-gen Segmentation fault on hardened system2012-09-19 13:08:49
384581Mac OSXprefixUNCONFIRMEDapp-editors/emacs-23.3-r2: emerge failed with error unexec: my_endbss_static is not in section __bss2011-10-31 03:04:33
384617EbuildschainsawUNCONFIRMEDapp-emulation/dynamips fails to compile (w/ can't find a register in class 'GENERAL_REGS')2011-10-31 10:29:49
384941DevmanualdevmanualUNCONFIRMEDdevmanual does not mention that there are recursive versions of the do* install functions2013-01-19 10:18:09
384947Applicationsmedia-videoUNCONFIRMEDmedia-video/aacskeys-0.4.0c-r1: please update ProcessingDeviceKeysSimple.txt2012-08-23 16:40:14
385087GCC PortingtoolchainUNCONFIRMEDsys-devel/gcc-4.4.5: gcj seem to not install needed ca-certificates (/usr/lib/security/cacerts)2012-09-24 06:08:56
385131CorepythonUNCONFIRMEDapp-admin/python-updater-0.9: append --keep-going to emerge2012-03-17 11:41:48
385297GamesjokerUNCONFIRMEDgames-emulation/mupen64plus-9999 live ebuild / prep for 2.02012-06-25 09:16:03
385557GamesgamesUNCONFIRMEDgames-strategy/frozensynapse - New ebuild for Frozen Synapse2012-06-18 04:40:37
385761Applicationsshell-toolsUNCONFIRMEDdev-util/colorgcc: please submit gentoo patches to upstream at github2011-10-10 14:45:07
385775Applicationsmaintainer-neededUNCONFIRMEDdev-libs/apr-util-1.3.11 cross compilation fix (libtool related)2013-01-01 20:20:51
385779ApplicationspatrickUNCONFIRMEDapp-admin/apache-tools-2.2.21 cross-compilation fix (libtool related)2013-02-16 13:32:00
385783ApplicationspatrickUNCONFIRMEDwww-servers/apache-2.2.21 cross-compilation fix (libtool related)2013-02-16 13:33:00
385897ApplicationsgraphicsUNCONFIRMEDmedia-gfx/enblend-4.0 fails compilation with use="+image-cache"2011-10-07 00:52:55
386059Libraryarfrever.ftaUNCONFIRMEDnet-libs/neon uses deprecated function gnutls_certificate_verify_peers() of gnutls2012-04-01 12:04:01
386077ApplicationsmozillaUNCONFIRMED=mail-client/thunderbird-10.0.1 shows double entries in newly created address book contacts2012-07-06 07:46:22
386275ApplicationssoundUNCONFIRMEDmedia-sound/cdcd-0.6.6-r2: bring debian patches2011-10-11 00:24:16
386557Ebuildsmaintainer-wantedUNCONFIRMEDOctopussy log aggregator (new package)2011-10-11 01:05:58
386661DevelopmentadaUNCONFIRMED[portage-multilib] dev-lang/gnat-gcc: configure error for x85-abi due to gnatboot-4.4-amd64.tar.bz22012-12-25 21:03:35
386707Gamesx11UNCONFIRMEDx11-libs/libdrm-2.4.26: assertion fails at intel_bufmgr_gem.c:13612011-10-18 05:30:06
387009Applicationsnet-mailUNCONFIRMEDnet-mail/fetchmail - modified initscript to allow multiple daemons AND inlined configuration2011-11-08 12:12:48
387147Core systemhannoUNCONFIRMEDsys-auth/pam_mount-2.12: running xfce4-session-logout eats all memory2013-01-08 13:37:30
387341ApplicationsbilllUNCONFIRMEDmedia-video/ogmrip-0.13.6 - ogmdvd-disc.h:71:1: error: expected '=', ',', ';', 'asm' or '__attribute2011-10-27 17:36:11
387345Ebuildsmaintainer-wantedUNCONFIRMEDnet-misc/gateone - an HTML5 web-based terminal emulator and SSH client.2011-10-18 18:27:36
387373ApplicationsgraphicsUNCONFIRMEDmedia-gfx/imagemagick-6.7.1.0 segmentation fault if not enough space in /tmp2011-10-21 07:30:54
387487Ebuildsmaintainer-wantedUNCONFIRMEDEbuild Request: mate-base/mate-2011.10.7 - Mate Desktop Environment2012-09-15 08:58:56
387567ApplicationsjlecUNCONFIRMEDx11-terms/terminator-0.96: Segmentation fault when starting2011-10-24 05:16:07
387623ApplicationsclusterUNCONFIRMEDsys-infiniband/opensm - Variables in /etc/init.d/opensm and /etc/conf.d/opensm do not match2011-10-19 12:06:50
387803Core systemvadimkUNCONFIRMEDProcesses start hanging in "D" state on Gentoo guest under vmware host2011-10-26 00:12:42
388267Conceptual/Abstract Ideasdev-portageUNCONFIRMEDpropagation of USE flags to virtuals2011-10-26 03:35:36
388425ApplicationswineUNCONFIRMEDapp-emulation/wine-1.3.30 sound not working, several apps stopped working.2012-03-22 12:19:51
388441Gamesmaintainer-wantedUNCONFIRMEDEbuild request games-strategy/liquidwar62012-03-30 21:32:48
388575Ebuildsmaintainer-wantedUNCONFIRMEDatem-0.3.2.ebuild - Fast command line tool that converts MetaStock financial binary data to CSV/text2011-11-03 18:46:04
388643Ebuildsmaintainer-wantedUNCONFIRMEDx11-misc/trayfreq - A GTK+ CPU and Battery Tray Tool2012-08-06 06:50:14
388645Applicationsmaintainer-wantedUNCONFIRMEDapp-office/moneyguru - a personal finance management application2011-10-27 17:51:06
388647Eclasses and ProfilesmozillaUNCONFIRMEDmozextension.eclass: Add new function for installing extensions in new standard install location2012-05-23 18:22:51
388879Servernet-p2pUNCONFIRMEDnet-p2p/mldonkey-3.1.0: Exception setgid failed: Operation not permitted trying to set group_gid2011-11-21 00:31:52
388903Ebuildsmaintainer-wantedUNCONFIRMED[science-overlay] dev-ml/zarith-1.1 - Arithmetic and logic operations over arbitrary-precision integ2012-08-04 16:25:32
388983EbuildsvmwareUNCONFIRMEDapp-emulation/vmware-modules-238.5 with sys-kernel/hardened-sources-3.0.4-r4 - work/vmci-only/linux/2013-01-18 22:06:24
389015Ebuildsmaintainer-wantedUNCONFIRMEDdev-libs/libpki - Provide an easy-to-use PKI library and tools for PKI enabled application developme2011-11-01 15:33:59
389017Ebuildsmaintainer-wantedUNCONFIRMEDdev-python/acutil - Tool for setting up authentication from network services ( Python2 library )2011-11-01 15:34:30
389027Ebuildsmaintainer-wantedUNCONFIRMEDnet-misc/qpid-cpp - cross-platform Enterprise Messaging system which implements the Advanced Message2012-08-31 06:30:43
389029Ebuildsmaintainer-wantedUNCONFIRMEDsys-libs/libuser - implements a standardized interface for manipulating and administering user and g2011-11-01 15:42:13
389033Prefix SupportprefixUNCONFIRMEDNew keywords and patches for dev-php/{xdebug,xdebug-client}-2.1.2 and eclass: ~{x86,x64}-macos2011-11-30 13:58:11
389055Ebuildsmaintainer-wantedUNCONFIRMEDapp-admin/gpw - Trigraph Password Generator2011-11-13 06:59:34
389129Gamesmaintainer-wantedUNCONFIRMEDgames-action/voxatron - game set in a world completely made of tiny cubes that can be blasted to smi2012-06-03 22:42:56
389151Ebuildsmaintainer-wantedUNCONFIRMEDnet-misc/justwifiindicator-0.1 - Simple WiFi signal strength tray indicator2011-11-20 12:10:03
389419Applicationsnet-proxyUNCONFIRMEDnet-proxy/ntlmaps - add multiple configuration support2011-11-03 15:39:17
389435GamesgamesUNCONFIRMEDgames-puzzle/blocks-that-matter-1.0.0.6 - drill blocks of matter one by one, collect them, and recyc2012-04-30 19:21:22
389485Core systembase-systemUNCONFIRMEDsys-libs/libcap-2.22: pam_cap.so unresolved symbol pam_get_item(), breaks authentication2011-12-20 18:53:00
389487Core systembase-systemUNCONFIRMEDnet-misc/keychain - keychain matches all (too many) processes with "ssh-agent" in cmdline2012-09-19 20:23:16
389489Ebuildsmaintainer-wantedUNCONFIRMEDmedia-video/smoviecat - Simple Movie Catalog2011-11-05 15:49:59
389533Applicationsdesktop-wmUNCONFIRMEDx11-wm/icewm-1.3.7 - src_test(): iceview.cc:480:38: error: no matching function for call to ‘TextVie2012-07-05 11:48:34
389675Applicationsnet-proxyUNCONFIRMEDnet-proxy/polipo-1.0.4.1 reports timeout for domains that are available2011-11-08 03:18:20
389707Developmentmaintainer-wantedUNCONFIRMEDoh-my-zsh: framework for managing your zsh configuration2011-11-08 03:31:32
389783Ebuildscommon-lispUNCONFIRMEDdev-lisp/clozurecl-1.7 fails to build (unquoted SVN_REVISION in generated compiler commands)2011-11-08 19:59:04
389861ApplicationsgnustepUNCONFIRMEDgnustep-base/gnustep-make-2.6.1-r1[doc] - mkdir: cannot create directory `gnustep-howto.t2d': File e2011-11-08 15:59:39
390169Ebuildsmaintainer-wantedUNCONFIRMEDebuild for ADMB (Automatic Differentiation Model Builder) software suite2011-11-11 15:42:12
390233Ebuildsmedia-tvUNCONFIRMEDmedia-tv/tvtime : request for patch merge (for wide monitors)2011-11-15 00:33:44
390293Unspecifiedkernel-miscUNCONFIRMED[enhancement] sys-fs/sshfs-fuse: Improve remote permissions when files and directories are created2011-11-15 00:36:35
390391Ebuildsmaintainer-wantedUNCONFIRMEDx11-misc/pdf_presenter_console - a GTK based presentation viewer application2012-08-12 14:09:53
390399JavajavaUNCONFIRMEDicedtea-bin-1.10.4 always redownloads web start application2011-12-05 12:55:11
390639Applicationsx11UNCONFIRMEDx11-drivers/xf86-video-ati - DRM/Radeon: black screen in DE sessions2012-03-29 18:39:50
390663JavajavaUNCONFIRMEDicedtea-bin-1.10.4 fails to use Asian fonts automatically2012-01-10 19:16:30
390757Core systemsciUNCONFIRMEDsci-mathematics/mcsim: pkg should not be installing /usr/include/random.h (breaks random packages)2011-11-18 19:22:47
390829Ebuildsbase-systemUNCONFIRMEDsys-fs/multipath-tools-0.4.8-r1: Problem with init.d script2011-11-17 15:55:55
391041ServerpatrickUNCONFIRMEDwww-servers/apache 2.2 - suexec and django non-ASCII file upload incompatibility as apache cut out L2013-02-16 14:04:07
391185UnspecifiedpythonUNCONFIRMED=dev-python/utidylib-0.2-r1 - src_test(): Segmentation fault in trial2012-02-18 20:19:49
391407Eclasses and ProfilespatrickUNCONFIRMEDapache-2.eclass - support user patches & user configure2013-02-16 14:10:12
391443genkernelgenkernelUNCONFIRMEDsys-kernel/genkernel doesnt autodetect the key device if at other address than specified2012-05-12 20:33:06
391675EbuildsproaudioUNCONFIRMEDmedia-plugins/swh-plugins - make x86 extensions optional at compile time2012-07-04 13:47:31
391721Applicationslu_zeroUNCONFIRMEDapp-emulation/qemu-user-0.12.2 USE=static - lib64/libc.a(elf-init.o): In function `__libc_csu_irel':2012-01-16 15:48:56
391771Core - Configurationdev-portageUNCONFIRMEDAlternative config (PORTAGE_CONFIGROOT) does not consider PORTAGE_CONFIGROOT/etc/make.profile2011-11-25 17:20:03
391839HardenedhardenedUNCONFIRMEDcompiling external module which is using file_operations fails2011-11-25 08:09:59
391923Ebuildsmaintainer-wantedUNCONFIRMEDapp-office/charm-1.5.2 - Charm time tracking application2013-01-15 17:57:57
391985ApplicationsmlUNCONFIRMEDnet-misc/unison-2.32.52 - /usr/bin/ocamlopt: don't know what to do with /usr/lib64.2012-06-07 08:32:01
392061Ebuildssci-chemistryUNCONFIRMEDsci-chemistry/platon-20110126 checksum failure - version bump ?2011-11-29 15:58:48
392243JavasciUNCONFIRMED[science overlay] dev-java/jlatexmath-0.9.4 fails to emerge because of ACCESS VIOLATION at /root/.ja2011-12-04 02:58:03
392261UnspecifiedhannoUNCONFIRMEDapp-emulation/dosemu -fno-pic causes build failure when using hardened compiler with PIE2012-12-23 17:38:30
392379ApplicationsvmwareUNCONFIRMEDapp-emulation/vmware-modules-238.5: vmmon-only/linux/hostif.c:2749:4: error: implicit declaration of2012-03-26 11:36:37
392459EbuildsroxUNCONFIRMEDrox-base/rox-launch: usage of deprecated method in ebuild2011-12-01 20:34:52
392463EbuildsroxUNCONFIRMEDrox-extra/roxcd: Deprecation Warning about of python_mod_cleanup()2012-09-09 01:16:09
392719Developmentphp-bugsUNCONFIRMEDdev-lang/php does not compile with alternative ROOT2012-03-02 12:58:20
392727DevelopmentadaUNCONFIRMEDdev-lang/gnat-gcc-4.3.5: fetch failed missing gnatboot-4.3-amd64.tar.bz22012-02-03 18:23:19
392737Ebuildsmaintainer-wantedUNCONFIRMEDnet-misc/turpial-1.6.6 - Lightweigth and featurefull microblogging client2012-10-03 15:56:13
392769ApplicationspatrickUNCONFIRMEDapp-emulation/virtualbox-guest-additions-4.1.6-r1 fails to build from /etc/kernel/postinst.d - make[2012-03-14 22:38:37
392975Ebuildsmaintainer-wantedUNCONFIRMED[science overlay] sci-mathematics/pulp - a Python wrapper for linear programming solvers2011-12-04 05:05:24
393201Core systembase-systemUNCONFIRMEDsys-boot/grub-0.97-r10 has a typo in the grub-set-default utility and configuration files2011-12-05 12:38:16
393275Ebuildsmaintainer-wantedUNCONFIRMEDdev-php/phpqrcode-1.1.4 - Generate QR Code 2-dimensional barcode with PHP2011-12-05 20:22:15
393281EbuildsaballierUNCONFIRMEDmedia-sound/lmms possibly bloated dependencies2011-12-05 20:18:32
393335Javagnu_andrewUNCONFIRMEDdev-java/icedtea-7.2.0-r3 - segmentation fault in /var/tmp/portage/dev-java/icedtea-7.2.0-r3/work/ic2011-12-25 05:58:41
393391KDEvoyageurUNCONFIRMED[kde overlay] kde-base/katepart-9999 fails to compile with sys-devel/dragonegg-3.02012-09-28 13:05:52
393683ApplicationsbluenessUNCONFIRMEDwww-servers/varnish-3.0.2 log '%r' format specifier returns the wrong info2012-05-23 00:57:09
394657VulnerabilitiessecurityUNCONFIRMEDnet-irc/xchat XChat Heap Overflow DoS (CVE-2011-5129)2012-09-08 15:28:51
394849GamesgamesUNCONFIRMEDgames-action/shank - A side scrolling beat 'em up with a comic book art style2012-09-23 17:44:45
395015Prefix SupportprefixUNCONFIRMED=dev-perl/X11-Protocol-0.560.0 does not work on Mac OS X [PATCH]2011-12-16 23:17:56
395021Prefix SupportprefixUNCONFIRMEDWriting ebuilds that have different dependencies across platforms undocumented2012-03-01 16:39:16
395035ApplicationsvaethUNCONFIRMEDeix-update too slow on perl-experimental2012-11-01 04:14:05
395095genkernelgenkernelUNCONFIRMEDgenkernel add support for custom location of boot config file2011-12-17 22:26:49
395171Ebuildsmaintainer-wantedUNCONFIRMEDNew ebuild for roccat-tools2012-12-12 00:33:36
395307Ebuildsmaintainer-wantedUNCONFIRMEDmedia-libs/munt-mt32emu / media-sound/munt-mt32emu-alsadrv - Library and ALSA MIDI driver for emulat2011-12-19 21:20:57
395309GamesgamesUNCONFIRMEDgames-emulation/dosbox: Only use "alsa" USE flag for MIDI2011-12-19 21:39:22
395359DevmanualdevmanualUNCONFIRMEDDevmanual should document the metadata/layout.conf file format in detail2012-11-03 16:37:17
395387Librarymedia-videoUNCONFIRMEDmedia-libs/x264-0.0.20111218 - fatal: ambiguous argument 'origin/master': unknown revision or path n2012-02-04 20:00:18
395429Ebuildspolynomial-cUNCONFIRMEDapp-emulation/virtualbox-modules: need check CONFIG_HZ=value2011-12-21 02:10:58
395433Core systemdev-portageUNCONFIRMEDdev-libs/libiconv - static archives (*.a) and libtool library files (*.la) do not belong in /2011-12-22 00:37:10
395537Core systembase-systemUNCONFIRMEDsys-process/procps doesn't prints cgroups correctly (systemd releated)2012-01-24 20:57:29
395839Applicationsrobbat2UNCONFIRMEDnet-misc/adjtimex-1.29 is not compatible with baselayout-22011-12-26 10:07:56
395899EbuildssciUNCONFIRMED[science-overlay] embassy-signature-0.1.0-r5 fails to fetch embassy-signature-0.1.0-r5.tar.gz2012-02-20 14:34:23
395927Applicationspolynomial-cUNCONFIRMEDapp-emulation/virtualbox-4.1.8, app-emulation/virtualbox-extpack-oracle-4.1.8 - broken /usr/lib64/vi2011-12-26 10:21:44
395949DevelopmenttitanofoldUNCONFIRMEDdev-util/premake-4.3 should generate architecture independent makefiles2011-12-26 23:59:11
396091ApplicationssciUNCONFIRMED[science-overlay] dev-perl/Bio-BigFile-1.06 fails to emerge because of relocation problem2012-01-01 08:50:47
396151Ebuildsmaintainer-wantedUNCONFIRMEDx11-misc/xinequery-0.3 - utility to view information regarding active Xinerama screens2012-01-06 21:16:00
396171ApplicationsnetmonUNCONFIRMEDnet-misc/iperf-2.0.5 when using -i flag, interval calculated to be negative and spews output2011-12-27 21:01:05
396225JavajavaUNCONFIRMEDUpdate dev-java/lucene-analyzers for slots 2.4, 2.9, 3.0, 3.1, 3.2, 3.3, 3.4, 3.5, 3.6 of dev-java/l2012-06-04 21:47:55
396307EbuildsperlUNCONFIRMEDmail-filter/spamassassin-3.3.1-r4 sa-update tool does not create sa-update-keys directory2011-12-28 16:27:41
396351Ebuildsfreedesktop-bugsUNCONFIRMEDsys-power/pm-utils-1.4.1-r2 installs duplicate documents2011-12-29 10:57:28
396411Ebuildsmaintainer-wantedUNCONFIRMEDsys-apps/ataidle ( New package )2011-12-29 14:37:43
396431ApplicationsvadimkUNCONFIRMEDapp-emulation/vmware-workstation-8.0.1.528992-r2 - segfault in libnvidia-glcore.so2011-12-29 18:43:30
396439Enhancement/Feature Requestsdev-portageUNCONFIRMEDKeep track of packages that need the kernel sources2011-12-30 00:46:36
396467NetbootreleaseUNCONFIRMEDInstall gentoo via PXE (integrated squashfs.image + init patch)2012-08-24 16:17:54
396543Ebuildsmaintainer-wantedUNCONFIRMEDEbuild for Cherrytree - A hierarchical note taking application2013-01-30 17:37:55
396545GamesgamesUNCONFIRMEDgames-action/supermeatboy - Super Meat Boy (new ebuild)2012-06-19 19:22:13
396665ApplicationspythonUNCONFIRMEDapp-admin/python-updater-0.10 does not update from /usr/lib/python3.1 to /usr/lib/python3.22012-11-07 14:06:55
396679ApplicationsvoipUNCONFIRMEDnet-misc/sipsak segmentation fault2012-01-04 21:08:51
397403ApplicationspatrickUNCONFIRMEDwww-apps/otrs - add app-admin/webapp-config compatibility / webapp.eclass support2012-08-24 13:09:08
397517ServernetmonUNCONFIRMEDapp-admin/sshguard-1.5 add attack signatures for net-misc/asterisk2012-08-19 01:00:03
397587ApplicationshollowUNCONFIRMEDwww-servers/nginx - add Naxsi web application firewall support2013-02-21 09:09:26
397863EbuildsdjcUNCONFIRMEDnet-misc/openvpn: add /var/run/openvpn to be ok with selinux and openvpn-status.log file2012-01-29 16:29:33
398089ApplicationstristanUNCONFIRMEDx11-misc/revelation-0.4.11-r2 USE=applet - configure:13842: error: failed to find module gnomeapplet2012-01-10 00:03:01
398093DevelopmentgraphicsUNCONFIRMEDsys-devel/gcc-4.6.2 with -march=bdver1 creates broken media-libs/jpeg2012-04-27 15:47:47
398115Ebuildsmaintainer-wantedUNCONFIRMEDNew ebuild for net-irc/xchat-randex2012-01-10 00:58:13
398137Ebuildsmaintainer-wantedUNCONFIRMEDitap rdp client - a closed source rdp client that supports (among other things) TS-Gateway servers2012-01-10 15:05:30
398399ApplicationsvimUNCONFIRMEDapp-editors/vim-7.3.393 - if_perl.c:1102:1: error: static declaration of 'XS_VIM_Msg' follows non-st2012-09-29 14:38:20
398419New DocumentationgnomeUNCONFIRMEDPlease provide documentation for using pam_ldap.so in combination with sys-auth/pambase[gnome-keyrin2012-07-08 23:26:02
398473genkernelgenkernelUNCONFIRMED[patch] sys-kernel/genkernel v86d support2012-01-12 17:13:07
398477genkernelgenkernelUNCONFIRMED[patch] sys-kernel/genkernel tuxonice-userui support2012-01-12 17:15:12
398487Ebuildsmaintainer-wantedUNCONFIRMEDmedia-sound/coquillo-1.9 - a metadata editor / tagger for various audio file formats2012-01-11 17:10:51
398601genkernelgenkernelUNCONFIRMED[patch] sys-kernel/genkernel few fixes to splash handling2012-01-12 17:17:06
398677GamesreavertmUNCONFIRMEDdev-games/openscenegraph-3.0.1 - /usr/lib64/libdcmimgle.a(dcmimage.o): relocation R_X86_64_32S again2012-11-18 23:58:42
398731Ebuildsmaintainer-wantedUNCONFIRMEDnet-analyzer/slowhttptest-1.3.ebuild Application Layer DoS attack simulator2012-01-13 14:35:35
398733Ebuildsmaintainer-wantedUNCONFIRMEDnet-fs/unfs3-0.9.22 A portable user-space implementation of the NFSv3 server specification2012-01-15 19:29:12
398961Ebuildsnet-imUNCONFIRMEDnet-im/pidgin-2.10.1: please separate dbus-python dependency into a USE-flag2013-01-01 23:11:04
399003Ebuildsmaintainer-wantedUNCONFIRMEDNew Ebuild: sci-electronics/cdmm-0.3 - a console program to read data from RS232 Digital MultiMeters2012-01-18 17:43:32
399009Ebuildsmaintainer-wantedUNCONFIRMEDnet-im/myagent-im - Instant messenger that implements Mail.ru protocol2012-01-17 03:58:52
399011ApplicationsultrabugUNCONFIRMEDapp-admin/rsyslog-5.8.6 logrotate config not working with systemd service2012-10-29 16:10:27
399065Ebuildsnet-dialupUNCONFIRMEDnet-dialup/ppp-2.4.5 EAP-TLS patch update2012-10-20 10:26:24
399199Ebuildsmaintainer-wantedUNCONFIRMEDmedia-sound/acoustid-fingerprinter - GUI application for submitting audio fingerprints to Acoustid2012-01-17 21:28:50
399353ApplicationsjerUNCONFIRMEDapp-admin/sysstat-10.0.3 generated daily report file will be truncated by cron.daily (sys-process/vi2012-05-10 14:40:15
399489Applicationsnet-imUNCONFIRMEDnet-im/pidgin XMPP/SASL authentication fail with >=dev-libs/cyrus-sasl-2.1.252012-02-07 20:53:55
399577Core - Dependenciesdev-portageUNCONFIRMEDportage/emerge fails to compute dependencies and fails to report what triggered the problem2012-01-22 15:26:36
399687ApplicationshannoUNCONFIRMEDSVGs exported by app-office/libreoffice cause segmentation fault in media-gfx/gimp-2.6.11-r52012-01-23 09:36:24
399711Ebuildsmaintainer-wantedUNCONFIRMED[ebuild request] sys-process/ulatencyd - monitors the system and categorizes the running processes i2012-04-09 14:20:31
399739Libraryrobbat2UNCONFIRMEDdev-db/libdbi-drivers-0.8.3 fails to return column information for empty sqlite3 table2012-10-26 16:54:27
399741PrintingprintingUNCONFIRMEDmedia-libs/plotutils-2.6 - g_miscmi.c:26:58: fatal error: xmi.h: No such file or directory2013-02-12 05:34:31
399747Ebuildsmaintainer-neededUNCONFIRMEDnet-wireless/broadcom-sta floods logs with "could not get rate/rssi"2013-02-03 13:03:07
399839EbuildsfauliUNCONFIRMEDapp-admin/tmpwatch reports "Cannot stat file" with --fuser on sufficiently loaded system2012-02-17 15:33:53
399843UnspecifiedrafaelmartinsUNCONFIRMEDg-octave/optiminterp-0.3.2 fails to install package database2012-01-25 13:24:50
399899Developmentlang-miscUNCONFIRMEDdev-lang/fpc-2.6.0 USE=ide - fpcalc.pas(244,3) Fatal: Selected assembler reader not supported2012-02-15 16:20:16
400681EbuildsxarthisiusUNCONFIRMEDdev-lang/ekopath-4.0.12_pre20111108 TEXTRELs2012-02-10 14:26:57
400701GCC PortingadaUNCONFIRMEDdev-lang/gnat-gcc-4.4.5 cannot find system.ads2012-01-25 15:19:05
400749Applicationsmaintainer-neededUNCONFIRMEDapp-laptop/ibam-0.5.2-r3 - ./ibam-0.5.2/debian/patches/04sysfs.dpatch fails2012-12-14 15:51:56
400897EbuildswineUNCONFIRMEDapp-emulation/crossover-office-pro-bin-10.2.0 version bump2012-02-27 22:15:26
400951HardenedhardenedUNCONFIRMEDJava does not run properly on non-root with Grsecurity Hardened Gentoo [workstation] level2012-01-26 19:28:36
401397ServerhollowUNCONFIRMEDwww-servers/nginx: add automatic minification module (jitify)2012-11-26 08:02:58
401409Ebuildsmaintainer-wantedUNCONFIRMEDsys-auth/oath-toolkit - Toolkit for using one-time password authentication with HOTP/TOTP algorithms2012-02-01 20:03:54
401413Applicationsx11UNCONFIRMEDx11-apps/xdm-1.1.11-r1: elibtoolize called repeatedly2012-01-30 13:03:27
401665Core systembase-systemUNCONFIRMEDdev-libs/openssl-1.0.0g[kerberos] hardcodes /usr/kerberose/ paths2012-03-11 04:37:10
401667EbuildshardenedUNCONFIRMEDnet-libs/libproxy-0.4.7 - Segmentation fault /usr/bin/gmcs /nologo /target:library /out:/var/tmp/por2012-02-03 21:57:47
401669Core systemhardened-kernelUNCONFIRMEDsys-kernel/hardened-sources-2.6.32-r89: Compilation broken on ia642012-02-27 01:07:20
401723ApplicationssoundUNCONFIRMEDmedia-libs/libaacplus USE=fftw causes segmentation faults - ?2012-02-01 17:47:41
401779Developmentx11UNCONFIRMEDx11-base/xorg-server-1.11.4 - XIO: fatal IO error 11 (Resource temporarily unavailable) on X server2012-02-01 17:35:48
401823Applicationspolynomial-cUNCONFIRMEDseamonkey desktop file lists unhandled mimetype associations2012-02-16 12:48:55
401903Core systembase-systemUNCONFIRMEDapp-admin/sysklogd-1.5-r2: improve default syslog.conf to match syslog-ng.conf behavior2012-02-02 17:46:23
401943Applicationssci-biologyUNCONFIRMEDsci-biology/transfac-3.2 - tfextract segmentation fault in 0x00007f5df6cc4487 in ajStrDel (Pstr=0x72012-02-04 17:26:44
402023KernelsecurityUNCONFIRMEDThe Linux kernel, when using IPv6, allows remote attackers to determine whether a host is sniffing t2012-02-03 04:38:20
402067Ebuildsmaintainer-wantedUNCONFIRMEDdev-utils/statifier - creates one file from dynamically linked executables and all its libraries2012-04-09 15:46:20
402211Applicationsmaintainer-wantedUNCONFIRMEDapp-misc/freeplane (app-misc/freemind replacement) - software to support thinking, sharing informati2012-10-16 14:54:19
402343Servernet-fsUNCONFIRMEDnet-fs/netatalk /etc/init.d/afpd needs avahi-daemon even if called with -nozeroconf2012-04-08 21:14:32
402355Applicationspam-bugsUNCONFIRMEDsys-auth/pam_keystore HOMEPAGE outdated (404)2012-02-06 20:31:29
402475HardenedhardenedUNCONFIRMEDXen DomU hardened kernel 3.1.8 and later crashes on boot2013-01-31 18:12:48
402493ApplicationsadaUNCONFIRMEDdev-ada/adasockets-1.8.4.7 - gnatmake: "listener.adb" compilation error2012-02-07 17:45:08
402689Applicationsgnome-accessibilityUNCONFIRMEDdev-libs/atk-2.2.0 doesn't honor LINGUAS for locale files2012-04-19 08:58:57
402741GamesgamesUNCONFIRMEDNew ebuild: games-rpg/analogue-demo - Analogue: A Hate Story2012-02-08 19:14:06
402749Otherrobbat2UNCONFIRMEDwillikins changelog feature broken2012-02-08 19:00:11
402817Portage Documentationbase-systemUNCONFIRMEDapp-arch/tar: Man page does not list that -p is default for superuser2012-02-09 08:30:53
402835Applicationssci-biologyUNCONFIRMEDsci-biology/ucsc-genome-browser: add -fPIC to CFLAGS and USE=+static-libs2013-02-17 08:24:19
402869Unspecifiedsci-mathematicsUNCONFIRMEDmedia-fonts/jsmath-extra-dark-1.0 is missing jsMath-cmmib102012-02-29 21:13:02
402925Ebuildsrobbat2UNCONFIRMEDdev-libs/yaz-3.0.50 with dev-libs/libgpg-error-1.10-r1[-static-libs] - libtool: grep: /usr/lib/libgp2012-02-10 18:05:02
402977Documentationdev-portageUNCONFIRMEDemerge --update doesn't update all packages which can be updated2012-03-05 10:02:22
403119Core systembase-systemUNCONFIRMEDReplace sys-apps/microcode-data with a separate sys-kernel/intel-ucode2013-01-01 21:57:37
403157DevelopmentrubyUNCONFIRMEDScript to dynamically add user rubygems bindir to PATH2012-02-14 12:01:37
403249Core systembase-systemUNCONFIRMEDsys-apps/coreutils-8.14: Fails test-parse-datetime (exit: 134)2012-03-29 07:20:53
403279Core systembase-systemUNCONFIRMED=sys-apps/coreutils-8.15 fails FEATURES=test2012-02-18 16:37:27
403327PrintingprintingUNCONFIRMEDnet-print/foomatic-db-ppds-4.0.20120117-r1: Missing NickName and ModelName in /usr/share/cups/model/2012-02-14 21:13:08
403439ServerpatrickUNCONFIRMEDwww-servers/apache: remove deprecated AddDirectoryIndex from default config2013-02-16 14:05:28
403523Core systemfreedesktop-bugsUNCONFIRMEDsys-power/pm-utils-1.4.1-r2: power.d/xfs_buffer writes wrong/invalid value(s) in battery mode2012-02-14 18:47:19
403551OtheraltUNCONFIRMEDCompilation of gcc-4.5.3-r1 fails with "configure: error: Link tests are not allowed after GCC_NO_EX2012-02-14 10:57:13
403579Ebuildsmaintainer-wantedUNCONFIRMEDdev-tex/latexdraw - a graphical drawing editor for LaTeX2012-04-29 18:30:43
403913Gamesmaintainer-wantedUNCONFIRMEDgames-emulation/fs-uae - a multi-platform Amiga emulator based on WinUAE/E-UAE/PUAE, with a focus on2012-02-15 17:27:10
404263EbuildsdotnetUNCONFIRMEDdev-lang/mono-2.10.5: remove MAKEOPTS=-j1 limitation2012-02-19 11:00:47
404273Ebuildsmaintainer-wantedUNCONFIRMEDx11-misc/dunst-9999 - (new ebuild) lightweight notification system with the looks of dmenu2012-07-02 10:02:30
404345Applicationspolynomial-cUNCONFIRMEDapp-emulation/virtualbox-modules-4.1.4 - work/vboxpci/linux/VBoxPci-linux.c:989:9: Fehler: Zu wenige2012-02-18 16:57:37
404423Unspecifiedcommon-lispUNCONFIRMEDdev-lisp/ecls-12.2.1 fails to run tests - An error occurred during initialization: Module error: Don2013-02-02 10:15:50
404439Ebuildsmaintainer-wantedUNCONFIRMEDapp-backup/rear - Fully automated disaster Recovery for GNU/Linux2013-01-18 12:20:52
405053Ebuildsx11UNCONFIRMEDx11-drivers/ati-drivers: EGL/OpenGL ES Features Broken.2012-02-20 18:05:48
405151ApplicationspatrickUNCONFIRMEDapp-emulation/virtualbox-guest-additions-4.1.4-r1: Failure to build with 3.2 kernel2012-04-02 07:44:24
405173Applicationsmedia-videoUNCONFIRMEDmedia-video/vlc-2.0.0 - /bin/sh: line 4: 2215 Segmentation fault ./vlc-cache-gen ../modules2012-09-19 13:09:28
405277ServerclusterUNCONFIRMEDsys-cluster/maui-3.3.1-r2 build time secret key configuration2012-05-05 21:15:46
405407Ebuildsmaintainer-wantedUNCONFIRMEDwww-misc/ppastats - a command line tool which retrieve statistics of a PPA and generates HTML pages.2012-02-23 22:08:20
405437ServerclusterUNCONFIRMEDsys-cluster/maui-3.3.1-r2 should CONFIG_PROTECT its configuration files2012-05-05 21:12:02
405461Ebuildsmaintainer-wantedUNCONFIRMEDapp-editors/sublime-text - a sophisticated text editor for code, html and prose2012-11-18 12:37:09
405549LibrarysrinclanUNCONFIRMEDdev-python/pywebkitgtk-1.1.8 crashes at start when using Pax/Hardened2012-06-10 01:24:13
405565Core systemflameeyesUNCONFIRMEDapp-emulation/lxc - init script affects other init scripts2012-10-02 07:38:11
405581Core systembase-systemUNCONFIRMEDapp-admin/sudo with net-nds/openldap-1.8.4_p1 - sudo: sudo_ldap_build_pass1 allocation mismatch2012-02-24 16:05:21
405643Ebuildsmaintainer-wantedUNCONFIRMEDapp-misc/stackapplet-1.5.1 - a small application that uses the new AppIndicator framework to display2012-02-26 17:22:22
405715JavajavaUNCONFIRMEDjava eclass improved documentation2012-02-25 09:32:02
405727Eclasses and ProfilesqaUNCONFIRMEDalternatives.eclass - various improvements2012-02-27 00:05:53
405783Documentationdev-portageUNCONFIRMEDemerge man page inadequate for -n option2012-02-27 00:24:38
405839GamesgamesUNCONFIRMEDdelay created when selecting tiles2012-02-26 03:03:55
405865JavajavaUNCONFIRMEDjavatoolkit improvement for xpath-like xml handling2012-02-26 15:48:58
405899Applicationsqmail-bugsUNCONFIRMEDnet-mail/queue-repair - /usr/bin/queue-repair.py: AttributeError: 'dict_keys' object has no attribut2012-02-27 01:35:46
406063KDEkdeUNCONFIRMEDkde-base/kmail-4.7.4-r1: clamav integration may crash kmail2012-03-03 23:00:18
406139Applicationsnet-dialupUNCONFIRMEDnet-dialup/ppp-2.4.5-r2: /etc/resolv.conf gets emptied upon connection re-negotiation.2012-04-06 22:11:33
406141ApplicationsljakabUNCONFIRMEDnet-misc/vpnc-0.5.3_p514: vpnc-script does not backup /etc/resolv.conf nor anticipate /etc/ppp/resol2013-02-06 15:31:36
406255Sandboxmaintainer-neededUNCONFIRMEDdev-libs/apr-1.4.6 failed test: testlfs : \/bin/bash: line 2: 3428 Segmentation fault (core d2012-12-29 17:08:08
406491Applicationsdesktop-wmUNCONFIRMEDx11-wm/oroborus-2.0.20 - menus in Qt applications do not appear2012-03-02 17:24:18
406579Ebuildsnet-dialupUNCONFIRMEDnet-dialup/ppp: pppoe-discovery don't work in ppp >=2.4.5 because of the patch pado-timeout.patch2012-09-23 14:15:04
406735Applicationsmedia-videoUNCONFIRMEDmedia-video/vlc-2.0.0 - erratic audio volume behaviour under Gnome32012-09-19 13:09:42
406773Keywording and Stabilizationsci-mathematicsUNCONFIRMED=sci-mathematics/maxima-5.28.0: Please stabilize2013-01-14 12:35:08
406775Applicationsmedia-tvUNCONFIRMEDapp-misc/lirc - lircd reports "read invalid data from device /dev/lirc0" and no more output afterwar2012-03-05 19:44:56
406779Keywording and Stabilizationsci-mathematicsUNCONFIRMED=sci-mathematics/wxmaxima-12.09.0: Please stabilize.2012-11-11 04:21:47
406811Coredev-portageUNCONFIRMEDFeature request: enhance portage with "buildsrcpkg" that captures all source files for GPL complianc2012-03-04 07:20:32
406895Ebuildsmaintainer-wantedUNCONFIRMEDmedia-gfx/psdparse-9999 - tools to parse Photoshop PSD/PSB format files2012-03-06 14:26:15
406937Ebuildsmaintainer-wantedUNCONFIRMEDdev-libs/rapidxml-1.13 - an attempt to create the fastest XML parser possible2012-03-05 20:41:21
407245EbuildswineUNCONFIRMEDapp-emulation/crossover-office-pro-bin-11.0.0 version bump2012-11-17 19:10:14
407279BugzillabugzillaUNCONFIRMEDGentoo Bugzilla sends secure bugs in dos(?) format2012-05-26 22:28:46
407349Ebuildsmaintainer-wantedUNCONFIRMEDapp-misc/mpdlcd - Display MPD status on a lcdproc server2012-03-08 21:41:55
407351Core - Dependenciesdev-portageUNCONFIRMEDDependency resolver should automatically pull an older version to resolve circular dependency2012-12-25 21:12:16
407589Ebuildsmaintainer-wantedUNCONFIRMEDdev-python/factory_boy : A versatile test fixtures replacement2012-03-12 12:07:45
407627Applicationsrobbat2UNCONFIRMEDsys-power/pmtools-20110323 turbostat.c:857:2: error: PIC register clobbered by ‘ebx’ in ‘asm’2012-10-07 09:44:42
407667Ebuildsmaintainer-neededUNCONFIRMEDnet-wireless/broadcom-sta-5.100.82.112-r2 has broken multicast patch2013-02-03 13:03:15
407711Unspecifiedx11UNCONFIRMEDx11-drivers/ati-drivers-12.2: amdcccle segfaults when changing desktop settings2012-03-12 19:29:06
407841ApplicationsperlUNCONFIRMED=dev-lang/perl-5.14.2[build] is missing feature.pm, required by aclocal (during stage building)2012-05-27 02:40:44
408013Ebuildsmaintainer-wantedUNCONFIRMEDdev-python/netzob - Network protocol modelization by reverse engineering2012-05-09 15:21:42
408047Core systembase-systemUNCONFIRMEDsys-fs/cryptsetup-1.4.1 fails 4 tests : password-hash-test loopaes-test compat-test api-test2013-01-20 10:26:44
408049BugzillabugzillaUNCONFIRMEDplease make "auto select" a default for attachments2012-08-05 10:49:24
408089Keywording and Stabilizationrobbat2UNCONFIRMEDsys-power/pmtools-20110323: stabilize any version providing turbostat utility2012-10-07 09:45:03
408091Core systemfreedesktop-bugsUNCONFIRMEDsys-power/pm-utils-1.4.1-r2: Add logrotate configuration2012-03-14 04:08:11
408147UnspecifiedpythonUNCONFIRMEDapp-admin/eselect-python with FEATURES="nomac nodoc" - eselect python does not set man page (...)2012-03-14 19:23:10
408191EbuildsaballierUNCONFIRMEDnet-nntp/hellanzb uses deprecated opts in init script2012-06-07 16:11:26
408221Ebuildsmaintainer-wantedUNCONFIRMEDdev-python/SquareMap-1.0.1_beta3: Hierarchic data-visualisation control for wxPython2012-03-15 01:15:37
408405Ebuildsmaintainer-wantedUNCONFIRMEDmedia-sound/nuvola_player - Nuvola Player - Cloud music integration for your Linux desktop2013-01-15 14:41:55
408505Installation HandbookembeddedUNCONFIRMEDqemu-user chroot information is outdated2012-03-27 08:13:11
408607Applicationspolynomial-cUNCONFIRMEDapp-emulation/virtualbox - make --disable-vmmraw optional2012-03-18 05:32:07
408611Applicationspolynomial-cUNCONFIRMEDx11-drivers/xf86-video-virtualbox-4.1.10 - work/VirtualBox-4.1.10/include/iprt/types.h:112:30: fatal2013-01-31 09:32:22
408615GamesgamesUNCONFIRMEDgames.eclass should not put /usr/games/bin in $PATH for non-games users2012-05-24 16:56:17
408643Unspecifiedx11UNCONFIRMEDapp-admin/eselect-mesa needs update for r600 changes in mesa2012-07-11 11:14:47
409015DevelopmentxarthisiusUNCONFIRMEDdev-util/intel-ocl-sdk: libOpenCL.so uses incompatible SONAME without SOVERSION2012-10-02 16:31:38
409119ApplicationscppUNCONFIRMEDdev-libs/STLport-5.2.1 - Fatal error: can't create obj/gcc/so/dll_main.o: No such file or directory2012-03-21 09:41:23
409181Applicationsrobbat2UNCONFIRMEDapp-misc/g15stats - script does not parse extra options2013-01-31 19:03:48
409189EbuildsflameeyesUNCONFIRMEDapp-emulation/lxc-0.8.0_rc2-r1 : add {pre,post}{up,down} capabilities to init script [patch]2012-10-02 07:36:42
409295ApplicationsmozillaUNCONFIRMEDmail-client/thunderbird-bin-10.0.2 - HTTP links cannot be opened - Failed to load native module at p2012-03-23 15:08:47
409555Applicationsnet-imUNCONFIRMEDnet-im/gg-transport-2.2.4 segmentation fault in local_translate (str=0x34eb52fbcac "\203=\365\377\062012-12-16 14:28:04
409641DevelopmentaraujoUNCONFIRMEDdev-lang/io-2009.01.02-r2: Uncomment the IO_USE_SIMD define to turn on SIMD acceleration2012-12-24 08:55:55
409653Core systemxmwUNCONFIRMEDsys-power/suspend-0.8-r1 - Hibernate freezes on "Snapshotting system..." when firefox is working2012-03-26 19:00:56
409787OpenRCopenrcUNCONFIRMEDsys-apps/openrc-0.9.9.3: "rc-status -a" doesn't display all started services2012-11-07 15:40:11
409869Ebuildsmaintainer-wantedUNCONFIRMEDapp-emulation/virtualbricks-0.6.352 - A GTK frontend for VDE and QEMU/KVM2012-12-08 17:33:25
409947Unspecifiedapp-backupUNCONFIRMEDapp-backup/rdiff-backup-1.3.3 - "Security Violation" warning then "Fatal Error"2012-03-30 06:29:16
409961Applicationspolynomial-cUNCONFIRMEDapp-emulation/virtualbox-4.1.10[vboxwebsrv] with net-libs/gsoap-2.8.8[gnutls] - /usr/lib64/libgsoaps2012-03-28 12:53:46
410017Ebuildsnet-imUNCONFIRMEDnet-im/ejabberd - add patch for remote roster2013-01-24 10:41:29
410033Core systemmaintainer-neededUNCONFIRMEDsys-power/cpufreqd crashes on AC transition or startup with ACPI battery support2012-11-18 12:15:37
410053Applicationsidella4UNCONFIRMEDapp-emulation/xen-tools-4.1.2-r2 init script throws: option 'a' not supported2012-06-08 07:16:47
410065ServererasUNCONFIRMEDnet-mail/dovecot-2.1.3 fails at parallel make: fatal error: ../../../src/plugins/quota/rquota.h: No 2012-07-12 15:51:16
410371ApplicationslackUNCONFIRMEDwww-plugins/adobe-flash-11.2.202.228 segmentation fault in mozalloc_abort(char const*) () from /usr/2012-12-15 19:35:06
410383Ebuildsmaintainer-wantedUNCONFIRMEDdev-cpp/cppcms - a Free C++ Web Development Framework aimed for Rapid Web Application Development2013-01-14 21:48:56
410389ApplicationstomjbeUNCONFIRMEDmedia-radio/fldigi segfaults at start up2012-04-07 22:14:10
410427Applicationsmedia-tvUNCONFIRMEDmedia-tv/freevo-1.9.0 needs dev-python/gdata for the youtube plugin2012-04-02 02:30:30
410527GamesgamesUNCONFIRMEDgames-board/scid-vs-pc-4.7 - A free chess database application2012-05-12 10:28:17
410549ServernetmonUNCONFIRMEDnet-analyzer/ntop init.d script looks for ntop data at a hardcoded location2012-04-06 22:12:41
410553UnspecifiedswaponUNCONFIRMEDx11-drivers/xf86-video-virtualbox / app-emulation/virtualbox-guest-additions fail to cross-compile2012-04-03 15:23:22
410631Applicationslu_zeroUNCONFIRMEDx11-drivers/ati-drivers-12.3 DMA bug with intel_iommu2012-05-04 15:26:08
410651gpackages - http://packages.gentoo.org/gpackagesUNCONFIRMED500 Error, not a valid package atom2012-12-30 17:46:20
410663Applicationsford_prefectUNCONFIRMEDmedia-sound/pulseaudio - without "flat-volumes = no" in daemon.conf pulseaudio doesn't restore mixer2012-04-04 07:10:48
410713Ebuildsmaintainer-wantedUNCONFIRMEDdev-db/cppdb - an SQL connectivity library for platform and database independent connectivity2012-06-28 17:50:44
410727ApplicationsgnustepUNCONFIRMEDgnustep-base/gnustep-back-xlib-0.18.0 - sandbox violation in /root/var by plmerge libgnustep-back-012012-05-02 06:36:52
410831libbashbetelgeuseUNCONFIRMEDRead builtin implementation2012-04-05 01:32:10
411077Applicationsdesktop-dockUNCONFIRMEDx11-plugins/wmauda-0.8 - wmauda.c:126:11: error: expected '=', ',', ';', 'asm' or '__attribute__' be2012-11-07 21:33:21
411087Core systemmaintainer-wantedUNCONFIRMEDsys-fs/ddumbfs-1.0.11 - An inline data deduplicating filesystem designed with backup in mind2012-04-07 14:35:41
411099GamesgamesUNCONFIRMEDgames-simulation/tpt_merbo-1.0 - A mod of The Powder Toy, a particle simulator2012-04-07 15:00:08
411115Developmentrobbat2UNCONFIRMEDdev-util/rats-2.3 version bump and HOMEPAGE change2012-04-07 08:41:07
411461OpenRCopenrcUNCONFIRMEDsys-apps/openrc-0.9.8.4: services fail to start at boot because of "stalled" deptree cache2012-04-10 12:21:07
411515Ebuildsmaintainer-wantedUNCONFIRMEDdev-util/peg - tools for generating recursive-descent parsers.2012-06-30 09:24:16
411521ApplicationsmgornyUNCONFIRMEDapp-arch/zpaq-4.04 execution attempt in: 2013-01-12 17:31:30
411619Ebuildsmaintainer-wantedUNCONFIRMEDmedia-sound/rockbox-utility - Graphical utility for automating Rockbox firmware installation and man2012-11-07 20:02:26
411747Ebuildsx11UNCONFIRMEDx11-drivers/xf86-video-ati 6.14.3-6.14.4: Vertical pixel-line display artifacts from fvwm desktop m2012-12-15 18:54:01
411861Ebuildsapp-backupUNCONFIRMEDapp-backup/backuppc-3.2.1-r1 needs several apache modules: ebuild should enforce that2012-04-14 05:51:11
411895Ebuildsmaintainer-wantedUNCONFIRMEDapp-text/peg-markdown -- an implementation of John Gruber's markdown in C2012-06-30 09:24:16
411901EbuildsvadimkUNCONFIRMEDapp-emulation/vmware-workstation-8* - Add system.d service2012-09-09 03:55:17
412041Ebuildsmaintainer-wantedUNCONFIRMEDmedia-sound/mudita24-1.0.3 - an application controlling the digital mixer, channel gains and other h2012-04-16 10:43:36
412135PrintingreavertmUNCONFIRMEDapp-text/poppler-0.16.7 and 0.20.2: pdftops creates postscript files which don't print on Brother MF2012-11-25 21:17:48
412217LibrarysoundUNCONFIRMEDdev-libs/redland-1.0.15 has malformed Makefile, won't emerge: "missing separator"2012-04-16 17:47:14
412457Librarymedia-videoUNCONFIRMEDmedia-video/gpac-0.4.5-r4 - ld: wxOsmo4.o: in function wxCreateApp():wxOsmo4.cpp(.text+0x1c): error:2012-04-18 15:19:39
412695ApplicationsvirtualizationUNCONFIRMED[virtualization overlay] app-emulation/xen-tools-9999 fails to unpack2012-04-21 17:28:46
412699libbashbetelgeuseUNCONFIRMEDSet builtin implementation2012-04-19 21:58:38
412921Ebuildsmaintainer-wantedUNCONFIRMEDapp-text/peg-multimarkdown - An implementation of MultiMarkdown in C, using a PEG grammar2012-04-24 14:13:30
412941Applicationspam-bugsUNCONFIRMEDsys-auth/pam_blue-0.9.0: various username matching problems2012-05-21 21:45:01
413041ApplicationssciUNCONFIRMEDsci-misc/boinc fails(?) when ntpdate (/etc/init.d/ntp-client) is used to abruptly change the system 2012-04-24 20:13:47
413167Prefix SupportprefixUNCONFIRMEDsys-fs/fuse-2.9.0: emerge failed at compile phase.2012-04-22 23:17:14
413173Applicationsnet-fsUNCONFIRMEDnet-fs/nfs-utils - /etc/init.d/nfs and /etc/init.d/nfsmount calculate their dependencies incorrectly2012-05-18 05:15:48
413269Ebuildsqmail-bugsUNCONFIRMEDmail-mta/netqmail-1.06 Add checkuser patch?2012-04-24 09:33:04
413299GNOMEgnomeUNCONFIRMEDgnome2.eclass should allow user patches2012-05-19 22:58:47
413467Applicationspolynomial-cUNCONFIRMEDapp-emulation/virtualbox-4.1.12: parallel build sometimes fails2013-01-07 06:25:45
413581ApplicationsevaUNCONFIRMEDnet-voip/telepathy-salut-0.8.0 - .../work/telepathy-salut-0.8.0/src/.libs/libsalut-plugins.so: file 2013-02-11 14:04:35
413623ApplicationsproaudioUNCONFIRMEDmedia-sound/terminatorx 3.82 and 3.84 - tX_midiin.cc:452:2: error: cannot convert ‘gzFile_s**’ to ‘g2013-01-06 04:23:20
413649Ebuildsnet-fsUNCONFIRMEDnet-fs/netatalk-2.2.1-r3 broken after upgrade2012-04-27 15:10:49
413659DevelopmentadaUNCONFIRMEDdev-lang/gnat-gcc 4.6.2 4.7.0 version bumps2012-09-11 19:00:29
413743EbuildsgamesUNCONFIRMEDapp-emulation/vice: Add a USE-flag for the SDL-UI2012-04-27 15:56:03
413793ApplicationsvadimkUNCONFIRMEDapp-emulation/vmware-workstation-8.0.2.591240 should tell users to be in vmware group2012-05-01 22:10:58
413863DevelopmentpythonUNCONFIRMEDdev-lang/python-3.2.3 - improve cross compilation2012-12-17 14:57:26
413979Core systemrobbat2UNCONFIRMEDlvm2create_initrd in sys-fs/lvm2-2.02.95-r1 fails to setup $LVM variable properly in initrd2013-01-17 23:44:45
414155OpenRCopenrcUNCONFIRMED[patch] sys-apps/openrc local service enhancement2012-05-03 15:44:00
414185ApplicationstheologyUNCONFIRMEDapp-text/xiphos-3.1.5 segmentation fault2012-05-03 00:35:43
414249Core - Dependenciesdev-portageUNCONFIRMEDAutomatically keyword/unmask all dependencies with a single entry2012-12-25 21:12:28
414273Ebuildsmaintainer-neededUNCONFIRMEDmedia-gfx/picasa USE=nsplugin - alternatively depend on www-client/firefox / www-client/firefox-bin2013-02-10 08:42:58
414429EbuildstommyUNCONFIRMEDdev-vcs/subversion-1.7.4 mod_dav_svn UTF8 patch2012-05-03 03:43:46
414451Ebuildsnet-fsUNCONFIRMEDnet-fs/netatalk-2.2.2 USE=kerberos with app-crypt/heimdal - uams_gss.c:201:37: error: 'gss_nt_servic2012-05-03 16:05:11
414535EbuildsflameeyesUNCONFIRMEDapp-emulation/lxc should support doc use flag2013-01-12 02:20:44
414549Libraryamd64UNCONFIRMEDapp-emulation/emul-linux-x86-*; support for running PCSX2 32-bit released binary (or own)2012-07-18 15:48:39
414793Core systemclusterUNCONFIRMEDsys-cluster/maui-3.3.1-r2 - ERROR: cannot setpgrp, errno: 1 (Operation not permitted)2012-08-06 03:49:46
414815PMS/EAPIpms-bugsUNCONFIRMED[Future EAPI] Support for repository dependencies in DEPEND, PDEPEND and RDEPEND and atoms passed to2013-01-12 13:12:54
414829Applicationseric.joshua.martinUNCONFIRMEDwww-apps/rt-4.0.5: Generated.pm configured directories point to /usr/share/webapps instaed of webapp2012-05-06 22:45:45
415029Applicationsmaintainer-wantedUNCONFIRMEDapp-misc/doublecmd - Double Commander is a cross platform open source file manager with two panels s2012-08-09 06:24:21
415209Enhancement/Feature Requestsdev-portageUNCONFIRMEDcross-emerge into alternative root does not install build time dependencies in alternative root2012-05-09 19:26:34
415305EbuildssoundUNCONFIRMEDmedia-sound/shoutcast-server-bin - update HOMEPAGE so that pkg_nofetch() is more helpful2012-10-28 04:33:12
415375Ebuildsmaintainer-wantedUNCONFIRMEDapp-office/makebeamerinfo - Creates .info file for use with app-office/impressive and dev-tex/latex-2012-05-10 14:51:46
415399EbuildsfauliUNCONFIRMEDapp-portage/g-ctan-2011.1 does not list pgfplots in CTAN database2012-12-16 13:13:12
415423EbuildstexUNCONFIRMEDupdate moderncv (included in dev-texlive/texlive-latexextra)2013-01-09 16:50:56
415531Core systemmaintainer-wantedUNCONFIRMEDsys-kernel/uksm-sources - Full Linux sources including the Gentoo patchset and UKSM patch2012-05-13 02:28:39
415699Core systemclusterUNCONFIRMEDsys-cluster/maui-3.3.1-r2: showstats segfaults2012-10-05 16:06:37
415705EbuildsmozillaUNCONFIRMEDdev-libs/nspr-4.9: native-nsinstall: cannot access nspr-config (error installations by cross compila2013-01-05 13:03:46
415829Ebuildsmaintainer-wantedUNCONFIRMEDsci-chemistry/cclib-1.0.1 - Library for parsing and interpreting the results of computational chemis2012-05-15 15:01:01
415913GamesgamesUNCONFIRMEDgames-sports/speed-dreams new version 2.0 available - please update2013-01-28 08:07:00
415931ApplicationslackUNCONFIRMEDapp-admin/gkrellm patch for ATI radeon temperature support2012-05-15 16:33:50
415989Librarymaintainer-wantedUNCONFIRMEDdev-python/prettytable-python-0.6 - Python interface to print pretty tabular data2012-12-12 10:10:18
416023Ebuildsmaintainer-wantedUNCONFIRMEDdev-php/zend-gdata - provides PHP 5 client interfaces for the Google Data API2012-05-16 02:59:27
416211Keywording and StabilizationgamesUNCONFIRMEDPlease stabilize app-emulation/vice-2.3 for PPC2012-05-16 11:36:08
416267Applicationsapp-backupUNCONFIRMEDapp-backup/backuppc-3.2.1 hangs and shows warnings about deprecated qw(...) with perl-5.142012-05-16 14:10:07
416355Ebuildsmaintainer-wantedUNCONFIRMEDkde-misc/kimtoy - an input method frontend for kde, alternative to kimpanel2012-05-29 03:54:14
416387ApplicationshannoUNCONFIRMEDnet-analyzer/openvas-scanner - openvassd: serving 127.0.0.1: Libgcrypt warning: missing initializati2012-05-18 14:57:06
416415HardenedhardenedUNCONFIRMEDsys-apps/v86d-0.1.10 fails to read EBDA with GRKERNSEC_KMEM=y on some configurations2012-06-11 17:44:30
416641Ebuildslang-miscUNCONFIRMEDdev-lang/fpc-2.6.0 configuration files contain paths with ${D}2012-05-21 03:37:35
416835ApplicationsgraphicsUNCONFIRMEDmedia-gfx/nip2 should support USE="compat examples"2013-02-16 14:13:54
416865EbuildschutzpahUNCONFIRMEDmail-filter/spamassassin-fuzzyocr-3.6.0-r2 various patches2013-01-21 18:15:37
416921Ebuildsmaintainer-wantedUNCONFIRMEDapp-backup/automysqlbackup-3.0_rc6 - Automatic MySQL Backup2012-09-09 11:04:39
417129Applicationsidl0rUNCONFIRMEDnet-dns/bind-tools-9.8.1[ssl] hardcodes OpenSSL path checks which breaks cross-compiling/etc...2013-02-08 06:12:18
417161Ebuildsmaintainer-wantedUNCONFIRMEDsys-fs/csvfs - file system representation of CSV data2012-06-10 03:48:18
417191Ebuildsamd64UNCONFIRMEDapp-emulation/emul-linux-x86-gtklibs-20120520 needs pax marking - gtk-query-immodules-2.0-32: error 2012-12-12 16:42:02
417409Core systemhardened-kernelUNCONFIRMEDsys-kernel/hardened-sources-3.2.11 - beam: page allocation failure: order:1, mode:0x20 or swapper: p2012-05-28 10:16:10
417515Unclassifieddev-portageUNCONFIRMEDsys-apps/portage-2.1.10.49 etc-update finds rc.conf twice2012-05-27 21:31:38
417639DevelopmentswegenerUNCONFIRMEDdev-util/systemtap-1.7: error: gettext infrastructure mismatch: using a Makefile.in.in from gettext 2012-12-15 13:34:09
417661ApplicationsjlecUNCONFIRMEDgnome-extra/zeitgeist-datasources[bzr] dev-vcs/bzr-gtk file collision: /usr/share/pixmaps/bzr-icon-62012-05-28 00:01:10
417681Ebuildsmaintainer-wantedUNCONFIRMEDmedia-plugins/gimp-apng-0.1.0 - provides Animated PNG (APNG) image file load and save modules for th2012-07-06 20:09:12
417687ApplicationsmozillaUNCONFIRMEDmail-client/thunderbird www-client/seamonkey segfault at startup if nss_ldap/openldap are installed2012-10-22 16:13:48
417717Unspecifiedshell-toolsUNCONFIRMED[Tracker] bash completion files that fail with paths containing spaces2012-05-28 10:15:02
417871LiveCD/DVDtenUNCONFIRMED12.1 amd64 livedvd sshd default configuration AllowUsers line makes usage difficult2012-07-08 17:05:19
417895JavajavaUNCONFIRMEDdev-java/stringtemplate-4.0.6 released2012-12-07 19:10:27
417921ApplicationsvimUNCONFIRMEDapp-editors/vim - bash completion fails with paths containing spaces2012-05-28 11:50:58
417925Applicationsshell-toolsUNCONFIRMEDapp-shells/gentoo-bashcomp - bash completion fails with paths containing spaces2012-05-28 11:51:25
417927ApplicationstexUNCONFIRMEDdev-tex/latexmk - bash completion fails with paths containing spaces2012-05-28 11:51:57
417945Applicationsshell-toolsUNCONFIRMEDapp-misc/devtodo - bash completion fails with paths containing spaces2012-05-28 12:08:16
417947Applicationsmr_bones_UNCONFIRMEDapp-misc/figlet - bash completion fails with paths containing spaces2012-05-28 12:08:37
417991Developmentphp-bugsUNCONFIRMEDdev-php/phpunit-3.5.13 should RDEPEND on 2012-10-14 15:29:54
418007DevelopmentmaksbotanUNCONFIRMEDdev-python/scrapy-0.14.4 fails in setup while parsing urlparse_monkeypatches.py2012-06-14 16:40:49
418063EbuildssoundUNCONFIRMEDmedia-libs/libclxclient-3.6.1 doesn't create major version symlink to libclxclient.so.3.6.12013-01-26 17:59:37
418065EbuildssoundUNCONFIRMEDmedialibs/libclthreads-2.4.0 doesn't create major version symlink to libclthreads.so.2.4.02012-10-04 15:44:15
418195Ebuildsmaintainer-wantedUNCONFIRMEDsci-misc/hets - the Heterogeneous Tool Set, a parsing, static analysis and proof management tool2012-05-30 12:49:44
418199ApplicationsgrozinUNCONFIRMEDsci-libs/mathgl-1.11.2 install phase - ln: failed to create symbolic link './mathgl-1.11.2/ChangeLog2012-06-04 09:41:36
418281Applicationssci-mathematicsUNCONFIRMED[sci-overlay] sci-mathematics/scilab-5.3.3-r1 - .../work/scilab-5.3.3/modules/renderer/src/java/org/2012-12-25 13:20:36
418285Ebuildsmaintainer-wantedUNCONFIRMEDmedia-libs/dcmtk - DCMTK - a collection of libraries and applications implementing large parts the D2012-05-30 18:44:00
418343ApplicationsmarioUNCONFIRMEDapp-cdr/xfburn-0.4.3-r3 - /usr/share/applications/xfburn.desktop: file contains key "MimeType" in gr2012-05-31 14:59:11
418403Ebuildsmaintainer-wantedUNCONFIRMEDapp-admin/puppet-dashboard - a web interface providing node classification and reporting features fo2012-10-09 03:21:48
418567Applicationsshell-toolsUNCONFIRMEDapp-misc/byobu-5.18: create session failed: /usr/bin/byobu-shell: Too many open files2013-02-06 16:13:27
418625Applicationssci-biologyUNCONFIRMEDsci-biology/gatk-1.5: error: name clash: sum(Collection) and sum(Collection) have t2013-02-17 08:28:02
419055GamesgamesUNCONFIRMEDgames-emulation:mednafen-0.9.21 does not compile2012-06-01 20:48:36
419167Ebuildsmaintainer-wantedUNCONFIRMEDgames-rpg/bastion-20120529-r2 - an original action role-playing game set in a lush imaginative world2012-09-25 08:31:15
419335UnspecifiedfontsUNCONFIRMEDmedia-libs/fontconfig-? - fc-cat charmap field shows gibberish2012-09-14 22:56:18
419389ApplicationsradhermitUNCONFIRMEDwww-client/lynx-2.8.8_pre12 fails to build: ../../../WWW/Library/Implementation/HTUtils.h:735:17: fa2012-06-16 09:40:28
419427GamesgamesUNCONFIRMEDgames-strategy/darwinia-1.43 update2012-06-03 04:25:52
419441GamesgamesUNCONFIRMEDgames-strategy/defcon-1.6 update2012-06-03 04:29:47
419515FreeBSDbsdUNCONFIRMED[keywordreq] dev-util/catalyst and deps compile on amd64-fbsd2012-06-19 23:44:29
419545GamesgamesUNCONFIRMEDgames-puzzle/chocolate-castle new ebuild2012-06-04 19:50:10
419591FreeBSDbsdUNCONFIRMEDCreate an OpenJDK ebuild based on the FreeBSD port2012-06-04 09:05:30
419739Ebuildsx11UNCONFIRMEDx11-libs/libXft-2.2.0 - configure: package fontconfig not found in pkg-config search path2012-06-05 23:45:00
419755GamesgamesUNCONFIRMEDSupport amd64 for games-strategy/heroes32012-09-04 02:13:09
419769GNOMEgnomeUNCONFIRMEDx11-libs/gtk+-2.24.10-r1 ROOT=/foo - configure: packages atk and gdk-pixbuf-2.0 was not found in pkg2012-06-07 13:09:06
419793Prefix SupportprefixUNCONFIRMEDapp-emulation/hercules-3.07: install failed due to chown root2012-08-25 06:35:42
419833ApplicationsmozillaUNCONFIRMEDmail-client/thunderbird-10.0.4 encoding "pdf" attachment as "video/x-flv"2012-06-07 12:28:52
419847Ebuildsmaintainer-wantedUNCONFIRMEDmedia-plugins/gst-editing-services - a high-level library for facilitating the creation of audio/vi2012-07-08 08:53:36
419921LibrarysciUNCONFIRMED[science overlay] sci-libs/framewave-1.3.1 - At global scope: domain/common/include/fe.h:1305:19: er2012-06-26 07:30:08
419985Ebuildsx11UNCONFIRMEDx11-drivers/xf86-video-intel - Add plymouth integration2012-09-11 07:58:49
420033DevelopmentperlUNCONFIRMEDdev-perl/MooseX-Types-DateTimeX fails tests with MooseX-Types-DateTime-ButMaintained-0.140.02012-06-07 09:09:11
420067Ebuildsidella4UNCONFIRMEDapp-emulation/xen-tools init script for baselayout 22012-07-03 18:30:16
420095Applicationsrobbat2UNCONFIRMEDsci-mathematics/glpk-4.47 USE=mysql with dev-db/mariadb:5.5 - /usr/include/mysql/m_string.h:177:14: 2012-12-12 19:59:28
420291Applicationspolynomial-cUNCONFIRMEDnet-irc/xchat-2.8.8-r2 fails to build2012-06-11 18:44:41
420459Enhancement/Feature Requestsdev-portageUNCONFIRMEDemerge --keep-going should leave behind --resume state for skipped/failed builds2012-09-07 04:13:06
420473ApplicationsnetmonUNCONFIRMEDnet-analyzer/fail2ban-0.8.6 violates Date-Mailheader standards when using sendmail*-actions and havi2012-12-17 11:17:57
420495ApplicationsfauliUNCONFIRMEDapp-portage/g-ctan should provide explicit database update options2012-06-11 11:20:54
420573UnspecifiedhaskellUNCONFIRMEDhaskell-updater wrongly identifies packages as not installed by package manager2012-06-12 18:40:25
420577Portage Documentationdev-portageUNCONFIRMEDsys-apps/portage: Polish manuals are severely outdated2013-01-05 13:26:13
420611GamesgamesUNCONFIRMEDgames-strategy/gratuitous-space-battles - new ebuild2012-06-11 00:31:04
420623PrintingprintingUNCONFIRMEDnet-print/foo2zjs-99999999 fails emerge with permission denied, access attempt outside the sandbox2013-01-27 23:07:16
420627Ebuildsmaintainer-wantedUNCONFIRMEDgames-strategy/multiwinia - new ebuild2012-06-11 07:42:45
420715Applicationsx11UNCONFIRMEDx11-misc/imake hardcodes /usr/lib/X11 paths (ignoring multilib settings)2012-09-11 06:15:16
420733Applicationsx11UNCONFIRMEDx11-drivers/ati-drivers-12.4 - fgrlx module crash on startx2012-06-13 09:46:44
420939ApplicationswltUNCONFIRMEDFirebird-2.5.1.26351.0 with use xinetd implies superclassic patch and cannot build/install fb_inet_s2012-06-13 07:50:17
421077JavajavaUNCONFIRMEDdev-java/icedtea-7.2.2 compilation fails with Unrecognised option: -XX:-PrintVMOptions2012-10-18 16:15:26
421159DevelopmentperlUNCONFIRMEDvirtual/perl-libnet needs updated RDEPEND2012-06-15 15:36:15
421223JavajavaUNCONFIRMEDdev-java/gnu-classpath should make installing /usr/gnu-classpath-*/bin scripts optional2012-06-15 11:06:00
421309GamesgamesUNCONFIRMEDgames-emulation/jpcsp-bin - new ebuild2012-06-16 23:31:27
421353Core - Interface (emerge)dev-portageUNCONFIRMED'The following REQUIRED_USE flag constraints are unsatisfied:' is not specific enough2013-01-14 09:02:15
421363Applicationsx11UNCONFIRMEDx11-apps/xinput_calibrator-0.7.5[-gtk] installs incorrect desktop entry2012-06-19 11:43:59
421459Applicationssci-geosciencesUNCONFIRMEDsci-geosciences/grass-6.4.2, strange Exec entries in /usr/share/applications/grass64-grass.desktop2012-11-21 18:48:02
421623DevelopmenthaskellUNCONFIRMEDdev-lang/ghc-7.4.1-r1: unable to compile with portage because it results in a segmentation fault.2012-06-19 16:29:37
421741Developmentrobbat2UNCONFIRMEDdev-vcs/git-1.7.3.4-r1: test t7508-status.sh failed with FEATURES="sandbox -userpriv"2012-06-19 15:11:50
421829ApplicationsgstreamerUNCONFIRMEDmedia-plugins/gst-plugins-ffmpeg-0.10.13-r1 with ABI=x32 - libswscale/x86/swscale_template.c:998: Er2012-09-11 06:15:09
421845ApplicationsqemuUNCONFIRMEDapp-emulation/qemu: ABI=x32 support2012-12-13 22:09:00
421849UnspecifiedramerethUNCONFIRMEDdev-vcs/gitolite and dev-vcs/gitolite-gentoo - gl-setup fails:Unsuccessful stat on filename containi2012-06-28 20:12:53
422447ApplicationsmozillaUNCONFIRMEDwww-client/firefox 10.0.5 creates /tmp/mozilla-media-cache2012-06-20 12:56:08
422491Coredev-portageUNCONFIRMEDemerging updates to nfs-mounted file systems can cause running programs to segfault2012-06-21 02:59:59
422727ApplicationshannoUNCONFIRMEDapp-emulation/dosemu-1.4.1_pre20091009 - exits with SIGILL2012-06-21 15:43:13
422877Core systembase-systemUNCONFIRMEDnet-firewall/iptables: ip6tables "state" test fails; will not jump to ACCEPT on ESTABLISHED,RELATED 2013-02-16 13:31:38
422909ApplicationsgnomeUNCONFIRMEDmail-client/evolution-3.2.3-r1 lost configuration information - (evolution:11395): evolution-network2012-06-23 07:38:20
423031GamesgamesUNCONFIRMEDgames-puzzle/mindless-1.6 crash in generating sealed deck2012-08-27 12:45:23
423137ApplicationsvimUNCONFIRMEDapp-editors/vim-7.3.409: Misleading and outdated hint on solving a problem2012-06-26 14:55:41
423151Ebuildslu_zeroUNCONFIRMEDapp-emulation/qemu-user-1.1.0 requires python2 >= 2.42012-06-27 21:02:40
423167Developmentphp-bugsUNCONFIRMEDdev-php/pecl-http-1.7.4 fails at runtime with "undefined symbol: gcry_control" when using net-libs/g2012-08-01 12:00:35
423313Toolstools-portageUNCONFIRMEDrevdep-rebuild does not fix /usr/lib/libstartup-notification-1.so.0 // www-client/firefox-10.0.5 - l2012-08-03 11:54:41
423355Applicationspolynomial-cUNCONFIRMEDapp-emulation/virtualbox - remove `-f' from VBox_load_modules2012-07-26 14:30:14
423551EbuildsvimUNCONFIRMEDapp-vim/matrix - high memory usage / memory leak2012-07-11 01:20:36
423867Ebuildsmaintainer-wantedUNCONFIRMEDdev-vcs/gync - Synchronize data of desktop applications with Git2012-09-27 07:19:07
423993GNOMEgnomeUNCONFIRMEDgnome-base/gnome-keyring: unable to create a new keyring due general protection2013-02-01 20:57:07
424003Ebuildsmaintainer-wantedUNCONFIRMED[science overlay] sci-physics/thepeg - Toolkit for High Energy Physics Event Generation2013-02-08 01:02:18
424191Gamesmaintainer-wantedUNCONFIRMEDgames-strategy/vcmi-data-0.89 - Data files for the turn based strategy game HOMM3 clone VCMI2013-01-28 21:27:50
424193Gamesmaintainer-wantedUNCONFIRMEDgames-strategy/vcmi-0.89.ebuild - a free HOMM 3 clone2013-01-28 21:26:51
424321GamesgamesUNCONFIRMEDgames-emulation/hatari-1.6.2 version bump2012-10-06 07:31:47
424341GamesgamesUNCONFIRMEDgames-puzzle/enigma prevents upgrade of games-fps/sauerbraten and games-rpg/mana (blocker in slots o2012-11-24 03:10:20
424357EbuildsnirbheekUNCONFIRMEDdev-python/pypy-1.9-r1: There is NOT at least 4 gibibytes RAM2012-12-16 10:05:41
424373ApplicationspatrickUNCONFIRMEDnet-misc/strongswan-5.0.0 - Outdated description about (non-)root privileges2012-07-03 14:39:13
424445GamesgamesUNCONFIRMEDufo-ai-2.4 fails with Com_EParseValue: Illegal color statement '1 .874 .294 1'2012-08-02 20:55:27
424453Core systembase-systemUNCONFIRMEDsys-devel/automake-1.1[12] cause warning in combination with dev-lang/perl-5.16.02012-07-03 16:25:08
424463EbuildsrafaelmartinsUNCONFIRMEDapp-portage/g-octave please provide an updated database2012-08-03 22:03:54
424657Applicationsrobbat2UNCONFIRMEDapp-portage/g-cpan-0.16.4-r1 uses code that is depreciated in perl-5.16.02012-07-18 05:39:50
424797EbuildspatrickUNCONFIRMEDapp-emulation/virtualbox-guest-additions-4.1.12: Successfully built on no-multilib amd642012-07-06 04:27:50
424816ApplicationspatrickUNCONFIRMEDapp-emulation/virtualbox-guest-additions-4.1.12 and x11-drivers/xf86-video-virtualbox-4.1.12 fail to2012-12-26 21:09:46
424818Ebuildsmaintainer-wantedUNCONFIRMEDnet-nntp/moviegrabber - a fully automated way of downloading movies from usenet2012-11-29 03:18:46
424830Ebuildsmaintainer-wantedUNCONFIRMEDnet-p2p/couchpotatoserver - an automatic NZB and torrent downloader2012-10-07 03:34:59
424832Ebuildsmaintainer-wantedUNCONFIRMEDmedia-sound?/headphones - Automatic music downloader for SABnzbd2013-01-23 03:28:15
424840ApplicationsolegUNCONFIRMEDnet-wireless/reaver-1.4 should probably maintain database in /var/lib/reaver, not /etc/reaver2012-07-05 15:27:53
424862Core systembase-systemUNCONFIRMEDsys-apps/logwatch - please add support for postscreen postfix service from upstream patch2012-08-28 08:48:18
424870Enhancement/Feature Requestsdev-portageUNCONFIRMEDsys-*/ upgrade notification in Portage2012-09-04 05:42:54
425022Core systembase-systemUNCONFIRMEDsys-apps/pciutils - lib/configure: Looking for access methods... Unfortunately, your OS is not suppo2012-07-10 09:18:23
425056OtherantarusUNCONFIRMEDGSoC 2012 gentoostats: Deploy the gentoostats webapp2012-09-05 11:19:59
425106Core systembase-systemUNCONFIRMEDsys-libs/db-4.8.30 FEATURES="test" - tests are not run : You must have USE=tcl to run the sys-libs/d2012-07-10 14:09:54
425132Ebuildsmaintainer-wantedUNCONFIRMEDdev-db/riak - "the most powerful open-source, distributed database you'll ever put into production."2012-07-08 14:09:00
425202Ebuildsmaintainer-wantedUNCONFIRMEDx11-plugins/torchat - Pidgin plugin for p2p instant messaging through Tor hidden service tunnels2012-07-08 14:10:34
425220InstallCDreleaseUNCONFIRMEDinstall-powerpc-minimal-20120624.iso fails to boot on Power Mac G5 late 2005 2x2Ghz2012-12-24 09:36:09
425302Gamesmaintainer-wantedUNCONFIRMEDgames-strategy/p6014 - Project 6014 Mod sequel to Star Control II: The Ur-Quan Masters2012-07-09 11:21:25
425316Applicationskernel-miscUNCONFIRMEDapp-misc/fdutils-5.5-r2 - fdmount.c:25:27: fatal error: linux/ext2_fs.h: No such file or directory2012-12-12 05:51:37
425328Applicationsnet-mailUNCONFIRMEDmail-client/cone-{0.89,0.90} segfault on unsuccessful attempt of login to spop3 server2012-07-09 11:36:39
425508Ebuildsmaintainer-wantedUNCONFIRMEDdev-games/caelum - atmospheric effects OGRE plugin2012-07-16 00:55:34
425708ApplicationscalchanUNCONFIRMEDdev-lang/R-2.10.1 - R: stack smashing attack in function - terminated2012-10-07 11:57:34
425728Core systemtoolchainUNCONFIRMEDsys-libs/libstdc++-v3 sys-devel/gcc:3.3: no version information available in ia64 libstdc++.so2012-08-12 14:58:44
425758EbuildsroxUNCONFIRMEDrox-base/rox-lib - Deprecation Warning: Usage of python_mod_optimize() in packages not support......2012-07-18 09:48:32
426246Eclasses and Profilesamd64UNCONFIRMEDLDFLAGS_${ABI} uses '-m ' rather than '-Wl,-m,'2012-09-06 04:43:33
426260ServernxUNCONFIRMEDnet-misc/x2goserver - x2go loses the applications menu under gnome2012-07-17 18:04:16
426338genkernelgenkernelUNCONFIRMEDgenkernel 3.4.24_p2: missing separator between old and new kernel version2012-12-03 20:03:30
426356ApplicationsnetmonUNCONFIRMEDnet-analyzer/mrtg-2.17.4: /etc/init.d/mrtg restart: overload arg '..' is invalid at /usr/lib/perl5/v2012-07-25 14:42:22
426358Core systembase-systemUNCONFIRMEDsys-block/partimage server crashes with pthread error when client attempts to download image2012-07-18 00:00:36
426452GNOMEgnomeUNCONFIRMED[gnome-overlay] net-libs/webkit-gtk-1.9.4-r300 - Source/WebCore/platform/graphics/texmap/TextureMapp2012-07-29 17:48:32
426486ApplicationschithanhUNCONFIRMEDopenoffice-bin-3.4.0 automatically installs ~200MB of dictionary data for each user2012-07-14 00:20:34
426586Ebuildsdev-embeddedUNCONFIRMEDsci-electronics/sigrok - a portable, cross-platform, Free/Libre/Open-Source signal analysis software2012-11-04 22:54:31
426656Ebuildspolynomial-cUNCONFIRMEDapp-emulation/virtualbox-4.18 should depend on >=dev-util/kbuild-0.1.9998_pre20110817-r12012-07-18 15:40:35
426736Applicationsx11UNCONFIRMEDx11-base/xorg-server segfaults at startup with x11-drivers/xf86-video-ati-6.14.4-r12012-07-18 21:13:12
426754Applicationsmedia-videoUNCONFIRMEDUpdate to VLC 2.0.1 breaks MKVs2012-09-19 13:11:25
426814Servermr_bones_UNCONFIRMEDapp-admin/syslog-ng - default configuration should @include "scl.conf"2012-07-18 16:14:44
426872Serveridella4UNCONFIRMEDapp-emulation/xen-tools-4.1* - disable HPET broadcast2012-08-13 09:47:39
426898Applicationspolynomial-cUNCONFIRMED=app-emulation/virtualbox-modules-4.1.12 with sys-kernel/vanilla-sources-3.4.5 - src_test(): .../wor2012-11-13 17:18:09
426994EbuildsevaUNCONFIRMEDx11-drivers/xf86-input-synaptics - Enable natural scrolling for MacBooks by default2012-09-10 14:04:38
427038ApplicationsmozillaUNCONFIRMEDthunderbird: useflag "crypt" use uncompatible version of enigmail or gnupgp2012-07-25 01:52:10
427040LibraryperlUNCONFIRMEDperl-core/Math-BigInt-1.997.0 "overload arg '..' is invalid" warning2012-07-19 15:41:53
427162Ebuildsmaintainer-wantedUNCONFIRMEDdev-python/django-admin-tools-0.4.1 - a collection of tools for the django administration interface2012-12-12 12:25:24
427178Core systemtoolchainUNCONFIRMEDsys-libs/glibc-2.14.1-r3 - grsec: Invalid alignment/Bus error occurred at 00000301ad4cb768 in /lib642012-11-02 18:28:59
427208EbuildstexUNCONFIRMEDdev-tex/rubber-20100306 version bump request and HOMEPAGE update2012-12-22 18:27:45
427296Ebuildsmaintainer-wantedUNCONFIRMEDdev-python/django-tables2-0.11.0 - Table/data-grid framework for Django2012-12-12 11:30:43
427340Core systembase-systemUNCONFIRMEDsys-boot/grub-static-0.97-r10 incorrectly detects /boot as read-only and fails2012-07-26 19:22:30
427392EbuildsgraphicsUNCONFIRMEDmedia-gfx/graphviz-2.26.3-r{3,4}: build fails at link time2012-07-23 18:43:29
427430FreeBSDbsdUNCONFIRMEDWhen using latest clang-3.1-r5, sys-freebsd/boot0-9.0/9.1_beta1 will fail to compile2012-11-25 11:39:35
427616Prefix SupportprefixUNCONFIRMEDdev-lisp/sbcl-1.0.55-r1 fails to install on OS X (with FEATURES=test)2012-10-22 18:12:45
427632Applicationsx11UNCONFIRMEDx11-drivers/xf86-input-evdev-2.7.0 breaks y-direction emulateWheel for Kensington Expert Mouse2012-07-25 22:35:22
427728Ebuildsmaintainer-wantedUNCONFIRMEDNew: dev-python/django-classy-tags-0.3.4.1 - Class based template tags for Django2012-12-12 11:41:28
427734Ebuildsmaintainer-wantedUNCONFIRMEDNew: dev-python/django-sekizai-0.4.2 - Django Template Blocks with extra functionality2012-12-12 11:51:41
427738Ebuildsmaintainer-wantedUNCONFIRMEDNew: dev-python/django-cms-2.3 - A Django application for managing hierarchical pages of content2012-12-12 12:04:20
427746Ebuildsmaintainer-wantedUNCONFIRMEDdev-python/django-dajax-0.8.4 - Easy to use library to create asynchronous presentation logic with d2012-12-12 12:17:56
427754Ebuildsmaintainer-wantedUNCONFIRMEDdev-python/django-tinymce-1.5.1_beta2 - TinyMCE integration for Django2012-12-12 12:32:51
427762Ebuildsmaintainer-wantedUNCONFIRMEDNew: dev-python/django-grappelli-2.4.0 - A grid-based alternative/extension to the Django administra2012-07-24 14:52:05
427808EbuildsvoyageurUNCONFIRMEDx11-base/xorg-server-1.12.3 crashing at start-up when compiled with sys-devel/clang2012-12-31 12:32:19
427936Ebuildsnet-p2pUNCONFIRMEDmedia-libs/gupnp-dlna-0.6.6 USE=introspection - sandbox violation in /dev/dri/card0 by gst-plugin-sc2013-02-05 18:34:08
427974Applicationspolynomial-cUNCONFIRMEDapp-emulation/virtualbox-4.1.12 - .../work/VirtualBox-4.1.12/src/VBox/Devices/PC/Etherboot-src/arch/2012-07-25 02:41:01
428024Ebuildsmaintainer-wantedUNCONFIRMEDdev-libs/breakpad -- An open-source multi-platform crash reporting system2012-08-17 21:05:56
428124Applicationspolynomial-cUNCONFIRMEDapp-emulation/virtualbox-4.1.12: "Failed to create the VirtualBox COM object"2012-09-21 15:25:00
428220ApplicationstoolchainUNCONFIRMEDwww-client/firefox-10.0.5 - ld: BFD (GNU Binutils) 2.21.1 internal error, aborting at /var/tmp/porta2012-07-27 17:14:46
428460Applicationsx11UNCONFIRMEDmedia-libs/mesa-8.1_rc1_pre20120724 files swrast_dri.so and i915_dri.so contains insecure RUNPATHs2013-01-31 18:48:44
428588Applicationsc1pherUNCONFIRMEDnet-dns/djbdns: replace setup scripts with documentation2012-07-31 00:05:08
428650Libraryx11UNCONFIRMEDmedia-libs/mesa-8.1_rc1_pre20120724 - libGL error: failed to authenticate magic 5 // libGL error: fa2012-11-18 08:31:42
428674ApplicationsnetmonUNCONFIRMEDnet-analyzer/ifmetric-0.3 with kernel 3.5 -
NETLINK: Packet too small or truncated! 32!=16!=101
2012-07-30 23:43:53
428716Ebuildslu_zeroUNCONFIRMEDapp-emulation/qemu-user-9999 - ?2012-07-30 22:56:27
429294JavajavaUNCONFIRMED=dev-java/gnu-classpath-0.98-r3 uses gcc [gcj] to build but not chcecks gcc for USE=gcj2012-09-26 09:46:31
429372EbuildsnirbheekUNCONFIRMEDdev-python/pypy-1.9-r1 FEATURES=sandbox - Fatal error during initialization: out of memory2012-08-02 11:53:03
429378DevelopmentperlUNCONFIRMEDdev-lang/perl-5.16 already provides Data::Dumper2012-11-10 12:52:41
429450Core systemrobbat2UNCONFIRMEDsys-apps/hwinfo-19.1 - hwinfo[NNNNN]: segfault at NNN ip NNNNNNNNNNNNNNNN sp NNNNNNNNNNNNNNNN error 2013-02-19 20:31:17
429626CatalystcatalystUNCONFIRMEDdev-util/catalyst-2.0.10.1: get_libdir() return an empty value when cross compiling2012-08-13 13:01:10
429674Libraryamd64UNCONFIRMEDapp-emulation/emul-linux-x86-medialibs: move media-libs/faac to a separate package due to license "i2012-11-02 18:16:56
429778ApplicationshannoUNCONFIRMEDapp-emulation/dosemu-1.4.1_pre20091009 should depend on media-libs/libsdl2012-08-04 09:42:48
429802Ebuildsnet-imUNCONFIRMEDnet-im/sendxmpp-1.20 with 2012-08-04 16:43:36
430000Applicationsx11UNCONFIRMED>=x11-drivers/ati-drivers-12.6 incompatible with >=x11-drivers/xf86-video-intel-2.20.32013-02-19 19:10:05
430070Applicationsx11UNCONFIRMEDx11-base/xorg-server-1.12.99.903 - using space in media-gfx/gimp-2.8.0-r1 causes segmentation fault 2012-08-08 18:40:49
430184JavajavaUNCONFIRMEDdev-java/jansi and dev-java/jansi-native: Version bump (+ new dependency)2012-08-06 14:27:16
430190Coredev-portageUNCONFIRMEDSlot conflict because of "no parents that aren't satisfied by other packages in this slot"2012-08-07 14:41:13
430308DevelopmenthwoarangUNCONFIRMEDdev-util/qt-creator-2.5.0: cannot find/use tool chain2012-10-24 14:46:48
430316Ebuildsidl0rUNCONFIRMEDFeature request: Add a check for sane folder/file permission in net-dns/bind2012-08-07 16:19:51
430348EbuildsradioUNCONFIRMEDnet-wireless/gnuradio-3.6.1-r1 USE="doc" - some documentation is installed outside /usr/share/doc/${2012-08-13 23:02:49
430406DocumentationneddyseagoonUNCONFIRMEDTypo on Foundation_news.xml2012-08-08 06:43:21
430422ApplicationshannoUNCONFIRMEDapp-emulation/dosemu-1.4.1_pre20091009 : svga USE flag is not handled properly2012-08-08 09:56:45
430432JavajavaUNCONFIRMED[java-overlay overlay] dev-util/eclipse-sdk-bin-4.2.0 - segmentation fault in: C [libgobject-2.0.so2012-08-26 15:50:14
430626DevelopmentperlUNCONFIRMEDdev-lang/perl-5.16.1 - Can't locate strict.pm in @INC2012-10-26 23:10:24
430756Eclasses and ProfilesvimUNCONFIRMEDvim-doc.eclass creates broken links when ROOT is not /2012-08-10 13:07:19
430812Toolstools-portageUNCONFIRMEDapp-portage/gentoolkit - after recent binutils upgrade, revdep-rebuild did not catch libbfd-2.21.1.s2012-08-22 19:36:59
430866ApplicationshwoarangUNCONFIRMEDx11-misc/lightdm-1.3.2: both password and ssh passphrase need to be entered at login2013-01-24 22:40:09
430870ApplicationshannoUNCONFIRMEDnet-analyzer/openvas-administrator - .../work/openvas-administrator-1.1.1/src/admin.c:877:3: error: 2012-08-12 14:12:23
430894Core systemmattmUNCONFIRMEDsys-power/apcupsd-3.14.10-r1[snmp] fails to build with latest net-snmp2013-02-02 23:16:04
430938KDEkdeUNCONFIRMEDkde-base/plasma-workspace-4.8.5 fails with parallel build: fatal error: ui_killrunner_config.h: No s2012-10-24 16:55:05
431082BugzillabugzillaUNCONFIRMEDIt is not possible to set attachment type/patch flag in expert mode enter_bug2012-08-12 13:58:16
431106Forumsforum-modsUNCONFIRMEDForum Comfirmation Email Includes Plaintext Password2012-08-12 17:14:30
431144Applicationspolynomial-cUNCONFIRMEDnet-irc/xchat-2.8.8-r2 - saved configuration is corrupted on read or write2012-08-15 12:32:17
431214CatalystcatalystUNCONFIRMEDdev-util/catalyst: add qemu support2012-08-16 21:52:46
431340PMS/EAPIpms-bugsUNCONFIRMED[Future EAPI] Allow bash-4.2 features2013-02-02 16:51:33
431368ApplicationshaskellUNCONFIRMEDx11-misc/xmobar-0.14 - src/Plugins/Monitors/CoreCommon.hs:139:30: No instance for (Applicative (Cont2012-08-14 13:16:12
431388ApplicationspythonUNCONFIRMEDdev-python/ipython-0.13 -AttributeError: 'StoreMagics' object has no attribute 'db'2012-08-14 15:08:54
431566Ebuildsmaintainer-wantedUNCONFIRMEDdev-tex/blahtexml - Blahtex and Blahtexml: Converting TeX equations into MathML2012-08-17 23:46:19
431628Default ConfigssecurityUNCONFIRMEDinformation disclosure of the IP address of all connected users to all simple users2012-09-10 06:20:24
431684ApplicationsbenchmarksUNCONFIRMEDapp-benchmarks/bonnie++-1.96: manpage references ebuild-altered docpath2012-08-17 16:04:52
431706Applicationsmaintainer-wantedUNCONFIRMEDdev-lang/jwasm - masm compatible crossplatform assembler2012-10-20 19:27:43
431742Gamesmaintainer-wantedUNCONFIRMEDgames-misc/limbo - a puzzle platform video game (wine)2012-08-20 13:17:08
431788EbuildspythonUNCONFIRMEDdev-python/ipython-0.13 does not correctly calculate USE dependencies2012-08-18 22:14:28
431802Ebuildsmaintainer-wantedUNCONFIRMEDwww-apps/gitlab Project management and code hosting application written in ruby2013-01-23 04:07:24
431804Ebuildsmaintainer-wantedUNCONFIRMEDapp-text/pelican-3.0 - A tool to generate a static blog, with restructured text (or markdown) input 2012-08-18 15:39:10
431872Ebuildsmaintainer-wantedUNCONFIRMEDx11-terms/kmscon - Linux KMS/DRM based virtual Console Emulator2012-12-13 01:07:28
431926PrintingprintingUNCONFIRMEDnet-print/foomatic-filters - foomatic-gswrapper symlink broken2013-02-04 19:46:49
431928Ebuildsmaintainer-wantedUNCONFIRMEDapp-benchmarks/mmtests - a configurable test suite that runs a number of common workloads of interes2012-08-20 02:07:01
431978Coredev-portageUNCONFIRMEDsys-apps/portage: FEATURES=preserve-libs missed dependency (libmpc.so.2) in /usr/libexec/gcc/x86_64-2012-12-25 20:59:53
431984Core systemia64UNCONFIRMEDsys-boot/efibootmgr - arch must match kernel arch to work correctly2012-08-22 00:02:20
432040Ebuildsmaintainer-wantedUNCONFIRMEDdev-libs/xdispatch - a event processing library (aka Grand Central Dispatch by Apple)2012-08-23 09:02:49
432300Core systemtoolchainUNCONFIRMEDsys-devel/gcc-4.5.3-r2 fails to crosscompile: gcc-4.5.3/libstdc++-v3/src/atomic.cc:91:62: error: inv2012-08-22 14:43:31
432326EbuildspatrickUNCONFIRMEDapp-emulation/virtualbox-guest-additions should add group "vboxsf" to support automount shared folde2012-10-23 10:19:47
432378Applicationsshell-toolsUNCONFIRMEDapp-shells/bash-completion - hard-coded path "/sbin/modinfo" in /usr/share/bash-completion/module-in2012-11-03 18:30:08
432454Applicationsbase-systemUNCONFIRMEDsys-block/open-iscsi - init script has problems with automatic mounting of iSCSI2012-10-22 16:22:50
432620Enhancement/Feature Requestspms-bugsUNCONFIRMEDdobin: automatic support of EXEEXT2012-08-24 18:51:54
432706Applicationsnet-imUNCONFIRMEDnet-im/pidgin 2.10.6 XMMP/IRC accounts do not connect automatically, "waiting for network connection2012-08-28 09:58:27
432712Ebuildsmaintainer-wantedUNCONFIRMEDsci-geosciences/gpx2svg – Convert GPX formatted geodata to Scalable Vector Graphics (SVG)2012-08-26 20:33:26
432824Other documentsdocs-teamUNCONFIRMEDLVM2 Documentation should explain "lvcreate --target RAID1" vs "--mirrors"2012-08-26 11:19:31
432872Core systemtoolchainUNCONFIRMEDsys-libs/glibc-2.15-r2 - `getent passwd': segmentation fault in __rawmemchr_sse2 () at ../sysdeps/x82012-08-29 23:15:08
432884Ebuildspolynomial-cUNCONFIRMEDapp-emulation/virtualbox-modules: undeclared 'VM_RESERVED'2013-01-24 15:45:20
432890Applicationsalsa-bugsUNCONFIRMEDmedia-libs/alsa-lib w/ net-im/skype: snd_pcm_avail_update() returned a value that is exceptionally l2012-09-09 08:42:31
432908ApplicationsbluenessUNCONFIRMEDapp-admin/webapp-config-1.50.19: Allow precise declaration of server uid/gid in the configuration fi2012-09-30 16:18:23
432944UnspecifiedperlUNCONFIRMEDperl-gcpan/Math-GSL-0.27 wants to install perl-gcpan/Test-Tester-0.108 which conflics with installed2012-09-17 07:17:25
432976KDEkdeUNCONFIRMEDnet-libs/telepathy-logger-qt-0.5.0: fails to build with >=dev-libs/boost-1.50.0-r22013-01-18 10:48:33
433060Ebuildsmaintainer-wantedUNCONFIRMED[science overlay] sci-physics/herwig++ - High-Energy Physics event generator2013-02-08 01:03:07
433153ApplicationsramerethUNCONFIRMEDapp-emulation/ganeti should install logrotate config2012-09-03 11:31:29
433157LibraryfontsUNCONFIRMEDmedia-libs/freetype-2.4.10-r1 USE=infinality causes segmentation faults running x11-wm/openbox in _f2012-10-17 12:10:36
433171ApplicationserasUNCONFIRMEDnet-proxy/squid - add epatch_user support2012-09-02 18:19:17
433175ApplicationspythonUNCONFIRMEDdev-lang/python-2.7.3-r2: Exception AttributeError: AttributeError("'_DummyThread' object has no att2012-09-03 18:23:18
433373Installation Handbookdocs-teamUNCONFIRMEDSubstitute old make.conf path2012-10-31 18:52:18
433515Prefix SupportprefixUNCONFIRMEDemerge app-doc/NaturalDocs-1.52 : request Prefix support2012-10-10 12:41:47
433864Ebuildsmaintainer-wantedUNCONFIRMEDapp-misc/format-junkie - a program that can convert your media files (audio files, videos and pictur2012-09-10 17:00:15
433942Applicationsnet-p2pUNCONFIRMEDnet-p2p/amule - amule fails to start when an empty ~/.aMule/statistics.dat file is present2012-09-04 15:33:37
433998DevelopmenthaskellUNCONFIRMEDincompatibility between =dev-lang/ghc-7.4.1-r1 and =x11-wm/xmonad-0.102012-12-16 13:42:38
434020OpenRCopenrcUNCONFIRMEDnet.example in docs dir suggest a faulty bond0-configuration.2012-09-05 11:55:57
434110Applicationsrobbat2UNCONFIRMEDapp-admin/cancd-0.1.0-r2: netconsole init script fails to start due to wrong ifconfig path2012-09-06 14:20:31
434174ApplicationsmozillaUNCONFIRMEDwww-client/firefox-15.0: Cannot watch youtube without flash after suspend to ram (KDE)2012-09-20 09:38:21
434180Core systemtoolchainUNCONFIRMEDsys-devel/gcc sandbox violation in /usr/include/DONE (dev-db/oracle-instantclient-basic creates a li2012-12-25 08:33:27
434222JavajavaUNCONFIRMEDdev-java/ant-ivy-2.0.0 compilation failed2012-09-07 15:04:44
434526Applicationsx11UNCONFIRMEDx11-base/xorg-server message should be updated since sets are in stable portage2012-10-26 06:41:59
434542ApplicationsmozillaUNCONFIRMEDwww-client/firefox-bin-15.0 is trying to automatically upgrade via Mozilla Upgrade path2013-02-20 21:53:50
434610ApplicationsjlecUNCONFIRMEDgnome-extra/zeitgeist-datahub-0.9.5 version bump2012-09-11 14:22:09
434702ApplicationsspingUNCONFIRMEDmedia-sound/mp3splt-gtk-0.7.3: QA Notice: This package installs one or more .desktop files that do n2012-11-21 18:48:15
434704ApplicationsgpeUNCONFIRMEDx11-misc/matchbox-keyboard-0.1: QA Notice: This package installs one or more .desktop files that do 2012-11-21 18:48:19
434744Ebuildsmaintainer-wantedUNCONFIRMEDdev-db/mysql-cluster-7.2.8 - a high availability and high performance alternative to regular mysql2012-10-14 09:35:05
434828Ebuildsmaintainer-wantedUNCONFIRMEDapp-editors/gedit-collaboration-9999 - GNOME Text Editor Collaboration Plugin2012-09-18 23:55:14
434830PrintingbillieUNCONFIRMEDnet-print/hplip-3.12.6-r1 - checks for updates when configured not to (default)2012-11-18 13:42:03
434842GNOMEgnomeUNCONFIRMEDmedia-video/cheese-3.4.2 This package installs one or more .desktop files that do not pass validati2012-11-21 18:48:25
434924EbuildswilliamhUNCONFIRMEDdev-lang/go - static libraries in /usr/lib/go/pkg* with older mtimes than /usr/lib/go/src causes use2012-09-14 13:35:30
434926Applicationsmaintainer-neededUNCONFIRMED>=net-im/skype-4.0.0.7 - login failure, stuck at "signing in" with JFS filesystem2013-01-03 19:31:41
435044Prefix SupportprefixUNCONFIRMEDbootstrap-prefix.txt fails on comilation of portage/app-editors/nano-2.3.1-r22012-10-01 14:08:25
435092GamesgamesUNCONFIRMEDgames-fps/quake2-data update - support expansion packs2012-09-15 04:21:45
435102Ebuildsmedia-videoUNCONFIRMEDmedia-video/vlc-9999 - 300_all_pic.patch fails to apply2012-09-18 20:17:27
435162New Servermirror-adminUNCONFIRMED[full+rsync] New mirror: University of Nebraska at Omaha, College of IS&T (US)2012-09-15 20:30:25
435188PrintingprintingUNCONFIRMEDnet-print/foo2zjs: Wrong path to the CUPS usb backend2012-09-16 15:56:26
435212BugzillabugzillaUNCONFIRMEDgentoo's bugzilla does not support xz compressed patches2012-11-28 14:34:32
435304Unspecifiedrobbat2UNCONFIRMEDapp-portage/g-cpan-0.16.4-r1 generates broken ebuild depending on perl-g-cpan instead of dev-perl mo2013-02-21 07:50:32
435338ApplicationstexUNCONFIRMEDdev-tex/chktex-1.7.0 - .../work/chktex-1.7.0/FindErrs.c:320: warning: implicit declaration of functi2012-09-18 13:41:50
435358genkernelgenkernelUNCONFIRMEDProvide better semantics for oldconfig, add some new kernel configuration options2012-09-17 20:26:30
435410Applicationsbase-systemUNCONFIRMEDapp-arch/zip-3.0: bzip2 flag broken, unicode flag broken, cross compilation broken2013-02-16 13:20:59
435534ApplicationsqemuUNCONFIRMEDapp-emulation/qemu-kvm-1.1.1-r1 - manual pages are not installed2012-11-30 12:14:46
435584KDEkdeUNCONFIRMEDkde-base/kdelibs - patch to fix directory icon breakage for NFS mounts since KDE 4.7.42012-09-28 17:48:44
435620ApplicationsspingUNCONFIRMEDapp-portage/fetchcommandwrapper-0.7.1 has path "/etc/make.conf" hardcoded2012-09-20 14:44:27
435648FreeBSDbsdUNCONFIRMEDSegmentation fault always occurs when starting X, using later versions xf86-video-vesa-2.3.0-r12012-09-23 13:02:11
435686Librarydev-zeroUNCONFIRMEDdev-libs/boost-1.49.0-r1 - In file included from [...] libs/date_time/src/gregorian/greg_month.cpp:12012-11-11 05:45:20
435690Applicationsmysql-bugsUNCONFIRMEDdev-db/mysql-5.1.62-r1 - Makefile:186: *** missing separator. Stop.2013-02-04 23:51:03
435712Ebuildsmaintainer-wantedUNCONFIRMEDnet-nntp/es-f-2.6.0 - web based HTML frontend for esniper, a lightweight console application for sni2013-01-23 03:27:50
435740Developmentcommon-lispUNCONFIRMEDdev-lisp/asdf-binary-locations - uninstall should clean up /etc/gentoo-init.lisp2012-09-21 16:42:43
435742Applicationsphp-bugsUNCONFIRMEDdev-php/igbinary-1.1.1-r1 with dev-lang/php[threads] compilation fails with: apc_serializer.h:57:5: 2012-09-21 16:43:14
435906Applicationssci-mathematicsUNCONFIRMEDsci-mathematics/octave-3.6.2-r1 - .../work/octave-3.6.2/src/.libs/octave: error while loading shared2013-02-04 21:38:37
436052GNOMEgnomeUNCONFIRMEDgnome-base/gnome-shell-3.4.2 QA Notice: This package installs one or more .desktop files that do not2012-11-21 18:48:32
436062Developmentrobbat2UNCONFIRMEDapp-portage/g-cpan - perl-gcpan/RT-Extension-Nginx-0.02 - mkdir /usr/etc: Permission denied at /usr/2012-09-24 11:14:58
436100LibrarysciUNCONFIRMEDsci-libs/scipy 0.9.0-r1 with media-libs/qhull-2012.1-r1 - scipy/spatial/qhull.c:206:25: fatal error:2013-02-03 13:03:23
436122Ebuildsnet-dialupUNCONFIRMEDnet-dialup/ppp-2.4.5-r3 - Failed Patch: 80_all_eaptls-mppe-0.991-gentoo.patch !2012-11-09 04:09:40
436140GamesgamesUNCONFIRMEDgames-action/descent3 - updated ebuild to support installation from GOG package2012-09-24 22:54:46
436278Librarymaintainer-wantedUNCONFIRMEDnet-analyzer/nagios-afs-monitor - Nagios plugins to monitor openafs server status2012-09-26 13:37:17
436372Ebuildsmaintainer-wantedUNCONFIRMEDdev-ruby/jruby-pageant - Gem for communicating with Pageant agent from JRuby2012-09-27 07:21:29
436402Eclasses and Profileskernel-miscUNCONFIRMEDkernel-2.eclass - Print the value of PATCH_DEPTH actually used for patching rather than it's initial2012-09-28 14:33:19
436432Keywording and Stabilizationsci-geosciencesUNCONFIRMEDsci-libs/geos-3.3.5 stabilisation2013-02-02 12:08:29
436448Applicationsdesktop-miscUNCONFIRMEDx11-misc/parcellite-1.0.2_rc5 generates too many interrupts (as seen in powertop)2012-10-08 19:44:07
436536Applicationspolynomial-cUNCONFIRMEDnet-irc/xchat-2.8.8-r2 - patches that apply cleanly and fix several issues2012-09-29 15:32:27
436596Applicationsandrej.filipcicUNCONFIRMEDnet-fs/openafs-1.6.1-r1: parallel build failure - In file included from db_dump.c:31:0: database.h:12012-09-29 15:38:55
436600GamesgamesUNCONFIRMEDgames-simulation/fgrun-1.6.0 fails to find dev-games/openscenegraph libs during linking2012-11-08 21:11:12
436708Ebuildsmedia-tvUNCONFIRMEDmedia-tv/xawtv-3.95-r2 - v4lctl: dlopen: /usr/lib64/xawtv/flt-disor.so: undefined symbol: atanf / po2013-02-15 14:53:00
436916Keywording and Stabilizationbase-systemUNCONFIRMEDsys-boot/lilo-22.8-r2: Fatal: Setup length exceeds 31 maximum; kernel setup will overwrite boot load2013-01-27 14:59:32
436976Applicationsmaintainer-wantedUNCONFIRMEDnet-mail/geary - A lightweight email program designed around conversations and built for the GNOME d2012-10-08 16:10:46
436986Applicationsrobbat2UNCONFIRMEDapp-portage/g-cpan - perl-gcpan/Finance-QuoteHist-1.16 attempts to pull in perl-gcpan/Date-Manip, ig2012-10-02 17:09:49
436992GNOMEgnomeUNCONFIRMEDgnome-base/gvfs-1.12.3-r1 - /usr/share/applications/mount-archive.desktop: warning: key "Encoding" i2012-11-21 18:48:43
437114Core systembase-systemUNCONFIRMEDnet-misc/dhcp does not work on virtual machines that use virtio2012-10-04 03:36:06
437116EbuildstexUNCONFIRMEDdev-tex/biblatex-2.5 version bump request2013-02-02 09:26:44
437186LibrarysoundUNCONFIRMEDmedia-libs/libclthreads has wrong DESCRIPTION and HOMEPAGE and should be moved to different category2012-10-04 17:21:28
437258Applicationsmedia-videoUNCONFIRMEDmedia-video/vlc-9999 - Failed Patch: 300_all_pic.patch !2012-10-06 13:33:40
437420ApplicationspachoUNCONFIRMEDmail-client/mail-notification-5.4-r6 - wrong rendering for the icon in message tray of Gnome 32012-10-07 07:24:26
437494Core - Interface (emerge)dev-portageUNCONFIRMEDProvide a parameter for emerge so that 'emerge -pv' can display package description along with other2012-10-08 19:09:40
437590Libraryx11UNCONFIRMEDmedia-libs/mesa-9.0_pre20120918: libGL error: failed to load driver: nouveau with a ATI graphic cont2012-10-24 20:57:35
437632Ebuildsmedia-videoUNCONFIRMEDmedia-video/vlc: metadata.xml should be updated2012-10-08 20:15:56
437714Core systemrobbat2UNCONFIRMEDsys-fs/lvm2-2.02.97 init stop fails to deactivated lvs and vgs on shutdown2013-02-04 12:49:21
437728Core systema3liUNCONFIRMEDsys-boot/plymouth - static archives (*.a) and libtool library files (*.la) do not belong in /2012-11-15 22:53:53
437840ApplicationsnetmonUNCONFIRMEDnet-analyzer/net-snmp-5.7.2_rc1 - snmpd(XX): floating-point assist fault at ip 20000595aab3efc2, isr2012-10-14 18:00:40
437894GamesgamesUNCONFIRMEDgames-emulation/virtualjaguar-1.0.7 -> 2.0.2 ebuild submission2013-02-10 05:05:50
437924Feature Requestmirror-adminUNCONFIRMEDThe list of rsync mirrors should have correct path or notify user of path2012-10-11 02:16:35
437958ApplicationsxmwUNCONFIRMEDnet-misc/minidlna - add epatch_user support2012-10-11 13:47:33
437960Ebuildsmaintainer-wantedUNCONFIRMEDdev-libs/libdivecomputer-0.2.0 - Library for communication with dive computers from various manufact2012-10-11 13:48:40
437970Servernet-proxyUNCONFIRMEDnet-proxy/http-replicator-3.0-r3 - ERROR: HttpClient 1 caught an exception in __getattr__: HttpClien2012-10-11 13:53:15
438086Applicationsweb-appsUNCONFIRMEDwww-apps/gallery-2.3.1 - "Begin Installation" fails with "The requested URL /gallery/install/
<
2012-10-12 16:43:46
438150ServerpatrickUNCONFIRMEDwww-servers/apache-2.4.3 - configuration files have "require host", should be "require ip"2013-02-16 14:07:53
438164Unspecifiedpolynomial-cUNCONFIRMEDapp-emulation/virtualbox - EQ overflow in X server when virtualbox starts with Wacom tablet's mouse 2012-10-14 18:22:06
438226Documentationinfra-bugsUNCONFIRMEDwrong doc link at http://www.gentoo.org/2012-10-13 14:26:55
438236Ebuildsmaintainer-wantedUNCONFIRMEDsys-kernel/xenomai-sources and sys-libs/xenomai-libs - a real-time development framework cooperating2012-10-19 15:32:10
438248ApplicationscalchanUNCONFIRMEDmedia-video/kino-1.3.4 generates XML DVD indices incompatible with media-video/dvdauthor-0.7.02012-10-15 10:52:33
438302Ebuildsmaintainer-wantedUNCONFIRMEDdev-db/mysql-mmm - Multi-Master Replication Manager for MySQL2012-10-15 11:04:50
438304Applicationsmedia-videoUNCONFIRMEDmedia-video/gtk-recordmydesktop-0.3.8-r2 - QA Notice: .desktop file do not pass validation2012-11-21 18:48:47
438314Ebuildsvincent.hardy.beUNCONFIRMEDapp-crypt/eid-mw - misspelled metadata2012-10-15 11:09:16
438490Ebuildsmaintainer-wantedUNCONFIRMEDwww-plugins/mozilla-gnome-keyring-0.6.4 - A firefox extension that enables Gnome Keyring integration2012-10-15 18:59:37
438494Conceptual/Abstract Ideaspms-bugsUNCONFIRMEDHave configuration file protection against new files in conf.d/ directories2012-10-16 15:46:11
438508Core systembluenessUNCONFIRMEDhardened kernel 3.4.9 with ZFS patch - Recursive fault on unsuspending (resuming from RAM) laptop wi2012-10-17 03:55:19
438530ApplicationsmaksbotanUNCONFIRMEDx11-wm/awesome-3.4.13 USE=gnome - add application file for gdu-notification-daemon2013-02-06 12:31:57
438630EbuildsnetmonUNCONFIRMEDnet-analyzer/cacti Adding Patch for dev-lang/php:5.42013-02-16 13:31:52
438708ApplicationsroxUNCONFIRMED2012-10-17 14:29:58
438730Core systemkernel-miscUNCONFIRMEDSandbox violations when emerging kernel modules from /etc/kernel/postinst.d hook against a kernel bu2012-11-05 03:29:40
438734Eclasses and Profileskernel-miscUNCONFIRMEDlinux-mod.eclass - KERNEL_DIR/KBUILD_OUTPUT version mismatch is not detected, KERNEL_DIR is not infe2012-10-18 07:40:38
438740ApplicationssciUNCONFIRMEDsci-misc/boinc - start /etc/init.d/boinc later2012-10-25 17:40:08
438784Eclasses and Profileskernel-miscUNCONFIRMEDlinux-mod.eclass - kernel modules packages are incompatible with using multiple kernels2012-10-18 14:18:50
438844Applicationsalsa-bugsUNCONFIRMEDmedia-sound/alsa-utils[pulseaudio]: alsasound init.d script generates pulse state files in /2012-12-16 03:05:14
438900GNOMEfreedesktop-bugsUNCONFIRMEDmedia-libs/libopenraw-0.0.9 - segmentation faults in OpenRaw::IO::MemStream::read (crashes gnome-bas2012-10-19 17:18:13
438930Ebuildspolynomial-cUNCONFIRMEDapp-emulation/virtualbox-4.2 USE=vnc - vnc module is built but not installed2012-12-21 18:07:10
438998Core systembase-systemUNCONFIRMEDsys-fs/cryptsetup[selinux,static]: with sys-libs/libselinux-2.1.12, link fails with pcre missing sym2012-10-23 15:34:25
439104JavajavaUNCONFIRMEDdev-java/avalon-logkit-2.1-r6: java7 patch requires jdk >= 1.62012-10-20 20:48:29
439174OpenRCopenrcUNCONFIRMEDrc-update (and other rc utilities) need to be quiet when --quiet is specified2013-01-01 21:24:06
439246ApplicationsgnomeUNCONFIRMEDmedia-gfx/gthumb-3.0.0 - segmentation fault in strlen(""), called from g_str_has_prefix at gstrfuncs2012-11-19 23:40:51
439260ApplicationsmozillaUNCONFIRMEDwww-client/firefox(-bin)-(15|16).0.1 segfaults a lot in different situations2012-11-12 06:10:38
439280LibraryvadimkUNCONFIRMEDapp-emulation/vmware-modules-264.4 - missing return carriage in printk in VNetUserIfSetUplinkState()2012-10-23 10:12:15
439342ApplicationslackUNCONFIRMEDx11-plugins/gkrellweather-2.0.8 does not properly display temperature2012-10-23 10:08:19
439372Core systemjdhoreUNCONFIRMEDsys-apps/paludis[ruby-bindings] installs unslotted to latest ruby (actually 1.9) disregarding eselec2013-02-07 08:07:43
439396Ebuildsmaintainer-wantedUNCONFIRMEDmedia-sound/postfish - The Postfish is a digital audio post-processing, restoration, filtering and m2012-10-26 06:43:41
439406Ebuildsnet-p2pUNCONFIRMEDnet-p2p/amule - add epatch_user support2012-10-25 01:07:21
439408Ebuildsmaintainer-wantedUNCONFIRMEDdev-db/rockmongo-1.1.5 - Web-based administration for Mongo database in PHP2013-02-07 14:35:09
439540ApplicationscardoeUNCONFIRMEDapp-emulation/qemu fails to handle a usb serial port with a specific vendorid - qdev_prop_set: prope2013-02-10 17:43:13
439546Core systemkernelUNCONFIRMEDRace condition between writeback vs fallocate in ext4 extents code2012-10-25 03:59:20
439754Ebuildsmaintainer-wantedUNCONFIRMEDsys-apps/inxi - A full featured system information script2012-11-19 17:19:20
439840Applicationsx11UNCONFIRMEDx11-drivers/xf86-video-savage - EXA acceleration problems2012-11-04 09:55:04
439844EbuildsaballierUNCONFIRMEDmedia-libs/stk-4.4.4 - In file included from RtAudio.cpp:6750:0: include/soundcard.h:106:28: fatal e2013-01-23 16:33:32
440142LibraryperlUNCONFIRMEDdev-perl/XML-LibXML - Segmentation fault when removing child nodes with entity or namespace subnodes2012-10-29 19:19:42
440194Core systembase-systemUNCONFIRMEDsys-apps/microcode-data20120606_p2? (v2) version bump request2012-11-06 11:28:26
440214EbuildsqaUNCONFIRMED[tracker] packages with emerge messages that can be improved by checking the previous installed vers2013-02-14 19:45:48
440302EbuildsswegenerUNCONFIRMEDnet-irc/irssi - support static-libs and proxy USE flags2012-12-15 13:36:01
440532Applicationspolynomial-cUNCONFIRMEDapp-emulation/virtualbox-modules-4.1.22: some elog messages should only be shown when upgrading from2012-10-31 16:22:12
440598Eclasses and ProfilesfontsUNCONFIRMEDfont.eclass outputs elog messages that shoud only be displayed for new installs2012-10-31 16:05:11
440660Eclasses and ProfilesadaUNCONFIRMEDgnatbuild.eclass: /etc/ada/primary_compilers: No such file or directory2012-10-31 21:52:05
440960ApplicationsgraphicsUNCONFIRMEDmedia-gfx/wings crashes at startup with incorrect version of erl_driver.h2012-11-02 17:02:33
441570KernelsecurityUNCONFIRMEDKernel: btrfs: creates world writable files2012-11-29 17:29:18
441718GNOMEgnomeUNCONFIRMEDgnome-base/libbonoboui-2.24.5: QA Notice: This package installs one or more .desktop files that do n2012-11-21 18:48:50
441720PrintingprintingUNCONFIRMEDnet-print/cups-1.6.1: QA Notice: This package installs one or more .desktop files that do not pass v2012-11-27 16:02:55
441864ApplicationsvimUNCONFIRMEDapp-editors/vim-7.3.646 vim: stack smashing attack in function - terminated2012-11-05 13:04:29
441876GamesgamesUNCONFIRMEDgames-emulation/gens patch for amd642012-11-26 11:09:37
441880ApplicationslehoUNCONFIRMEDmedia-tv/tvheadend-3.2 should not force --disable-dvbscan and should not install data in /usr/share/2012-11-30 01:57:07
441908Applicationsdev-zeroUNCONFIRMEDapp-emulation/spice-vdagent - add USE=selinux2012-11-05 18:59:35
441970Core systembase-systemUNCONFIRMEDnet-misc/dhcp: Fedora patches should be considered for inclusion2012-11-14 18:55:55
442052Applicationsfreedesktop-bugsUNCONFIRMEDsys-power/pm-utils-1.4.1-r2 uses deprecated kernel option CONFIG_WIRELESS_EXT_SYSFS2012-11-06 16:06:47
442078genkernelgenkernelUNCONFIRMEDsys-kernel/genkernel-3.4.45 - wrong lvm.static usage2013-01-04 17:15:11
442092ApplicationsspingUNCONFIRMEDmedia-gfx/gimp-9999 - Portage patch failed to apply (ltmain.sh version 2.4.2)!2012-11-10 00:24:49
442168ApplicationsproaudioUNCONFIRMEDmedia-sound/patchage - Build failure when python-3 is set as active version2012-12-23 21:12:37
442208GNOMEgnomeUNCONFIRMEDmedia-gfx/gnome-screenshot-3.4.1 creates only black images2013-01-29 14:32:01
442220ApplicationsqtUNCONFIRMEDapp-editors/focuswriter - segmentation fault in Xfce42013-01-06 15:59:32
442222Ebuildsmaintainer-wantedUNCONFIRMEDdev-libs/thrust - a parallel algorithms library which resembles the C++ Standard Template Library2012-11-07 17:53:54
442270Ebuildssci-astronomyUNCONFIRMEDsci-astronomy/aatm-0.4.3.1: fails to build2012-12-06 23:52:28
442320InstallCDreleaseUNCONFIRMEDinstall-cd (sparc) - errors at boot2012-12-16 05:42:05
442324Ebuildslang-miscUNCONFIRMEDdev-lang/fpc ebuilds are largely outdated2012-11-08 09:14:16
442342Ebuildsmaintainer-wantedUNCONFIRMEDdev-perl/Data-Diver - Simple, ad-hoc access to elements of deeply nested structures2012-12-27 11:11:38
442372ApplicationshannoUNCONFIRMEDmail-mta/courier : init.d file lacks "checkpath --directory /var/run/courier" for openrc-0.11.52012-12-12 15:30:37
442388Ebuildsmaintainer-wantedUNCONFIRMEDapp-backup/storebackup - Storebackup is a backup suite that stores files on other disks.2012-11-08 23:28:56
442484LibrarycppUNCONFIRMEDdev-libs/boost-1.49.0-r2: Segmentation fault during install phase.2012-11-12 12:00:11
442522EbuildscppUNCONFIRMEDboost::unordered_multimap<>::erase(iterator, iterator) broken in boost1.49-1.512012-11-10 11:44:20
442610ServerhollowUNCONFIRMEDwww-servers/nginx - Feature support request for dav-ext-module.2012-11-26 20:05:19
442672Ebuildslu_zeroUNCONFIRMEDapp-emulation/qemu-user-9999 - Invalid git source.2012-11-11 17:11:10
442692ApplicationsmozillaUNCONFIRMEDwww-client/firefox-16.0.2 mail-client/thunderbird-16.0.1-r1 - comm-release/tbird/mozi - Segmentation2012-11-30 06:41:13
442814ApplicationsfloppymUNCONFIRMEDnet-misc/freerdp-1.1.0_pre20121004-r1 CMake Error at cunit/CMakeLists.txt:28 (add_executable): Canno2012-11-13 07:00:04
442818DevelopmentmlUNCONFIRMEDdev-lang/smlnj-110.75 - bin/sml: Fatal error -- bogus fault not in ML: sig = 11, code = 0x5356c35d, 2012-11-12 22:21:25
442874Applicationsnet-proxyUNCONFIRMEDnet-proxy/http-replicator - local rsync server reports install flash player as wrong size2012-11-14 00:16:31
442876Applicationspolynomial-cUNCONFIRMEDapp-emulation/virtualbox-4.2.4: after upgrade some VMs do not start anymore2013-01-02 19:55:58
442880EbuildssciUNCONFIRMED[science overlay] sci-libs/trilinos-10.12.2 - Version bump; install location fix; prefix support.2012-11-12 19:00:06
442886Applicationsmedia-videoUNCONFIRMEDmedia-video/devede' - elog mentions "lame" for mplayer, but that flag isn't used in mplayer.2012-11-12 18:50:32
443076PrintingprintingUNCONFIRMEDnet-print/foomatic-filters-4.0.16 - configure.ac:6: version mismatch. This is Automake 1.11.6, but2013-01-19 06:59:22
443154Ebuildsdesktop-wmUNCONFIRMEDx11-wm/pekwm-0.1.15 - Doesn't create xsession attributes, new revision for the ebuild proposed.2013-01-24 16:59:23
443476Ebuildsmaintainer-wantedUNCONFIRMEDapp-admin/reprepro - Tool for creating a Debian APT repository with a pool structure2012-11-16 16:10:46
443502EbuildssysadminUNCONFIRMEDnet-analyzer/nagios-plugins-1.4.16-r2 check_http Plugin does not support checking certificates2012-12-03 20:28:53
443534Applicationsx11UNCONFIRMEDx11-apps/xconsole-1.0.4 eats 100% CPU if -file option is used2012-11-16 18:57:33
443556EbuildsvoyageurUNCONFIRMEDsys-devel/clang-3.1 - Updated ebuild with +python and +doc2012-11-17 09:03:06
443596ApplicationsnirbheekUNCONFIRMEDnet-misc/networkmanager: ifnet plugin does not save cloned MAC address & duplicates entries2013-01-26 21:16:37
443604LibrarydotnetUNCONFIRMEDdev-dotnet/libgdiplus-2.10 - ../src/.libs/libgdiplus.so: error: undefined reference to 'atan' /// (m2012-11-19 10:30:17
443630ApplicationsselinuxUNCONFIRMEDSELinux + >app-emulation/libvirt-0.9.13-r1 - Segfault starting qemu domains.2013-02-16 18:03:09
443648ApplicationshannoUNCONFIRMEDapp-emulation/dosemu-1.4.1_pre20091009 hangs2012-11-17 18:49:41
443728EbuildshwoarangUNCONFIRMEDapp-laptop/prey-0.5.4-r1: /etc/init.d/prey-trigger is installed as invalid symlink, first run attemp2013-01-15 19:43:12
443932ApplicationsswegenerUNCONFIRMEDapp-misc/screen - add USE=static2012-11-19 19:43:25
443950Ebuildsgnome-mmUNCONFIRMEDdev-cpp/cairomm-1.10.0 USE="doc" installs documentation outside /usr/share/doc/$PF2012-11-19 20:31:56
443962Core systemppc64UNCONFIRMEDsys-boot/yaboot-static-1.3.17-r1 unable to read ext2 filesystem on powermac G52012-11-20 00:06:17
444054Servermysql-bugsUNCONFIRMEDdev-db/mysql-5.1.66 crashes in replication setup2012-11-21 11:39:44
444118Ebuildsmaintainer-wantedUNCONFIRMEDnet-irc/communi - A cross-platform IRC framework written in Qt 42013-01-17 08:39:58
444157Core systemx11UNCONFIRMEDx11-base/nouveau-drm-20121015 needs patching for kernel 3.7.x2012-11-22 12:13:33
444306Librarydev-zeroUNCONFIRMEDx11-drivers/xf86-input-vmmouse-12.9.0 with x11-base/xorg-server-1.13.0-r1 - Warning: attempting to l2013-01-01 21:31:12
444394Core systemlu_zeroUNCONFIRMEDsys-apps/dtc-1.3.0-r1 - /usr/bin/install: cannot stat 'fdtdump': No such file or directory2012-12-21 15:58:17
444442Applicationsx11UNCONFIRMEDx11-drivers/xf86-video-sis with xorg-server-1.13.0-r1 - X segfaults at startup2012-11-25 11:46:37
444464Applicationspolynomial-cUNCONFIRMEDapp-emulation/virtualbox-4.1.22 - .../work/VirtualBox-4.1.22/src/VBox/Runtime/common/err/errmsg.sed 2012-12-23 18:15:49
444502ApplicationspatrickUNCONFIRMEDapp-benchmarks/phoronix-test-suite-4.0.1 - No matter what, it complains that PHP_TARGETS is empty2012-12-25 22:09:37
444544EbuildshaskellUNCONFIRMED[haskell overlay] dev-haskell/accelerate-cuda passes CFLAGS into non-gcc compiler2012-11-24 17:29:02
444566Unspecifiedx11UNCONFIRMEDx11-drivers/ati-drivers-12.11_beta: fglrx(0): unable to query kernel module!2012-11-24 15:58:50
444602ApplicationsvirtualizationUNCONFIRMEDapp-emulation/virtinst-0.600.3 - Exception in thread Checking storage allocation2013-02-16 18:03:56
444652OpenRCopenrcUNCONFIRMEDUpgrade to OpenRC 0.11.5 breaks services: "You are attempting to run an openrc service on a system w2012-12-16 02:58:07
444720GamesmvaUNCONFIRMED[gamerlay-overlay] games-emulation/vbam-1.8.0.1090 USE=link - .../work/vbam-1.8.0.1090/src/gba/GBALi2012-11-28 16:07:29
444742ApplicationskernelUNCONFIRMEDnet-fs/autofs-5.0.6-r3 unable to mount NFS on HPPA: do_mount_indirect: path to be mounted is to long2013-02-06 04:36:10
444756Developmentmaintainer-wantedUNCONFIRMEDdev-ruby/rails-api - Rails for API only applications2012-11-26 19:00:29
444762Core systemtoolchainUNCONFIRMEDsys-devel/gcc-4.6.3: multilib libjava wants 32bit jack (app-emulation/emul-linux-x86-soundlibs)2013-01-02 01:03:40
444798Ebuildsdeb-toolsUNCONFIRMEDapp-arch/dpkg should create a /etc/dpkg/origins directory and appropriate files2013-02-20 19:39:52
444936ApplicationsmatsuuUNCONFIRMEDwww-apps/redmine creates keepdir /var/run/redmine2012-12-10 13:49:46
444964Applicationsx11UNCONFIRMEDx11-drivers/xf86-video-ati-7.0.0 with x11-base/xorg-server-1.13 - second X server fails to start on 2012-12-15 18:49:10
445004Ebuildsmaintainer-wantedUNCONFIRMEDapp-text/sgml-base - SGML infrastructure and SGML catalog file support2012-11-27 22:29:18
445014Ebuildsmaintainer-wantedUNCONFIRMEDdev-libs/xml-core - XML catalog infrastructure support2012-11-30 22:13:51
445106Eclasses and Profilesmaintainer-wantedUNCONFIRMEDxmlcatalog.eclass needed for managing xml catalogs in packages2012-11-29 19:33:23
445120LibrarypatrickUNCONFIRMEDsys-libs/tdb-1.2.10 - Compilatin phase failed - [Errno 2] No such file or directory: '/var/tmp/porta2012-12-08 15:46:16
445158Libraryx11UNCONFIRMEDx11-drivers/ati-drivers-12.11_beta with x11-base/xorg-server-1.13.0-r1 - segmentation fault in X2012-12-31 15:41:10
445186Installation Handbookdocs-teamUNCONFIRMEDA link to the online list of local USE flags is missing in the installation handbook2012-11-29 12:18:57
445192Other documentsoverlaysUNCONFIRMEDDeprecated references to /etc/make.conf in the Gentoo overlays users' guide2012-12-01 07:27:56
445222Core systemkernelUNCONFIRMEDsys-kernel/vanilla-sources uli526x module incompatible with GART_IOMMU2012-12-11 12:37:18
445248Applicationstools-portageUNCONFIRMEDapp-portage/genlop-0.30.8-r2 - Package name comes too late.2012-11-30 12:00:23
445280Ebuildsmaintainer-wantedUNCONFIRMEDmedia-libs/avbin-bin - New package. - AVbin is a binary release of a cross-platform, thin wrapper ar2012-12-09 09:27:38
445328DevelopmentdotnetUNCONFIRMEDdev-dotnet/glib-sharp-2.12.10 - libtool: Version mismatch error. This is libtool 2.4.2, but the libt2012-11-30 12:34:52
445376Ebuildsmaintainer-wantedUNCONFIRMEDdev-libs/sgml-data - Common SGML and XML data2012-12-01 05:27:15
445396Ebuildsmaintainer-wantedUNCONFIRMEDapp-text/debiandoc-sgml - DebianDoc SGML DTD and formatting tools2012-12-04 21:26:44
445544Applicationsmedia-videoUNCONFIRMEDmedia-video/dvdstyler-2.3.4 - Fails to generate iso, consider to hard-mask this version.2012-12-03 05:50:21
445548Ebuildsmaintainer-wantedUNCONFIRMEDnet-analyzer/tespeed - New package. - Terminal network speed test that uses servers from Speedtest.n2012-12-04 09:31:07
445568Librarynet-mailUNCONFIRMEDmail-mta/postfix with dev-libs/cyrus-sasl-2.1.25-r3 - broken SASL authentication2012-12-20 12:06:09
445578ApplicationsbluenessUNCONFIRMEDnet-p2p/bitcoind - Hardcoded paths (/var/run/bitcoind.pid, /usr/bin/bitcoind, var directory) in init2013-02-12 03:34:41
445590Libraryx11UNCONFIRMEDmedia-libs/mesa-9.0[g3dvl,vdpau]: Segmentation fault at surface.c:366 with media-video/mplayer2012-12-08 16:33:09
445594Core systembluenessUNCONFIRMEDsys-apps/coreutils - FAIL: tests/cp/fiemap-FMR.sh - Fails src_test with -march=native : valgrind "un2013-02-12 03:34:41
445634Feature Requestmirror-adminUNCONFIRMEDmirrorservice.org mirror: update URLs2012-12-02 15:44:23
445712Libraryx11UNCONFIRMEDapp-emulation/emul-linux-x86-opengl-20121202 does not install /us/lib32/libGLU.so.12013-01-23 19:53:52
445724Ebuildsmaintainer-wantedUNCONFIRMEDnet-p2p/armory - New package. - Full-featured Bitcoin client, offering a dozen innovative features..2012-12-04 14:45:46
445744Core systembase-systemUNCONFIRMEDsys-apps/hprofile - Add patch for improving init file.2012-12-04 15:09:20
445820OpenRCopenrcUNCONFIRMEDsys-apps/openrc-0.11.6 don't populate /sys in Linux Container2013-02-18 19:02:42
445878ApplicationsfontsUNCONFIRMEDapp-i18n/unicode-data should not depend on Debian sources2012-12-04 15:39:11
445902Libraryx11UNCONFIRMEDapp-emulation/emul-linux-x86-opengl-20121202{,-r1} makes some wine programs very sluggish2013-01-11 11:54:06
446028Ebuildsmaintainer-wantedUNCONFIRMEDdev-python/python-backports-1.0.1 - Backported python features2012-12-06 08:27:46
446186Applicationsnet-p2pUNCONFIRMEDnet-p2p/rtorrent-0.9.2: bad configure check prevents cross-compilation2012-12-06 05:03:19
446356ApplicationssciUNCONFIRMEDsci-visualization/mayavi-4.2.0 - /var/tmp/portage/sci-visualization/mayavi-4.2.0/temp/environment: l2012-12-27 09:32:14
446386Core systembase-systemUNCONFIRMEDsys-devel/automake-1.12.5 fails tests related to yacc2012-12-08 05:53:22
446498Core - Configurationdev-portageUNCONFIRMEDsys-apps/portage should handle typos in make.conf like those at the command line2012-12-08 17:10:05
446552Applicationsmedia-videoUNCONFIRMEDnet-misc/mediatomb-0.12.1-r1 - Mediatomb launches the transcoder twice for a given file.2012-12-09 08:28:14
446614ApplicationsvadimkUNCONFIRMEDapp-emulation/vmware-workstation-9.0.1.894247 - vmui| I120: SymBacktrace[0] 00007fff80c53fc0 rip=0002013-02-13 10:37:51
446682Applicationsamd64UNCONFIRMEDapp-emulation/emul-linux-x86* - new libraries for steam platform2013-02-20 22:44:38
446828Applicationsrobbat2UNCONFIRMEDnet-analyzer/sslsniff-0.8-r1 - conftest.cpp:21:26: fatal error: boost/asio.hpp: No such file or dire2012-12-11 22:11:50
446866UnspecifiedmozillaUNCONFIRMEDdev-libs/nspr-4.9.2 - checking whether the C compiler (gcc -Os -pipe -march=armv6j -mfpu=vfp -mfloat2013-01-05 13:03:54
446892ApplicationsopenofficeUNCONFIRMEDapp-office/libreoffice-bin-3.6.3.2 - Conditional formatting in Calc cells disappears2013-01-02 06:17:09
446968Applicationsmaintainer-neededUNCONFIRMEDnet-misc/netkit-telnetd-0.17-r10 - Use native gcc instead of CC (cross compile issue)2013-02-16 13:35:19
447044Ebuildsmaintainer-wantedUNCONFIRMEDdev-perl/Parse-DebianChangelog - Parse Debian changelogs and output them in other formats2012-12-26 21:51:22
447064ApplicationssgmlUNCONFIRMEDapp-text/build-docbook-catalog - file:///etc/xml/docbook:1: parser error : Document is empty2012-12-13 16:31:25
447100genkernelgenkernelUNCONFIRMEDsys-kernel/genkernel should have an option to avoid firmware installation at all2013-02-17 11:31:29
447102Applicationsidl0rUNCONFIRMEDnet-analyzer/nagstamon-0.9.9 throws glib.GError: Couldn't recognize the image file format for file '2012-12-13 14:34:59
447118Enhancement/Feature Requestsdev-portageUNCONFIRMEDFEATURES=clean-logs can be dangerous2012-12-13 14:54:27
447302Applicationspolynomial-cUNCONFIRMEDapp-emulation/virtualbox-modules-4.2.4 with gentoo-sources-3.7.0 - Header files were moved and re-or2013-02-03 19:32:07
447352Unspecifiedmaintainer-neededUNCONFIRMEDapp-laptop/tp_smapi-0.41 with kernel 3.7 - modprobe: FATAL: Error inserting tp_smapi (/lib/modules/32013-01-02 20:30:53
447356Unspecifiedpolynomial-cUNCONFIRMEDapp-emulation/virtualbox-modules-4.2.4 with kernel 3.7 - modprobe: FATAL: Error inserting vboxdrv (/2013-02-14 10:04:16
447436Applicationstools-portageUNCONFIRMED=app-portage/genlop-0.30.8-r2 - Use of uninitialized value in concatenation (.) or string at /usr/b2012-12-17 07:12:11
447474Core systembase-systemUNCONFIRMEDsys-devel/make-3.82-r4 - fails 1 test in features/parallelism2012-12-17 16:10:34
447500GNOMEgnomeUNCONFIRMEDnet-libs/webkit-gtk-1.8.3 USE=spell - bad utf8 data is being passed to enchant_dict_check2012-12-17 19:41:30
447532Applicationssci-chemistryUNCONFIRMEDsci-chemistry/avogadro segmentation fault with icc-built openbabel2012-12-18 16:45:45
447534Applicationspolynomial-cUNCONFIRMEDapp-emulation/virtualbox-4.1.22-r1 - VBox/Runtime/common/string/strformatrt.cpp:829:19: internal com2012-12-23 18:30:14
447626Applicationslu_zeroUNCONFIRMEDmedia-gfx/blender should not use environment variables to set installation directories2013-01-31 09:26:50
447702Core systemhardened-kernelUNCONFIRMEDsys-kernel/hardened-sources-3.7.0 fails to crosscompile for Ski-Simulator: include/linux/gfp.h:295:22012-12-19 09:10:48
447714EbuildspythonUNCONFIRMEDdev-lang/python should have epatch_user2012-12-18 15:46:32
447746Librarymedia-videoUNCONFIRMED[PATCH] media-libs/mlt-0.8.2 builds with -DARCH_X86_64 even though CHOST=i686-pc-linux-gnu and fails2012-12-24 10:27:50
447754Core systemhardened-kernelUNCONFIRMEDsys-kernel/vanilla-sources with sys-devel/gcc-4.6+ creates unbootable kernel images on ia642013-02-21 02:19:12
447782LibrarycppUNCONFIRMEDdev-libs/boost-1.52.0-r5 - .../temp/environment: line 964: 31328 Segmentation fault b2 "$@"2012-12-19 13:37:44
447862Applicationsx11UNCONFIRMEDx11-drivers/xf86-video-ati, x11-base/xorg-server or related components memory leak2013-01-03 13:26:06
447920Ebuildsmaintainer-wantedUNCONFIRMEDnet-analyzer/check_mk - Nagios / Icinga general purpose plugin to retrieve data2013-01-11 16:04:32
447970Core systemsandboxUNCONFIRMEDsys-apps/sandbox makes autoconf's getcwd long path test take hours2013-01-31 14:19:12
448062ApplicationswilliamhUNCONFIRMEDapp-accessibility/speech-dispatcher-0.7.1-r1 src_compile(): mv: cannot stat '.deps/spd_audio.Tpo': N2013-01-01 12:02:28
448094Eclasses and ProfilesmgornyUNCONFIRMEDgit-2_update_repo fails if HEAD file is missing2012-12-24 09:48:06
448098KDEx11UNCONFIRMEDx11-base/xorg-server-1.13 x11-apps/xinput - xinput --map-to-output 10 (keyboard related id) VGA1 (an2013-01-02 09:11:39
448104DevelopmentperlUNCONFIRMEDdev-perl/PortageXS-0.02.10-r2 - test-suite fails - Cannot open file /etc/portage/make.conf at lib//P2012-12-24 09:37:14
448144LiveCD/DVDtenUNCONFIRMEDmismatched checksum for x86 amd64 20121221 LiveDVD iso2012-12-22 03:06:11
448152Applicationslu_zeroUNCONFIRMEDapp-emulation/qemu-user-1.0 should depend on sys-apps/usbredir[static-libs]2012-12-24 16:15:07
448156Core systemgenkernelUNCONFIRMEDGenkernel creates broken initramfs image - wrong lvm links blocks booting to a LVM rootfs2013-02-17 02:24:54
448168Applicationsmaintainer-wantedUNCONFIRMEDdev-perl/pDLNA - a UPnP and DLNA service which serves multimedia content to compatible clients on th2012-12-24 15:40:36
448172Core systemtoolchainUNCONFIRMEDsys-devel/gcc-4.1.2 - /usr/lib64/libart_lgpl_2.so: could not read symbols: File in wrong format /// 2012-12-25 15:17:16
448206Core systemlu_zeroUNCONFIRMEDflag-o-matic.eclass: `CHOST=${CTARGET} strip-unsupported-flags` doesn't strip flags2013-01-07 17:18:12
448238Core systemrobbat2UNCONFIRMED[PATCH] 2012-12-24 12:42:06
448248genkernelgenkernelUNCONFIRMEDsys-kernel/genkernel-3.4.45 does not update /etc/genkernel.conf2012-12-26 11:40:15
448294Applicationspolynomial-cUNCONFIRMEDapp-emulation/virtualbox-4.2.6: cannot open shared object libstdc++.so.62012-12-24 10:19:17
448316Ebuildsdev-zeroUNCONFIRMEDapp-emulation/spice: error BadMatch request X_SetInputFocus2012-12-25 16:38:18
448354Core systemrobbat2UNCONFIRMEDsys-fs/lvm2-2.02.97-r1 fails to crosscompile: configure: error: thin_check not found in path2013-01-19 16:12:30
448400Librarymaintainer-wantedUNCONFIRMEDdev-php/PEAR-Image_Barcode2 - generate barcode representations of given strings2012-12-24 16:11:53
448416GamesgamesUNCONFIRMEDgames-strategy/dungeon-defenders - Humble Indie Bundle 7 game2013-01-04 00:06:56
448468Ebuildscommon-lispUNCONFIRMEDdev-lisp/asdf-2.26 by default builds documentation, requires tex2012-12-25 09:39:37
448472ApplicationsvimUNCONFIRMEDapp-editors/gvim - segmentation fault when using clang_complete2012-12-25 15:39:05
448750Applicationsphp-bugsUNCONFIRMEDdev-php/PEAR-Mail: Fix non-static function warning2012-12-27 02:01:00
448770GNOMEgnomeUNCONFIRMED[gnome overlay] app-accessibility/at-spi2-atk-9999 fails to build due to failed patch "at-spi2-atk-2012-12-27 05:56:05
448772GNOMEgnomeUNCONFIRMED[gnome overlay] x11-libs/gtk+-9999 fails to build due to failed patch "gtk+-3.3.18-fallback-theme.2012-12-27 05:55:29
448790Core systemrobbat2UNCONFIRMEDsys-fs/lvm2 - Please don't depend on udev when USE="+static -udev". (was: static flag requires +udev2013-02-10 16:07:22
448824ApplicationssciUNCONFIRMEDsci-visualization/ggobi-2.1.9-r1 - autom4te-2.69: ../../m4/lt~obsolete.m4: no such file or directory2012-12-27 14:07:04
448874Applicationsgnome-officeUNCONFIRMEDapp-office/glabels-3.0.1: /usr/include/evolution-data-server-3.6/libebook/e-contact.h:10:2: error: #2013-02-16 20:05:55
448906Miscbase-systemUNCONFIRMEDnet-firewall/iptables-1.4.16.3 upgrade does not preserve state matches2013-01-02 20:09:23
448964GNOMEgnomeUNCONFIRMEDgnome-extra/bug-buddy-2.32.0-r2 eds build fails with gnome-extra/evolution-data-server-3.62012-12-27 23:11:40
449034Ebuildsmaintainer-wantedUNCONFIRMEDNew package: app-backup/insync-bin-0.9.32 - Advanced cross-platform Google Drive client2012-12-28 14:36:13
449116EbuildsdanielpiUNCONFIRMEDapp-accessibility/julius::sunrise and sci-libs/fplll::sage-on-gentoo both install /usr/bin/generate2012-12-29 11:48:00
449132ApplicationschutzpahUNCONFIRMED>=app-admin/salt-0.11.0 does not install config template files2012-12-29 11:40:31
449200Keywording and StabilizationaballierUNCONFIRMED=dev-libs/kpathsea-6.1.0_p20120701: please stabilize2013-02-17 13:11:18
449274GNOMEgnomeUNCONFIRMEDnet-im/empathy-3.6.2-r2 main menu doesn't function properly2012-12-30 13:23:21
449296KDEkdeUNCONFIRMEDnet-im/ktp-call-ui-0.5.1: gsttaglist.h:152:28: error: conflicting declaration ‘typedef struct _GstTa2013-01-18 10:50:15
449340ApplicationslackUNCONFIRMEDwww-client/firefox-17.0.1 crashed while watching movie online2013-01-02 22:09:55
449354ApplicationsqemuUNCONFIRMEDapp-emulation/qemu-guest-agent fails to shutdown the guest2013-01-01 20:32:37
449372Applicationsmedia-videoUNCONFIRMEDnet-misc/mediatomb - broken Samsung 2012 TV send an invalid request2013-01-24 20:18:11
449436Applicationspolynomial-cUNCONFIRMEDapp-emulation/virtualbox-4.1.22-r1 - Checking for Mesa / GLU: Mesa not found at -L/usr/X11R6/lib 2012-12-31 16:33:12
449442JavajavaUNCONFIRMED[java-overlay] dev-java/gnu-classpath-0.99: ERROR: Package ecj-gcj-* was not found!2012-12-31 12:37:35
449474Librarymaintainer-wantedUNCONFIRMEDdev-tex/fontpro - LaTeX support for Adobe's Pro opentype fonts2013-01-11 22:14:05
449476Ebuildsmaintainer-wantedUNCONFIRMEDdev-tex/fontaxes - Additional font axes for LaTeX2013-01-11 22:14:39
449478Ebuildsmaintainer-wantedUNCONFIRMEDdev-tex/mnsymbol - Mathematical symbol font for Adobe MinionPro2013-01-11 22:15:11
449480Librarymaintainer-wantedUNCONFIRMEDdev-tex/mdsymbol - Symbol fonts to match Adobe Myriad Pro2013-01-11 22:15:23
449526Applicationsnet-imUNCONFIRMEDnet-im/pidgin-2.10.6 fails to compile with USE="eds" and gnome-extra/evolution-data-server-3.62013-02-12 16:15:52
449652Ebuildsmaintainer-wantedUNCONFIRMEDmedia-video/enzyme-0.2.ebuild - Video metadata parser2013-01-22 02:24:26
449666Forumsforum-modsUNCONFIRMEDURL formating issues2013-01-01 16:52:06
449700Ebuildsmaintainer-wantedUNCONFIRMEDPlease add sys-boot/boot-update to the tree2013-02-10 18:40:29
449720Core systemferringbUNCONFIRMEDsys-apps/pkgcore-0.8.6: SyntaxError during compilation of Python modules for Python 3.22013-01-02 10:12:25
449742ApplicationskdeUNCONFIRMEDnet-im/ktp-call-ui-0.5.1 does not build with net-libs/telepathy-farstream-0.6.02013-02-19 21:49:10
449794Ebuildsmaintainer-wantedUNCONFIRMEDapp-emulation/tilem-2.0 - an emulator and debugger for Texas Instruments Z80-based graphing calculat2013-01-03 00:16:42
449818Applicationsnet-p2pUNCONFIRMEDnet-p2p/deluge-1.3.5 with >=net-libs/rb_libtorrent-0.16 - metadata for torrents added using a magnet2013-01-03 12:09:55
449918Documentationdev-portageUNCONFIRMEDcollision message says what *not* to do, but not what *to* do2013-01-03 03:09:45
449948Core systemtoolchainUNCONFIRMEDsys-libs/glibc - inner-net license is of a boolean non-free nature2013-01-03 12:47:26
449950Applicationsnet-dialupUNCONFIRMED=net-dialup/pptpd-1.3.4-r1 incorrect restart: no matching processes found2013-01-17 06:58:53
450042EbuildsxfceUNCONFIRMED[xfce-dev overlay] New ebuild xfce4-notes-plugin-1.8.0_alpha and a patch to make it work2013-01-23 16:34:39
450068Ebuildsmaintainer-wantedUNCONFIRMEDsys-apps/evemu - Tools and bindings for kernel input event device emulation, data capture and replay2013-01-03 23:06:27
450220ApplicationsprintingUNCONFIRMED=net-print/cups-1.5.2-r4 - German localization file has empty strings.2013-01-05 18:07:19
450246LibrarygnomeUNCONFIRMEDdev-python/pygtk-2.24.0 - memory leak in _wrap_pango_cairo_create_layout2013-01-05 16:55:14
450252EbuildsnirbheekUNCONFIRMEDNetworkmager and dhclient: can't create /var/lib/dhclient/*-eth0.lease2013-01-06 18:25:17
450260GNOMEgnomeUNCONFIRMEDnet-im/empathy-3.6.2-r2 fails to compile2013-01-04 21:31:54
450300Ebuildsmaintainer-wantedUNCONFIRMEDx11-misc/menulibre - An advanced menu editor that provides modern features in a clean, easy-to-use i2013-01-27 17:35:31
450322Applicationssci-biologyUNCONFIRMEDsci-biology/mira-3.4.0.2 - libtool: Version mismatch error. This is libtool 2.4, but the definition2013-02-17 09:09:47
450386DevelopmentkdeUNCONFIRMEDdev-util/cmake: FindBLAS patch doesn't correctly use pkg-config results and may fail2013-01-08 12:36:44
450444EbuildsqtUNCONFIRMED[qt overlay] dev-util/gammaray - Tool to poke around in a Qt-application and also to manipulate the 2013-02-06 04:07:10
450452DevelopmentxfceUNCONFIRMED[xfce-dev overlay] xfce4-dev-tools-9999.ebuild -- portage patch fail2013-01-09 21:45:53
450664Applicationsx11UNCONFIRMEDapp-emulation/wine-1.4.1 with >=x11-base/xorg-server-1.11 - mouse behaves erratically2013-01-08 04:22:22
450748GNOMEgnomeUNCONFIRMEDSegmentation fault with media-sound/rhythmbox-2.972013-01-07 21:31:17
450776HardenedhardenedUNCONFIRMEDapp-emulation/wine-1.5.21 - configure: checking for -lGL... ./conftest: error while loading shared l2013-02-11 21:23:57
450906Keywording and StabilizationsciUNCONFIRMEDsci-libs/libqalculate-0.9.7-r1: please stabilize2013-01-08 17:08:14
450930GNOMEgnomeUNCONFIRMEDglib-2.34.x causes nautilus-2.32 to consume 1 whole core when attempting to display thumbnails2013-02-20 16:36:03
450946Ebuildsmaintainer-wantedUNCONFIRMEDapp-vim/syntastic - vim plugin: Syntastic is a syntax checking plugin that runs files through extern2013-01-08 20:07:20
450956LibrarycppUNCONFIRMEDdev-libs/boost USE=icu - sub-slot operator causes downgrade to dev-libs/icu-49.1.22013-01-12 13:32:41
450986JavajavaUNCONFIRMEDNew Tomcat init script does not respect catalina.properties2013-02-04 16:01:01
451040[DE]docs-teamUNCONFIRMEDConflict with english translation "Anacron exits"2013-01-09 12:11:06
451054LibrarycjkUNCONFIRMEDdev-libs/oniguruma-5.9.2-r1 - autotools-utils_src_prepare: Cannot find the latest automake! Tried 1.2013-01-09 14:27:12
451290LibraryhaskellUNCONFIRMEDdev-haskell/pandoc-types-1.9.1.1 - setup: At least the following dependencies are missing: syb -any2013-01-11 18:00:06
451326Corelu_zeroUNCONFIRMEDapp-emulation/qemu-user-1.1.0-r1: "qemu: Unsupported syscall: 373" for epoll syscall inside arm chro2013-01-20 17:32:15
451394Applicationsrobbat2UNCONFIRMEDsci-mathematics/nusmv-2.5.2 USE=minisat - SolverTypes.h:126:56: error: cast from 'void*' to 'int' lo2013-01-12 16:25:09
451452Core systemrobbat2UNCONFIRMEDsys-fs/lvm2-2.02.97-r1 - Errors on LV create/delete operations in systemd-196 environment.2013-02-07 01:16:09
451454KDEkdeUNCONFIRMEDkde-base/kdelibs-4.9.5: kauth helpers create .kde and .config in /2013-02-11 15:20:03
451456LibraryqtUNCONFIRMED[qt overlay] Qt5 packages try to link against already installed versions during recompilation2013-02-14 11:59:11
451472DevmanualdevmanualUNCONFIRMEDdevmanual should have a better explanation of keepdir & dodir usage2013-01-15 21:04:19
451478Core systemrobbat2UNCONFIRMEDsys-fs/lvm2 - /etc/init.d/lvm should support multiple volume groups - Command failed with status cod2013-01-31 02:20:00
451524Applicationssci-mathematicsUNCONFIRMEDsci-mathematics/octave-3.6.3 - libcruft/.libs/libcruft.so: undefined reference to `_gfortran_transfe2013-02-12 03:35:50
451584ApplicationscardoeUNCONFIRMEDapp-emulation/libvirt-1.0.1 - does not start LXC VM2013-02-05 17:25:51
451622Core systembase-systemUNCONFIRMEDsys-apps/man-db-2.6.3-r1[nls]: Translated manpages will not be installed if app-text/po4a is not ins2013-01-15 12:05:38
451624ApplicationssciUNCONFIRMED[science overlay] sci-mathematics/scilab-5.4.0 should depend on >=dev-java/flexdock-1.2 sci-libs/arp2013-01-19 17:38:22
451626Applicationssci-mathematicsUNCONFIRMED[science overlay] sci-mathematics/scilab-5.4.0 - buildDoc: Error while building documentation: Could2013-02-12 03:35:49
451674ApplicationsgamesUNCONFIRMEDgames-strategy/xconq-7.4.1 fails to build with dev-lang/tcl-8.6.02013-01-14 07:03:16
451846Installation Handbookdocs-teamUNCONFIRMEDwireless-tools no longer function with default installation2013-01-20 16:04:16
451946ApplicationszerochaosUNCONFIRMEDdev-ruby/metasploit_data_models-0.4.0 version bump request2013-01-15 12:25:13
451996ApplicationsdjcUNCONFIRMEDdev-vcs/hgsubversion-1.4: compilation failure with Python 2.52013-01-15 12:37:58
452172Unclassifieddev-portageUNCONFIRMEDemerge's --jobs does not do full parallelization due to PDEPEND circular dependencies2013-01-15 11:55:26
452604Eclasses and Profilesbase-systemUNCONFIRMEDCPU_FEATURES: move USE="mmx sse etc..." CPU features to USE expanded variable2013-01-25 05:38:49
452730Applicationsdesktop-wmUNCONFIRMEDx11-wm/icewm-1.3.7 suggested patches2013-01-18 22:55:56
452734OtheraltUNCONFIRMEDwww-client/firefox-18.0-r1 fails to build (prefix) - fatal error: jemalloc.h: No such file or direct2013-01-29 19:41:01
452800Ebuildsmaintainer-wantedUNCONFIRMEDapp-office/gnuaccounting - a Free Java cross-platform accounting and bookkeeping application2013-01-19 16:41:10
452850Ebuildsmaintainer-wantedUNCONFIRMEDwww-apps/snorby - Ruby on Rails application for network security monitoring2013-01-18 17:12:00
452874Applicationslu_zeroUNCONFIRMEDmedia-video/mplayer-1.1 - mplayer-1.1-libav-9.patch introducing enum AVPixelFormat, should be called2013-02-18 15:15:08
452898DevmanualdevmanualUNCONFIRMEDPortage only does dependency checking on the latest slot2013-01-21 15:46:28
453002LibrarypatrickUNCONFIRMEDsci-libs/openfoam-2.1.1 - Patches to make paraFoam work with Paraview 3.98.02013-02-18 18:55:08
453020ApplicationstommyUNCONFIRMEDdev-vcs/subversion, please consider patch to fix paths reported for externals2013-01-19 19:26:52
453038Ebuildsbase-systemUNCONFIRMEDsys-fs/reiser4progs-1.0.7 ? w/ patches from reiserfs-devel mailing list2013-02-08 17:27:09
453080All ISOreleaseUNCONFIRMEDSIL 3124 SATA controller driver missing from Alpha install CD2013-01-20 01:23:16
453088ApplicationskdeUNCONFIRMEDmedia-sound/amarok-2.7.0: sandbox access violation2013-02-14 11:48:25
453098Core systembase-systemUNCONFIRMEDsys-devel/patch-2.7.1-r1: fails tests crlf-handling and need-filename2013-01-21 11:54:50
453122ApplicationsperlUNCONFIRMEDPlease stabilize =app-text/po4a-0.42 (was: 0.38 misparses CDATA section)2013-02-19 20:59:42
453204Librarymobile-phoneUNCONFIRMEDdev-libs/libvformat-1.13-r2: fix some API documentation errors2013-01-21 12:38:15
453208ApplicationswiredUNCONFIRMEDwww-client/uzbl-9999 - src/uzbl-core.h:16:25: fatal error: glib/gstdio.h: No such file or directory2013-01-21 19:18:42
453212JavajavaUNCONFIRMEDwww-servers/tomcat-7.0.X - classloading issues due to too much jars in initial classpath2013-01-21 11:59:16
453278Core systemsystemdUNCONFIRMEDsys-apps/systemd - please port netcfg from Arch Linux for easier network configuration2013-01-21 20:21:49
453280GamesgamesUNCONFIRMEDgames-strategy/atom-zombie-smasher - new ebuild2013-01-21 17:58:47
453306Applicationsnet-fsUNCONFIRMEDnet-fs/nfs-utils-1.2.6: mount.nfs: Cannot allocate memory2013-01-31 15:57:57
453362[RU]docs-teamUNCONFIRMEDTranslations in Jan 20132013-01-21 15:58:54
453392GNOMEgnomeUNCONFIRMEDgnome-base/gdm-3.6 USE=plymouth prevents the automatic switch to vt7 on startup2013-02-12 09:11:09
453472Ebuildsmaintainer-wantedUNCONFIRMEDgames-emulation/handheld-quake-0.7.ebuild - Handheld Quake (aka HQ) is a simulator of soviet, russia2013-01-23 03:26:50
453476Ebuildsmaintainer-wantedUNCONFIRMEDgameandwatch-0.3.ebuild - This is a generic engine for simulation of Game & Watch-like games2013-01-23 03:24:22
453480Applicationsmysql-bugsUNCONFIRMEDdev-db/mysql-5.1.66 - emerge --config fails after change of datadir in my.cnf2013-01-22 19:11:18
453500ApplicationsbircophUNCONFIRMEDapp-doc/root-docs-5.34.03 - Error: Function Open(filename,"RECREATE") is not defined in current scop2013-02-19 19:12:58
453516ApplicationspatrickUNCONFIRMEDapp-emulation/virtualbox-bin-4.2.6 - can not use Bridged Adapter in network config2013-01-23 14:33:55
453642Applicationsnet-imUNCONFIRMEDnet-im/empathy-2.34.0-r2 - accounts window fails to open2013-01-23 16:38:50
453644Core systemjsbronderUNCONFIRMEDsys-cluster/torque-2.5.12 - qstat-qstat.o: In function `tcl_run': qstat.c:(.text+0x1ac5): undefined 2013-02-06 16:34:18
453658Ebuildsmaintainer-wantedUNCONFIRMEDdev-util/jenkins - application that monitors executions of repeated jobs, such as building a softwar2013-01-30 11:30:11
453674Third-Party Toolstools-portageUNCONFIRMEDapp-portage/ufed: Shortening/cleaning flag descriptions by eliminating "[Enables/Adds/Includes] Supp2013-01-23 13:44:40
453730GNOMEgnomeUNCONFIRMEDdev-libs/libgweather-3.6.2: Changes between v3.4 and v3.6 break 4 gnome packages2013-01-23 20:49:10
453778Ebuildsnet-fsUNCONFIRMEDnet-fs/autofs - sandbox violation in `mount -s' touching /run/mount2013-02-16 13:20:27
453800Eclasses and ProfilespythonUNCONFIRMEDpython.eclass: dev-python/cython fails to install in environment that contains coreutils on Gentoo/F2013-01-29 23:58:29
453802Keywording and StabilizationwineUNCONFIRMEDapp-emulation/winetricks stable request2013-01-24 15:05:15
453804JavajavaUNCONFIRMEDCreate ebuilds for jdk 8 (early access release), a current Java 8 partial implementation2013-01-24 12:02:05
453834Unclassifieddev-portageUNCONFIRMEDsys-apps/portage-2.1.11.xy - (anger at) handling of dir symlinks2013-01-24 20:23:11
453842GNOMEgnomeUNCONFIRMED[PATCH] gnome-base/gnome-shell-3.6.2-r1: Fix partialy memory leaks issues2013-02-12 09:35:27
453918ApplicationsxmwUNCONFIRMED=app-admin/conkyforecast-2.24 with conky-1.9.0-r1 - `conkyForecastWU --datatype=WI` - conkyForecastW2013-02-10 16:49:05
453924Developmentphp-bugsUNCONFIRMEDdev-lang/php-5.4.8 - Shouldn't create /var/lib/net-snmp/mib_indexes at runtime2013-01-26 01:47:58
453992Applicationsrobbat2UNCONFIRMEDnet-misc/rdate-1.4-r3 does not honor RDATE_TIMEOUT in /etc/conf.d/rdate2013-01-26 15:32:30
454062Applicationsshell-toolsUNCONFIRMEDapp-misc/byobu-5.27 - create window failed: /bin/bash no such file or directory2013-02-06 16:13:05
454260ApplicationsgraphicsUNCONFIRMEDmedia-gfx/nvidia-cg-toolkit-2.1.0017-r1 - should install a symlink on path /opt/nvidia-cg-toolkit 2013-01-28 13:14:58
454266Keywording and Stabilizationrobbat2UNCONFIRMEDsys-apps/linux-misc-apps-3.6-r1 stabilization request2013-01-28 12:11:50
454298Ebuildssci-mathematicsUNCONFIRMEDsci-mathematics/maxima - maxima cannot be started from wxmaxima or cantor2013-02-04 03:36:37
454354Applicationsidella4UNCONFIRMEDapp-emulation/xen-tools-4.2.1 - Fails to compile with KeyError: '.text.asm.out/../src/smp.c.68'2013-02-01 21:20:22
454362Core systemkernel-miscUNCONFIRMEDsys-fs/jfsutils-1.1.15 - Fails to build with +static if sys-apps/util-linux is built without +static2013-01-28 02:04:19
454376Applicationsmedia-videoUNCONFIRMEDmedia-video/recordmydesktop messes up bitrate2013-01-28 13:09:26
454384BugzillabugzillaUNCONFIRMEDExtend "My Bugs" list with RESOLVED NEEDINFO and RESOLVED TEST-REQUEST states2013-01-28 15:27:34
454396Ebuildsmaintainer-wantedUNCONFIRMEDNew ebuild: gnome-extra/proxy_applet-0.2 - GNOME applet for changing network proxy configuration fro2013-01-28 08:58:55
454404Core systembase-systemUNCONFIRMEDsys-fs/static-dev: should also check for devtmpfs mounted at /dev2013-01-29 18:37:25
454418Unspecifiedamd64UNCONFIRMEDapp-emulation/emul-linux-x86-soundlibs: pulseaudio version mismatch2013-01-28 19:22:58
454466Applicationsmedia-tvUNCONFIRMEDapp-misc/lirc-9.0-r2 - irexec init script uses deprecated --chuid2013-01-29 14:50:41
454474GNOMEgnomeUNCONFIRMEDnet-im/empathy-3.6.3: history uses wrong encoding to show utf8 logs2013-01-28 22:49:52
454478SELinuxselinuxUNCONFIRMEDsys-apps/busybox-1.20.2 fails to merge on selinux profile with USE="static"2013-02-17 09:37:40
454508FreeBSDbsdUNCONFIRMEDfreebsd-rescue-9.1: Fail to link in environment that dev-util/pkgconfig-0.28 is installed.2013-01-29 11:31:19
454512ApplicationssciUNCONFIRMED[science overlay] sci-mathematics/scilab-5.4.0[gui] depends on dev-java/jogl:2 which is not found2013-02-03 15:20:24
454562ApplicationsroxUNCONFIRMEDrox-extra/archive - deprecation warning about python_mod_cleanup()2013-01-29 19:23:09
454568Librarymedia-videoUNCONFIRMEDmedia-libs/mlt-0.8.8 - luma.c:92:11: erreur interne du compilateur: dans build2_stat, à tree.c:38032013-02-01 10:14:17
454604Third-Party ToolsdolsenUNCONFIRMEDapp-portage/layman feature requests2013-01-30 02:01:26
454608JavajavaUNCONFIRMEDdev-java/rxtx patches to build on ppc642013-01-30 05:47:24
454652StagesreleaseUNCONFIRMEDcurrent stage3-amd64-nomultilib has an immediate block between sys-apps/module-init-tools and sys-ap2013-01-30 14:46:25
454724Ebuildsmaintainer-wantedUNCONFIRMEDnet-analyzer/tallow - Block hosts that attempt to bruteforce SSH using the journald API2013-01-30 19:39:56
454864GamesgamesUNCONFIRMEDgames-fps/quake3-cpma: re-add amd64 keyword + homepage update2013-01-31 17:16:34
454868ApplicationslackUNCONFIRMEDx11-wm/fluxbox-? with updated media-libs/glew-1.9.0 - `fbrun` yields error while loading shared libr2013-02-04 17:23:15
454874Developmentlang-miscUNCONFIRMEDdev-lang/tcc-0.9.26_pre1 - access violation in install tcc-doc.info /usr/share/info2013-02-04 05:50:10
454882DevelopmentperlUNCONFIRMEDdev-perl/TermReadKey-2.300.0 - ReadKey.o: file not recognized: file truncated - collect2: ld executi2013-01-31 23:12:14
454900Developmentdev-zeroUNCONFIRMEDdev-php/libvirt-php-0.4.7 version bump and patches2013-02-04 09:50:47
454914OpenRCopenrcUNCONFIRMEDsys-apps/openrc: Feature Request: Open logfile before chuid option2013-01-31 23:56:37
454916DevelopmenthwoarangUNCONFIRMEDdev-util/qt-creator: apply patch to make ~arm work2013-02-17 11:25:06
455080Core systemwschlichUNCONFIRMEDsys-process/fcron-3.1.1 - Files were moved without updating default selinux file context policies, p2013-02-02 17:38:34
455122EbuildszerochaosUNCONFIRMEDnet-analyzer/wireshark-1.8.5{,-r1} emerge fails - Can't locate object method "recurse" via package 2013-02-16 13:32:31
455162DevelopmentssuominenUNCONFIRMEDdev-util/catfish-0.4.0.2 needs dev-python/pygobject:3 in RDEPEND - Error: The required module gi.rep2013-02-04 02:33:15
455164[RU]docs-teamUNCONFIRMEDHPPA Handbook translation2013-02-02 16:03:46
455198Ebuildsmaintainer-wantedUNCONFIRMEDNew ebuild: media-gfx/ACBFViewer-0.95 - Advanced Comic Book Format Viewer2013-02-03 01:06:39
455210DevelopmentpythonUNCONFIRMEDdev-lang/python-3.2.3 fails to build native Parser/pgen while crosscompiling2013-02-04 19:42:53
455270Applicationssci-mathematicsUNCONFIRMED[science overlay] sci-mathematics/scilab-5.4.0 build can't find lots of files2013-02-12 13:14:40
455302Coredev-portageUNCONFIRMEDdispatch-conf broken: OSError: [Errno 21] Is a directory2013-02-03 17:22:38
455470Applicationsnet-dialupUNCONFIRMEDnet-dialup/pptpclient-1.7.2-r2: applied patch hardcodes wrong ip path2013-02-04 18:47:35
455478ApplicationslxdeUNCONFIRMEDlxde-base/lxdm-0.4.1-r5 - How can I stop it from creating "/.dbus"?2013-02-04 19:38:47
455524Core systembase-systemUNCONFIRMEDnet-misc/openssh-6.1: update HPN patchset2013-02-05 23:49:53
455538GamesgamesUNCONFIRMEDgames-strategy/x2 broken link in description2013-02-20 23:59:09
455604ApplicationsperlUNCONFIRMEDmail-filter/spamassassin-3.3.2-r1 initd script fails because checkpath is missing2013-02-05 21:53:32
455636ApplicationscardoeUNCONFIRMEDapp-emulation/libvirt-1.0.2 USE=-libvirtd - node_device/node_device_udev.c:1608:37: error: unknown t2013-02-05 21:55:17
455818Applicationsford_prefectUNCONFIRMEDmedia-sound/pulseaudio USE=xen should depend on app-emulation/xen-tools not app-emulation/xen2013-02-06 13:55:31
455828Developmentdev-embeddedUNCONFIRMED=dev-embedded/avr-libc - Please add epatch_user to ebuild.2013-02-06 13:29:14
455830Developmentdev-embeddedUNCONFIRMEDadd support for atxmega16a4u / atxmega32a4u2013-02-08 05:48:56
455874Installation Handbookdocs-teamUNCONFIRMEDminor typo in code listing 2.1 (ru translation)2013-02-06 16:33:17
455880Core systemkernelUNCONFIRMEDCONFIG_DEVTMPFS default value in kernel configuration (gentoo-sources and potentially others)2013-02-17 19:40:19
456120Applicationscron-bugsUNCONFIRMEDsys-process/vixie-cron with app-admin/logrotate - cron cannot handle cron.daily file with a dot in i2013-02-15 08:38:29
456220Applicationsx11UNCONFIRMEDx11-base/xorg-server on hardened - X exits fatally upon failure to enable sys_iopl2013-02-12 14:40:15
456308Core systembase-systemUNCONFIRMEDgrub2 won't launch memtest86 and memtest86+ if / and /boot are separated partitions and grub2 graphi2013-02-13 22:19:39
456354Applicationspolynomial-cUNCONFIRMEDapp-emulation/virtualbox-4.2.6-r1 fails to build. kmk_builtin_mv shows options help. kmk error 642013-02-11 17:25:35
456386DevelopmenthaskellUNCONFIRMEDdev-lang/ghc-7.6.2 - Segmentation fault [libraries/haskell98/dist-install/build/Prelude.o] & others 2013-02-14 10:41:34
456388KDEkdeUNCONFIRMEDkde-misc/krename-4.0.9: fatal error: freetype/config/ftheader.h: No such file or directory2013-02-19 06:44:46
456404Applicationssci-geosciencesUNCONFIRMEDsci-geosciences/gpsbabel-1.4.4 - shape.c:23:29: fatal error: libshp/shapefil.h: No such file or dire2013-02-12 14:56:18
456646LibraryfontsUNCONFIRMEDmedia-libs/fontconfig-2.10.2: /var/lib/texmf/web2c/pdftex/pdfjadetex.fmt doesn't match pdftex.pool (2013-02-20 11:21:15
456718LibraryjdhoreUNCONFIRMEDmedia-plugins/audacious-plugins-3.3.4 is incompatible with media-video/libav, fails during configure2013-02-11 17:14:50
456764Keywording and StabilizationrentorbuyUNCONFIRMED=net-firewall/shorewall{,-core}-4.5.11.2 stabilisation request2013-02-11 17:03:57
456784ApplicationslxnayUNCONFIRMED[sabayon overlay] net-wireless/blueman-1.23-r2: Failed Patch: blueman-1.21-fix-segfault-startup.patc2013-02-12 15:10:18
456814EbuildsqemuUNCONFIRMEDapp-emulation/qemu-1.2.2-r3[ncurses] fails configure with sys-libs/ncurses[tinfo]2013-02-14 14:14:03
456846ApplicationscardoeUNCONFIRMEDapp-emulation/libvirt-1.0.2-r1 has broken python bindings2013-02-12 22:17:07
456848OtheraltUNCONFIRMEDdev-libs/openssl[ipv6] fails on non-GNU prefix platforms2013-02-13 18:50:45
456892Portage Documentationpms-bugsUNCONFIRMEDMissing formal specification of ebuild naming policy2013-02-13 00:48:01
456896LibrarygraphicsUNCONFIRMEDmedia-libs/lensfun-0.2.5-r2 - Fatal error: can't create out/posix.x86_64/release/libs/lensfun/mod-co2013-02-12 08:34:39
456908Core systempam-bugsUNCONFIRMEDsys-libs/pam-1.1.6-r2: /usr/lib64/portage/bin/isolated-functions.sh: line 215: wait: `Failed Running2013-02-16 21:10:14
456912Core systemtoolchainUNCONFIRMEDsys-libs/glibc-2.17 - remove patch 6600_mips_librt-mips.patch2013-02-18 19:15:45
456934Other documentsoverlaysUNCONFIRMEDSince the 2012-09-09-make.conf-and-make.profile-move the overlay instructions are out of date2013-02-13 10:03:36
456970Applicationshardened-kernelUNCONFIRMEDapp-editors/emacs-24.2 failed to emerge with a segmentation fault on hardened-sources-3.7.4-r12013-02-12 22:17:52
456980ApplicationsopenofficeUNCONFIRMEDapp-office/libreoffice-4.0.0.3 - inserting movie or sound in impress fails with "The format of the s2013-02-13 19:08:21
456994Ebuildsmaintainer-wantedUNCONFIRMEDdev-python/polib - a library to manipulate gettext catalogs file2013-02-13 10:22:11
457010ApplicationsfloppymUNCONFIRMEDnet-misc/flexget-1.0.3344: BUG: Unhandled error in plugin --series: Only '='/'!=' operators can be u2013-02-17 18:32:40
457026Core systembase-systemUNCONFIRMEDnet-misc/openssh: no host keys generated on systemd based system2013-02-20 18:21:40
457102DevelopmentpchristUNCONFIRMEDdev-lang/swig-2.0.8 automagically depends on sci-mathematics/octave2013-02-13 19:57:05
457104KernelsecurityUNCONFIRMEDDriver of cypress corrupts file-system and partition table of external hard drives with M6116 SATA B2013-02-14 15:53:16
457126Libraryamd64UNCONFIRMEDapp-emulation/emul-linux-x86-qtlibs-20121202 should install libQtSvg2013-02-14 07:14:29
457192HardenedhardenedUNCONFIRMEDnet-misc/quagga-0.99.21 with sys-devel/gcc-4.5.3 sometimes gives PAX: terminating task /usr/sbin/osp2013-02-21 02:32:42
457520ServerjavaUNCONFIRMEDinit script for www-servers/tomcat-7.0.32 drops STDOUT and STDERR2013-02-14 15:45:51
457534ServerjsbronderUNCONFIRMEDsys-cluster/torque-2.4.16: mv: cannot stat `libtool': No such file or directory2013-02-14 14:39:41
457588ApplicationsxboxUNCONFIRMEDmedia-tv/xbmc-11.0 with a PaX kernel - xbmc.bin: LLVM ERROR: Allocation failed when allocating new m2013-02-15 15:39:36
457600ApplicationsprometheanfireUNCONFIRMEDsys-cluster/swift-1.7.6 has runtime dependency for xattr>=0.4, but I have pyxattr 0.5.02013-02-15 18:34:52
457632ApplicationsgrobianUNCONFIRMEDmail-client/mutt: Occasional segfault in set_buffystats at sidebar.c:3432013-02-15 15:46:57
457678Enhancement/Feature RequestssecurityUNCONFIRMEDAdd security information to the portage tree2013-02-15 16:57:18
457702ApplicationsmgornyUNCONFIRMEDeclean-kernel doesn't work w/ grub2 when /boot is FAT2013-02-20 20:51:05
457708Core systemhardened-kernelUNCONFIRMEDapp-emulation/virtualbox-4.{1.22,2.6}-r1 on sys-kernel/hardened-sources - Can't start virtual machin2013-02-16 21:53:53
457714DevelopmenthaskellUNCONFIRMED=dev-haskell/cabal-1.14.0 has invalid dependency specifications.2013-02-15 16:29:54
457780Keywording and StabilizationhaskellUNCONFIRMEDstabilization request dev-lang/ghc-7.4.22013-02-16 21:14:28
457784BugzillabugzillaUNCONFIRMED/data/cached/buglist-*.html missing last-modified timestamps2013-02-16 03:03:10
457888GamesgamesUNCONFIRMEDgames-simulation/bcs-demo: broken link in description2013-02-16 21:03:10
457904GamesgamesUNCONFIRMEDgames-strategy/freecraft: broken link in description of package2013-02-19 03:24:45
457910Developmentrobbat2UNCONFIRMEDqt-creator should RDEPEND on something providing ssh-askpass for git push2013-02-21 12:40:02
457920KDEkdeUNCONFIRMEDkde-base/kate-4.10.0-r1 improved ebuild2013-02-18 04:25:35
457930LibraryjkarlsonUNCONFIRMEDx11-drivers/ati-drivers-12.11_beta11 system lock on exiting X2013-02-17 17:04:26
457934Eclasses and ProfileskdeUNCONFIRMEDAdd app-arch/unzip natspec to KDE profiles package.use2013-02-17 17:00:46
457968Third-Party ToolsmpaganoUNCONFIRMEDapp-portage/portpeek overlooks some(?) package atom(s)2013-02-17 17:03:04
458018ServerswegenerUNCONFIRMEDnet-dns/pdns need more strict permissions for pdns.conf (security threat)2013-02-17 18:26:06
458020Core systemtoolchainUNCONFIRMED[toolchain overlay] sys-libs/glibc-2.6.1 does not compile with up to date gcc and binutils (via cros2013-02-18 04:43:58
458024Applicationsnet-fsUNCONFIRMEDnet-nds/rpcbind with sys-libs/uclibc - security.c:23:26: fatal error: rpcsvc/mount.h: No such file o2013-02-20 11:38:41
458034ApplicationsjsbronderUNCONFIRMEDnet-nntp/sabnzbd-0.7.11 initscript always reports crashed status2013-02-19 20:05:09
458068GNOMEgnomeUNCONFIRMEDx11-themes/gnome-themes-standard: narrow scrollbars might violate accessibility regulation2013-02-19 06:38:31
458104PrintingprintingUNCONFIRMEDapp-text/acroread-9.5.1-r1 - acroread creates $HOME/fontconfig directory on startup2013-02-18 13:45:46
458108Applicationsbug-wranglersUNCONFIRMEDvirtual/ssh-askpass package that manages the /usr/lib/ssh-askpass link2013-02-21 12:29:46
458116Core systemkernelUNCONFIRMEDkernel 3.7.5 - BUG related to skb when sysctl net.ipv4.tcp_mtu_probing!=02013-02-21 02:44:06
458152Ebuildsmaintainer-wantedUNCONFIRMEDdev-db/odb-2.2.0 - C++ Object-Relational Mapping (ORM) implemented as a gcc plugin2013-02-19 22:42:42
458156OpenRCopenrcUNCONFIRMEDsys-apps/openrc-0.11.8 creates /etc/runlevels/sysinit/udev with wrong target when ROOT is not /2013-02-19 09:30:05
458160Applicationsidella4UNCONFIRMEDapp-emulation/xen-4.2.0-r1 - x86_64-pc-linux-gnu-ld: unrecognized option '--subsystem=10'2013-02-21 12:48:18
458200Core systembug-wranglersUNCONFIRMEDkernel 3.6.11 - ath9k cannot connect to WPA2-PSK network2013-02-21 02:48:39
458218Ebuildsmaintainer-wantedUNCONFIRMEDapp-admin/amdoverdrivectrl-1.2.1 - control the frequency and fan settings of your AMD/ATI video card2013-02-19 20:28:02
458256ApplicationsprometheanfireUNCONFIRMEDmedia-sound/spotify-0.8.8.323-r1 spotify-dbus.py isn't python 3.2 compatible2013-02-19 14:22:25
458274ApplicationsnirbheekUNCONFIRMEDnet-misc/networkmanager-0.9.6.4 does not save settings for wired connection with 802.1x authenticati2013-02-21 08:24:51
458282Servermarko.durkovicUNCONFIRMEDnet-im/jabberd2-2.2.14 - dodoc: tools/migrate.pl does not exist2013-02-20 16:17:20
458300Libraryx11UNCONFIRMED>=media-libs/mesa-9.1_rc1[xa]: libxatracker.so has undefined symbol: _ZTVN10__cxxabiv120__si_class_t2013-02-21 13:47:33
458348Ebuildsmaintainer-wantedUNCONFIRMEDdev-db/libodb-pgsql - acess a PostgreSQL database using ODB (dependency of dev-db/odb)2013-02-19 22:09:23
458364Ebuildsmaintainer-wantedUNCONFIRMEDdev-db/libodb-mysql - access a MySQL or MariaDB database (dependency of dev-db/odb)2013-02-20 13:24:27
458370Ebuildsmaintainer-wantedUNCONFIRMEDdev-db/libodb-sqlite - access a SQLite database using ODB (dependency of dev-db/odb)2013-02-20 13:24:27
458380LibraryphosphanUNCONFIRMEDmedia-libs/jasper: ebuild patch for multilib support2013-02-20 21:19:41
458404LibrarycppUNCONFIRMEDdev-libs/boost-1.52.0-r5 - error: Duplicate name of actual target: libboost_system.so.1.2013-02-21 02:56:16
458478LibraryyngwinUNCONFIRMEDx11-libs/cairo-9999 failed because cairo-1.10.2-qt-surface.patch outdated2013-02-20 21:19:46
458494Keywording and StabilizationdotnetUNCONFIRMEDmedia-sound/banshee-2.6.0 stabilization request2013-02-20 21:52:39
458508EbuildspachoUNCONFIRMEDsys-power/bbswitch kernel 3.8 compatibility hack2013-02-20 22:50:36
458576Applicationsbug-wranglersUNCONFIRMEDapp-emulation/xen-tools should depend on dev-libs/yajl2013-02-21 12:22:28
458578Applicationsbug-wranglersUNCONFIRMEDapp-misc/geneweb-5.02: Fatal error: OCaml and preprocessor have incompatible versions2013-02-21 12:27:58
458598Applicationsbug-wranglersUNCONFIRMED[media-gfx/asymptote-2.21] emerge failed with USE="doc latex"2013-02-21 14:49:39


back



Support us on Content Nation

New Packages

- as rdf newsfeed
- as rss newsfeed
- as Atom newsfeed
2023-01-30
389-ds-base - 1.4.4.19-r4
Ebuild name:

net-nds/389-ds-base-1.4.4.19-r4

Description

389 Directory Server (core libraries and daemons)

Added to portage

2023-01-30

389-ds-base - 2.1.0-r4
Ebuild name:

net-nds/389-ds-base-2.1.0-r4

Description

389 Directory Server (core libraries and daemons)

Added to portage

2023-01-30

389-ds-base - 2.3.2
Ebuild name:

net-nds/389-ds-base-2.3.2

Description

389 Directory Server (core libraries and daemons)

Added to portage

2023-01-30

Nuitka - 1.4.1
Ebuild name:

dev-python/Nuitka-1.4.1

Description

Python to native compiler

Added to portage

2023-01-30

cantera - 2.6.0-r2
Ebuild name:

sci-libs/cantera-2.6.0-r2

Description

Object-oriented tool suite for chemical kinetics, thermodynamics, and tra

Added to portage

2023-01-30

containerd - 1.6.16
Ebuild name:

app-containers/containerd-1.6.16

Description

A daemon to control runC

Added to portage

2023-01-30

davfs2 - 1.7.0
Ebuild name:

net-fs/davfs2-1.7.0

Description

Linux FUSE (or coda) driver that allows you to mount a WebDAV resource

Added to portage

2023-01-30

diffuse - 0.7.7
Ebuild name:

dev-util/diffuse-0.7.7

Description

A graphical tool to compare and merge text files

Added to portage

2023-01-30

discount - 3.0.0a_p20230126
Ebuild name:

app-text/discount-3.0.0a_p20230126

Description

A Markdown-to HTML translator written in C

Added to portage

2023-01-30

filezilla - 3.63.1
Ebuild name:

net-ftp/filezilla-3.63.1

Description

FTP client with lots of useful features and an intuitive interface

Added to portage

2023-01-30

flask-babel - 3.0.1
Ebuild name:

dev-python/flask-babel-3.0.1

Description

i18n and l10n support for Flask based on Babel and pytz

Added to portage

2023-01-30

flask-migrate - 4.0.3
Ebuild name:

dev-python/flask-migrate-4.0.3

Description

SQLAlchemy database migrations for Flask applications using Alembic

Added to portage

2023-01-30

gcc - 13.0.1_pre20230129-r1
Ebuild name:

sys-devel/gcc-13.0.1_pre20230129-r1

Description

The GNU Compiler Collection

Added to portage

2023-01-30

geany-plugins - 1.38-r5
Ebuild name:

dev-util/geany-plugins-1.38-r5

Description

A collection of different plugins for Geany

Added to portage

2023-01-30

geiser-chez - 0.17
Ebuild name:

app-emacs/geiser-chez-0.17

Description

Chez Scheme's implementation of the Geiser protocols

Added to portage

2023-01-30

git-sources - 6.2_rc6
Ebuild name:

sys-kernel/git-sources-6.2_rc6

Description

The very latest -git version of the Linux kernel

Added to portage

2023-01-30

gpsbabel - 1.8.0-r1
Ebuild name:

sci-geosciences/gpsbabel-1.8.0-r1

Description

GPS waypoints, tracks and routes converter

Added to portage

2023-01-30

humanize - 4.5.0
Ebuild name:

dev-python/humanize-4.5.0

Description

Common humanization utilities

Added to portage

2023-01-30

kdepim-addons - 22.08.3-r1
Ebuild name:

kde-apps/kdepim-addons-22.08.3-r1

Description

Plugins for KDE Personal Information Management Suite

Added to portage

2023-01-30

krb5-auth-dialog - 43.0-r1
Ebuild name:

gnome-extra/krb5-auth-dialog-43.0-r1

Description

An application to acquire and list Kerberos tickets.

Added to portage

2023-01-30

libgusb - 0.4.4
Ebuild name:

dev-libs/libgusb-0.4.4

Description

GObject wrapper for libusb

Added to portage

2023-01-30

libtmux - 0.21.0
Ebuild name:

dev-python/libtmux-0.21.0

Description

Python API for tmux

Added to portage

2023-01-30

libwacom - 2.6.0
Ebuild name:

dev-libs/libwacom-2.6.0

Description

Library for identifying Wacom tablets and their model-specific features

Added to portage

2023-01-30

lmod - 8.6.14-r1
Ebuild name:

sys-cluster/lmod-8.6.14-r1

Description

Environment Module System based on Lua

Added to portage

2023-01-30

mapserver - 8.0.0
Ebuild name:

sci-geosciences/mapserver-8.0.0

Description

Development environment for building spatially enabled webapps

Added to portage

2023-01-30

mkdocs-material - 9.0.8
Ebuild name:

dev-python/mkdocs-material-9.0.8

Description

A Material Design theme for MkDocs

Added to portage

2023-01-30

moodle - 3.11.12
Ebuild name:

www-apps/moodle-3.11.12

Description

The Moodle Course Management System

Added to portage

2023-01-30

moodle - 4.0.6
Ebuild name:

www-apps/moodle-4.0.6

Description

The Moodle Course Management System

Added to portage

2023-01-30

nlohmann_json - 3.11.2-r1
Ebuild name:

dev-cpp/nlohmann_json-3.11.2-r1

Description

JSON for Modern C++

Added to portage

2023-01-30

pdfpc - 4.5.0-r2
Ebuild name:

app-misc/pdfpc-4.5.0-r2

Description

Presenter console with multi-monitor support for PDF files

Added to portage

2023-01-30

pdm-pep517 - 1.1.0
Ebuild name:

dev-python/pdm-pep517-1.1.0

Description

A PEP 517 backend for PDM that supports PEP 621 metadata

Added to portage

2023-01-30

phonenumbers - 8.13.5
Ebuild name:

dev-python/phonenumbers-8.13.5

Description

Python port of Google's libphonenumber

Added to portage

2023-01-30

pymdstat - 0.4.3
Ebuild name:

dev-python/pymdstat-0.4.3

Description

Python library to parse Linux /proc/mdstat

Added to portage

2023-01-30

pyproject-fmt - 0.6.0
Ebuild name:

dev-python/pyproject-fmt-0.6.0

Description

Format your pyproject.toml file

Added to portage

2023-01-30

pytest-localserver - 0.7.1
Ebuild name:

dev-python/pytest-localserver-0.7.1

Description

Pytest plugin to test server connections locally

Added to portage

2023-01-30

reazon - 0.4.1
Ebuild name:

app-emacs/reazon-0.4.1

Description

GNU Emacs implementation of miniKanren, logic programming language

Added to portage

2023-01-30

redcarpet - 3.6.0
Ebuild name:

dev-ruby/redcarpet-3.6.0

Description

A Ruby wrapper for Upskirt

Added to portage

2023-01-30

rpm-spec-mode - 0.16
Ebuild name:

app-emacs/rpm-spec-mode-0.16

Description

Emacs mode to ease editing of RPM spec files

Added to portage

2023-01-30

rt-sources - 4.19.271_p120
Ebuild name:

sys-kernel/rt-sources-4.19.271_p120

Description

Full Linux . kernel sources with the CONFIG_PREEMPT_RT patch

Added to portage

2023-01-30

salt - 3005.1-r1
Ebuild name:

app-admin/salt-3005.1-r1

Description

Salt is a remote execution and configuration manager

Added to portage

2023-01-30

slime - 2.28
Ebuild name:

app-emacs/slime-2.28

Description

SLIME, the Superior Lisp Interaction Mode (Extended)

Added to portage

2023-01-30

sml-mode - 6.11
Ebuild name:

app-emacs/sml-mode-6.11

Description

Emacs major mode for editing Standard ML

Added to portage

2023-01-30

stone-soup - 0.30.0_pre20230129
Ebuild name:

games-roguelike/stone-soup-0.30.0_pre20230129

Description

Role-playing roguelike game of exploration and treasu

Added to portage

2023-01-30

subsonic-bin - 6.1.6
Ebuild name:

media-sound/subsonic-bin-6.1.6

Description

Subsonic is a complete, personal media streaming solution

Added to portage

2023-01-30

systemd - 252.5
Ebuild name:

sys-apps/systemd-252.5

Description

System and service manager for Linux

Added to portage

2023-01-30

systemd-utils - 252.5
Ebuild name:

sys-apps/systemd-utils-252.5

Description

Utilities split out from systemd for OpenRC users

Added to portage

2023-01-30

tzinfo - 1.2.11
Ebuild name:

dev-ruby/tzinfo-1.2.11

Description

Daylight-savings aware timezone library

Added to portage

2023-01-30

tzinfo - 2.0.6
Ebuild name:

dev-ruby/tzinfo-2.0.6

Description

Daylight-savings aware timezone library

Added to portage

2023-01-30

umockdev - 0.17.16
Ebuild name:

dev-util/umockdev-0.17.16

Description

Mock hardware devices for creating unit tests

Added to portage

2023-01-30

xdoctest - 1.1.1
Ebuild name:

dev-python/xdoctest-1.1.1

Description

A rewrite of Python's builtin doctest module but without all the weirdnes

Added to portage

2023-01-30

2023-01-29
aesara - 2.8.10
Ebuild name:

dev-python/aesara-2.8.10

Description

Library for operating on mathematical expressions with multi-dimensional a

Added to portage

2023-01-29

agate-sql - 0.5.9
Ebuild name:

dev-python/agate-sql-0.5.9

Description

Adds SQL read/write support to agate

Added to portage

2023-01-29

akonadi-calendar - 22.08.3-r1
Ebuild name:

kde-apps/akonadi-calendar-22.08.3-r1

Description

Library for akonadi calendar integration

Added to portage

2023-01-29

akonadi-calendar - 22.12.1-r1
Ebuild name:

kde-apps/akonadi-calendar-22.12.1-r1

Description

Library for akonadi calendar integration

Added to portage

2023-01-29

audacity - 3.2.4
Ebuild name:

media-sound/audacity-3.2.4

Description

Free crossplatform audio editor

Added to portage

2023-01-29

base_bigstring - 0.15.0-r1
Ebuild name:

dev-ml/base_bigstring-0.15.0-r1

Description

String type based on Bigarray, for use in I/O and C-bindings

Added to portage

2023-01-29

base_quickcheck - 0.15.0-r1
Ebuild name:

dev-ml/base_quickcheck-0.15.0-r1

Description

Randomized testing framework, designed for compatibility with Base

Added to portage

2023-01-29

baselayout - 2.13-r1
Ebuild name:

sys-apps/baselayout-2.13-r1

Description

Filesystem baselayout and init scripts

Added to portage

2023-01-29

beforelight - 1.0.6
Ebuild name:

x11-apps/beforelight-1.0.6

Description

Sample implementation of screen saver

Added to portage

2023-01-29

bin_prot - 0.15.0-r2
Ebuild name:

dev-ml/bin_prot-0.15.0-r2

Description

Binary protocol generator

Added to portage

2023-01-29

c-ares - 1.19.0
Ebuild name:

net-dns/c-ares-1.19.0

Description

C library that resolves names asynchronously

Added to portage

2023-01-29

cfitsio - 4.2.0
Ebuild name:

sci-libs/cfitsio-4.2.0

Description

C and Fortran library for manipulating FITS files

Added to portage

2023-01-29

chart-studio - 1.1.0-r2
Ebuild name:

dev-python/chart-studio-1.1.0-r2

Description

Browser-based graphing library for Python

Added to portage

2023-01-29

core - 0.15.1-r1
Ebuild name:

dev-ml/core-0.15.1-r1

Description

Jane Street's alternative to the standard library

Added to portage

2023-01-29

core_unix - 0.15.2-r1
Ebuild name:

dev-ml/core_unix-0.15.2-r1

Description

Unix-specific portions of Core

Added to portage

2023-01-29

eix - 0.36.6
Ebuild name:

app-portage/eix-0.36.6

Description

Search and query ebuilds

Added to portage

2023-01-29

fontconfig - 2.14.2
Ebuild name:

media-libs/fontconfig-2.14.2

Description

A library for configuring and customizing font access

Added to portage

2023-01-29

gallery-dl - 1.24.5
Ebuild name:

net-misc/gallery-dl-1.24.5

Description

Download image galleries and collections from several image hosting site

Added to portage

2023-01-29

gcc - 12.2.1_p20230128
Ebuild name:

sys-devel/gcc-12.2.1_p20230128

Description

The GNU Compiler Collection

Added to portage

2023-01-29

gentoo-common - 0
Ebuild name:

dev-python/gentoo-common-0

Description

Common files shared by Python implementations in Gentoo

Added to portage

2023-01-29

geoclue - 2.7.0
Ebuild name:

app-misc/geoclue-2.7.0

Description

A location information D-Bus service

Added to portage

2023-01-29

hugo - 0.110.0
Ebuild name:

www-apps/hugo-0.110.0

Description

Fast static HTML and CSS website generator

Added to portage

2023-01-29

identify - 2.5.16
Ebuild name:

dev-python/identify-2.5.16

Description

File identification library for Python

Added to portage

2023-01-29

isort - 5.12.0
Ebuild name:

dev-python/isort-5.12.0

Description

A python utility/library to sort imports

Added to portage

2023-01-29

jst-config - 0.15.1-r1
Ebuild name:

dev-ml/jst-config-0.15.1-r1

Description

Compile-time configuration for Jane Street libraries

Added to portage

2023-01-29

kded - 5.102.0-r1
Ebuild name:

kde-frameworks/kded-5.102.0-r1

Description

Central daemon of KDE workspaces

Added to portage

2023-01-29

kguiaddons - 5.102.0-r1
Ebuild name:

kde-frameworks/kguiaddons-5.102.0-r1

Description

Framework providing assorted high-level user interface compone

Added to portage

2023-01-29

kirigami - 5.102.0-r1
Ebuild name:

kde-frameworks/kirigami-5.102.0-r1

Description

Lightweight user interface framework for mobile and convergent a

Added to portage

2023-01-29

kmail - 22.08.3-r2
Ebuild name:

kde-apps/kmail-22.08.3-r2

Description

Email client, supporting POP3 and IMAP mailboxes

Added to portage

2023-01-29

kmail - 22.12.1-r2
Ebuild name:

kde-apps/kmail-22.12.1-r2

Description

Email client, supporting POP3 and IMAP mailboxes

Added to portage

2023-01-29

kmailtransport - 22.08.3-r1
Ebuild name:

kde-apps/kmailtransport-22.08.3-r1

Description

Mail transport service

Added to portage

2023-01-29

libbsd - 0.11.7-r2
Ebuild name:

dev-libs/libbsd-0.11.7-r2

Description

Library to provide useful functions commonly found on BSD systems

Added to portage

2023-01-29

libkgapi - 22.08.3-r1
Ebuild name:

kde-apps/libkgapi-22.08.3-r1

Description

Library for accessing Google calendar and contact resources

Added to portage

2023-01-29

libzia - 4.40
Ebuild name:

dev-libs/libzia-4.40

Description

Platform abstraction code for tucnak package

Added to portage

2023-01-29

lvm2 - 2.03.18-r1
Ebuild name:

sys-fs/lvm2-2.03.18-r1

Description

User-land utilities for LVM2 (device-mapper) software

Added to portage

2023-01-29

mercurial - 6.3.2
Ebuild name:

dev-vcs/mercurial-6.3.2

Description

Scalable distributed SCM

Added to portage

2023-01-29

mpv - 0.35.1
Ebuild name:

media-video/mpv-0.35.1

Description

Media player for the command line

Added to portage

2023-01-29

musl - 1.2.3-r6
Ebuild name:

sys-libs/musl-1.2.3-r6

Description

Light, fast and simple C library focused on standards-conformance and safety

Added to portage

2023-01-29

nbval - 0.10.0
Ebuild name:

dev-python/nbval-0.10.0

Description

A pytest plugin to validate Jupyter notebooks

Added to portage

2023-01-29

nss_wrapper - 1.1.15
Ebuild name:

sys-libs/nss_wrapper-1.1.15

Description

Wrapper for the user, group and hosts NSS API

Added to portage

2023-01-29

ogre - 13.6.1
Ebuild name:

dev-games/ogre-13.6.1

Description

Object-oriented Graphics Rendering Engine

Added to portage

2023-01-29

plasma - 5.102.0-r2
Ebuild name:

kde-frameworks/plasma-5.102.0-r2

Description

Plasma framework

Added to portage

2023-01-29

plocate - 1.1.18
Ebuild name:

sys-apps/plocate-1.1.18

Description

Posting locate is a much faster locate

Added to portage

2023-01-29

plotly - 5.13.0
Ebuild name:

dev-python/plotly-5.13.0

Description

Browser-based graphing library for Python

Added to portage

2023-01-29

plotly-geo - 1.0.0-r2
Ebuild name:

dev-python/plotly-geo-1.0.0-r2

Description

Browser-based graphing library for Python

Added to portage

2023-01-29

ppx_assert - 0.15.0-r1
Ebuild name:

dev-ml/ppx_assert-0.15.0-r1

Description

Assert-like extension nodes that raise useful errors on failure

Added to portage

2023-01-29

ppx_expect - 0.15.1-r1
Ebuild name:

dev-ml/ppx_expect-0.15.1-r1

Description

Cram like framework for OCaml

Added to portage

2023-01-29

ppx_inline_test - 0.15.0-r2
Ebuild name:

dev-ml/ppx_inline_test-0.15.0-r2

Description

Syntax extension for writing in-line tests in ocaml code

Added to portage

2023-01-29

py-spy - 0.3.14
Ebuild name:

dev-util/py-spy-0.3.14

Description

Sampling profiler for Python programs

Added to portage

2023-01-29

pypy3 - 7.3.11-r1
Ebuild name:

dev-python/pypy3-7.3.11-r1

Description

A fast, compliant alternative implementation of the Python (3.9) languag

Added to portage

2023-01-29

python - 3.10.9-r1
Ebuild name:

dev-lang/python-3.10.9-r1

Description

An interpreted, interactive, object-oriented programming language

Added to portage

2023-01-29

python - 3.11.1-r1
Ebuild name:

dev-lang/python-3.11.1-r1

Description

An interpreted, interactive, object-oriented programming language

Added to portage

2023-01-29

python - 3.12.0_alpha4-r1
Ebuild name:

dev-lang/python-3.12.0_alpha4-r1

Description

An interpreted, interactive, object-oriented programming language

Added to portage

2023-01-29

python - 3.9.16-r1
Ebuild name:

dev-lang/python-3.9.16-r1

Description

An interpreted, interactive, object-oriented programming language

Added to portage

2023-01-29

python-slugify - 8.0.0
Ebuild name:

dev-python/python-slugify-8.0.0

Description

A Python Slugify application that handles Unicode

Added to portage

2023-01-29

resolv_wrapper - 1.1.8
Ebuild name:

net-dns/resolv_wrapper-1.1.8

Description

Wrapper for DNS name resolving or DNS faking

Added to portage

2023-01-29

samba - 4.15.12-r4
Ebuild name:

net-fs/samba-4.15.12-r4

Description

Samba Suite Version 4

Added to portage

2023-01-29

samba - 4.16.7-r4
Ebuild name:

net-fs/samba-4.16.7-r4

Description

Samba Suite Version 4

Added to portage

2023-01-29

seamonkey - 2.53.15
Ebuild name:

www-client/seamonkey-2.53.15

Description

Seamonkey Web Browser

Added to portage

2023-01-29

setuptools - 67.0.0
Ebuild name:

dev-python/setuptools-67.0.0

Description

Collection of extensions to Distutils

Added to portage

2023-01-29

sexp_pretty - 0.15.1-r1
Ebuild name:

dev-ml/sexp_pretty-0.15.1-r1

Description

S-expression pretty-printer

Added to portage

2023-01-29

socket_wrapper - 1.4.0
Ebuild name:

net-libs/socket_wrapper-1.4.0

Description

Library passing all socket communications through unix sockets

Added to portage

2023-01-29

swaylock - 1.7.2
Ebuild name:

gui-apps/swaylock-1.7.2

Description

Screen locker for Wayland

Added to portage

2023-01-29

tucnak - 4.40
Ebuild name:

media-radio/tucnak-4.40

Description

Amateur Radio VHF Contest Logbook

Added to portage

2023-01-29

uid_wrapper - 1.3.0
Ebuild name:

sys-libs/uid_wrapper-1.3.0

Description

Wrapper to fake privilege separation

Added to portage

2023-01-29

whatever - 0.7
Ebuild name:

dev-python/whatever-0.7

Description

Easy anonymous functions by partial application of operators

Added to portage

2023-01-29

whatthepatch - 1.0.4
Ebuild name:

dev-python/whatthepatch-1.0.4

Description

A patch parsing and application library.

Added to portage

2023-01-29

wsjtx - 2.6.1
Ebuild name:

media-radio/wsjtx-2.6.1

Description

Weak signal ham radio communication

Added to portage

2023-01-29

rdf newsfeed | rss newsfeed | Atom newsfeed
- Powered by LeopardCMS - Running on Gentoo -
Copyright 2004-2020 Sascha Nitsch Unternehmensberatung GmbH
Valid XHTML1.1 : Valid CSS : buttonmaker
- Level Triple-A Conformance to Web Content Accessibility Guidelines 1.0 -
- Copyright and legal notices -
Time to create this page: 34.5 ms