from small one page howto to huge articles all in one place

search text in:




Other .linuxhowtos.org sites: www.linuxhowtos.org
toolsntoys.linuxhowtos.org



Last additions:
How to make X listen on port 6000

How to make X listen on port 6000

words:

34

views:

89742

userrating:

average rating: 1.2 (52 votes) (1=very good 6=terrible)


May, 25th 2007:
April, 26th 2007:
Apr, 10th. 2007:
Druckversion . pdf icon
You are here: Portage


Details of sci-visualization/yt:

available versions:

releasesalphaamd64armhppaia64mipsppcppc64ppc macoss390shsparcx86USE-Flagsdependenciesebuild warnings
Legend:
+ stable
~ testing
- not available
some ebuild warning depend on specific use-flags or architectures, all ebuild-warnings are shown.

Known bugs:
bug IDcomponentassigned tostatusdescriptionlast change
313491ApplicationsgraphicsUNCONFIRMEDmedia-gfx/exact-image: Verify and potentially improve Python-related code2012-10-06 11:48:14
365899.tbz2 supportpms-bugsUNCONFIRMEDautomatic RDEPEND for binpkgs using python2011-05-11 17:58:24
366571DevelopmentpythonUNCONFIRMEDapp-admin/eselect-python: override python version from environment2011-07-29 06:41:23
367783ApplicationspythonUNCONFIRMEDInvalid homepage for dev-python/pyds-0.7.32011-10-24 07:57:11
371009DevelopmentpythonUNCONFIRMEDdev-lang/python-2.7.1-r1 fails to cross compile on mipsel-r3000-linux-uclibc2011-10-02 21:07:28
372933ApplicationspythonUNCONFIRMEDgnome-base/libglade binpkg fails after python upgrade2011-06-29 16:11:40
372949UnspecifiedpythonUNCONFIRMEDapp-admin/python-updater should depend on sys-apps/openrc2012-07-05 13:59:19
374901Applicationsarmin76UNCONFIRMED[embedded-cross overlay] dev-python/pyxml-0.8.4-r2: multiple Python ABIs in EAPI <=2 is deprecated a2011-11-05 18:47:19
375791Ebuildsmaintainer-wantedUNCONFIRMEDdev-python/svgwrite (New Package)2011-07-21 12:06:51
377925DevelopmentpythonUNCONFIRMEDdev-python/docutils-0.[78]: TypeError: can't use a bytes pattern on a string-like object2011-10-07 21:22:24
379001LibrarygnomeUNCONFIRMEDsys-libs/ldb-1.1.4 fails on portage-multilib because of waflib module's python support2013-01-01 18:40:16
379003LibrarypatrickUNCONFIRMEDsys-libs/tevent-0.9.12 fails on portage-multilib because of waflib module's python support2012-12-25 21:03:18
379201Core systemmultilibUNCONFIRMED[multilib overlay] /dev-libs/libxml2-2.7.7 USE=lib32 - /usr/include/python2.7/pyport.h:849:2: ??????2011-08-15 07:34:05
381487Ebuildsmaintainer-wantedUNCONFIRMEDdev-python/DerApproximator - A python module for numerical optimization2011-09-05 11:36:51
381759Ebuildssci-geosciencesUNCONFIRMEDsci-geosciences/grass-6.4.1 wxwidgets GUI does not start with Python32013-01-24 22:56:15
381809EbuildspythonUNCONFIRMEDgames-simulation/singularity-0.30c fails to run with Python32012-12-29 15:00:48
383699ApplicationslackUNCONFIRMEDx11-plugins/screenlets-0.1.2 some parts depend on gconf-python2011-09-20 04:04:24
384429ApplicationsjlecUNCONFIRMEDdev-python/pyglet should depend on media-libs/libtxc_dxtn2011-10-05 19:38:41
385131CorepythonUNCONFIRMEDapp-admin/python-updater-0.9: append --keep-going to emerge2012-03-17 11:41:48
385401ApplicationslxnayUNCONFIRMEDapp-admin/packagekit-base-0.6.18 compile error on using python3 as default2012-05-12 22:10:25
386163Core systempythonUNCONFIRMEDEmerging app-admin/eselect-python-20100321 fails with 2011-10-09 11:37:24
387109Ebuildsmaintainer-wantedUNCONFIRMEDNew Ebuild: dev-python/lazr-restfulclient2011-10-21 07:15:05
387111Ebuildsmaintainer-wantedUNCONFIRMEDNew Ebuild: dev-python/wadllib2011-10-21 07:14:36
387113Ebuildsmaintainer-wantedUNCONFIRMEDNew ebuild: dev-python/lazr-uri2011-10-21 07:13:52
387377Ebuildsmaintainer-wantedUNCONFIRMEDdev-python/configglue (new ebuild)2011-10-21 19:24:20
388549ApplicationsproaudioUNCONFIRMEDmedia-libs/lv2core-9999 - missing dependency on dev-python/rdflib2011-10-26 14:24:49
389017Ebuildsmaintainer-wantedUNCONFIRMEDdev-python/acutil - Tool for setting up authentication from network services ( Python2 library )2011-11-01 15:34:30
391185UnspecifiedpythonUNCONFIRMED=dev-python/utidylib-0.2-r1 - src_test(): Segmentation fault in trial2012-02-18 20:19:49
392463EbuildsroxUNCONFIRMEDrox-extra/roxcd: Deprecation Warning about of python_mod_cleanup()2012-09-09 01:16:09
392975Ebuildsmaintainer-wantedUNCONFIRMED[science overlay] sci-mathematics/pulp - a Python wrapper for linear programming solvers2011-12-04 05:05:24
394103Core systempythonUNCONFIRMEDdev-lang/python-2.7.2-r3 fix for exception: "handle out of range in select()"2011-12-10 21:27:35
395495ApplicationspythonUNCONFIRMEDdev-lang/python-3.2.2 failed (test phase)2011-12-22 08:56:37
395817ApplicationssoundUNCONFIRMEDmedia-libs/libsndfile-1.0.25: fails tests with python-32012-01-18 16:03:11
395929EbuildsroxUNCONFIRMEDrox-base/mime-editor-0.6: uses still python_mod_optimize()2011-12-24 20:01:06
396543Ebuildsmaintainer-wantedUNCONFIRMEDEbuild for Cherrytree - A hierarchical note taking application2013-01-30 17:37:55
396665ApplicationspythonUNCONFIRMEDapp-admin/python-updater-0.10 does not update from /usr/lib/python3.1 to /usr/lib/python3.22012-11-07 14:06:55
398955GNOMEgnomeUNCONFIRMEDgnome-base/libglade-2.6.4: please split the python dependency2013-01-01 23:07:29
398961Ebuildsnet-imUNCONFIRMEDnet-im/pidgin-2.10.1: please separate dbus-python dependency into a USE-flag2013-01-01 23:11:04
399139EbuildspythonUNCONFIRMEDapp-admin/eselect-python - Can't select python without man page2012-01-17 14:56:48
399417ServerpythonUNCONFIRMED2013-02-07 19:28:02
400843Prefix SupportprefixUNCONFIRMEDdev-python/pygtk-2.24.0-r2 fails to build on OS 10.7 with numerous errors2012-07-13 10:10:03
401009Unspecifiedmaintainer-wantedUNCONFIRMEDdev-python/pillow - a fork of (dev-python/)imaging2012-01-27 21:14:38
401651Core - DependenciespythonUNCONFIRMEDdev-lang/python 3.1.4-r3 and 2.7.2-r3 sys-libs/readline is conditional on ncurses?2012-02-01 06:29:39
402027EbuildspythonUNCONFIRMEDdev-python/django-1.3.1 with dev-python/psycopg-2.4.2 fails app/project tests2012-04-28 20:35:29
402047EbuildspythonUNCONFIRMEDdev-python/git-python-0.3.2_rc1 should RDEPEND on dev-python/gitdb2012-02-25 11:43:58
402659DevelopmentpythonUNCONFIRMEDdev-python/pydb-1.26-r1 - ImportError: No module named fns2012-04-24 16:19:54
403407ApplicationspythonUNCONFIRMEDdev-python/rst2pdf - Add SVG support (IUSE=svg)2012-02-15 16:25:10
403667Ebuildsmaintainer-wantedUNCONFIRMEDapp-vim/ropevim-0.3_rc0 - vim plugin for using rope python refactoring library2012-02-14 21:15:54
404063DevelopmentpythonUNCONFIRMEDVersion bump: =dev-python/kinterbasdb-3.3.02012-03-09 08:44:10
404427HardenedhardenedUNCONFIRMEDdev-python/cvxopt-1.1.4-r1 test suite triggers ssp2012-02-18 17:56:36
404505Prefix SupportprefixUNCONFIRMEDPython 2.7.2 uses C99 'round' symbol2012-02-21 07:41:46
405183ApplicationspythonUNCONFIRMEDdev-python/reportlab should not depend on media-fonts/ttf-bitstream-vera2012-02-22 18:19:40
405549LibrarysrinclanUNCONFIRMEDdev-python/pywebkitgtk-1.1.8 crashes at start when using Pax/Hardened2012-06-10 01:24:13
406855EbuildsjsbronderUNCONFIRMEDsys-cluster/ganglia: Install gmetad-python.2013-02-15 17:46:20
407201Ebuildsmaintainer-wantedUNCONFIRMEDdev-python/lcdproc - Python LCDd client library2012-03-07 23:18:46
407589Ebuildsmaintainer-wantedUNCONFIRMEDdev-python/factory_boy : A versatile test fixtures replacement2012-03-12 12:07:45
407681ApplicationspythonUNCONFIRMEDmedia-sound/quodlibet-2.3.92-r1 segfaults when dev-lang/python-2.7.2-r3 is compiled with the hardene2012-10-06 17:14:29
407813EbuildspythonUNCONFIRMEDPlease stabilize dev-python/fabric-1.2.22012-11-09 18:32:51
408013Ebuildsmaintainer-wantedUNCONFIRMEDdev-python/netzob - Network protocol modelization by reverse engineering2012-05-09 15:21:42
408147UnspecifiedpythonUNCONFIRMEDapp-admin/eselect-python with FEATURES="nomac nodoc" - eselect python does not set man page (...)2012-03-14 19:23:10
408215Ebuildsmaintainer-wantedUNCONFIRMEDdev-util/line_profiler-1.0_beta3: Profile individual lines (not only function calls) of python sourc2012-03-15 01:28:00
408217Ebuildsmaintainer-wantedUNCONFIRMEDdev-python/meliae-0.4.0: Profile python's memory footprint2012-03-15 01:15:55
408221Ebuildsmaintainer-wantedUNCONFIRMEDdev-python/SquareMap-1.0.1_beta3: Hierarchic data-visualisation control for wxPython2012-03-15 01:15:37
408225Ebuildsmaintainer-wantedUNCONFIRMEDdev-python/runsnakerun-2.0.2_alpha1: GUI to display python profile dumps from cProfile, python-profi2012-03-15 01:15:15
409867EbuildsjmbsvicettoUNCONFIRMEDnet-misc/vde-2.3.2 version bump including Python support2012-06-08 13:16:39
410333ApplicationssoundUNCONFIRMEDmedia-sound/milkytracker-0.90.85 - In member function ‘virtual bool DecompressorGZIP::decompress(con2013-01-30 18:31:25
410427Applicationsmedia-tvUNCONFIRMEDmedia-tv/freevo-1.9.0 needs dev-python/gdata for the youtube plugin2012-04-02 02:30:30
410981ToolsdolsenUNCONFIRMEDapp-portage/etc-proposals with dev-lang/python-2.7[-berkdb] - raise error, "db type could not be det2012-04-09 20:36:29
411271ApplicationshannoUNCONFIRMEDnet-im/python-otr-0.2.1.1 SRC_URI has changed2012-04-10 13:34:22
411275EbuildshannoUNCONFIRMEDnet-im/python-otr-1.0.0_beta6 version bump2012-10-27 11:06:09
412767Core systemclusterUNCONFIRMEDsys-block/lio-utils-9999 - python_pkg_setup() not called2012-06-18 20:39:15
413393UnspecifiedpythonUNCONFIRMEDdev-lang/python[tk] should depend on dev-tcltk/tix2012-04-25 00:28:33
413863DevelopmentpythonUNCONFIRMEDdev-lang/python-3.2.3 - improve cross compilation2012-12-17 14:57:26
414447LibraryproaudioUNCONFIRMEDmedia-libs/lv2core-3.0 (with python 3) - ./waf: SyntaxError: invalid syntax2012-12-08 20:52:16
415929Serverqmail-bugsUNCONFIRMEDnet-mail/queue-repair should depend on dev-lang/python:2.*2012-05-15 15:06:41
415989Librarymaintainer-wantedUNCONFIRMEDdev-python/prettytable-python-0.6 - Python interface to print pretty tabular data2012-12-12 10:10:18
416269Prefix SupportprefixUNCONFIRMEDdev-python/reportlab-2.5-r1 fails to build : libart.h : No such file or directory2012-05-23 15:49:39
417429ApplicationssoundUNCONFIRMEDmedia-sound/jack-3.1.1 - src_install(): SyntaxError: ('invalid syntax', ('/usr/lib64/python2.7/site-2013-01-27 12:28:16
418007DevelopmentmaksbotanUNCONFIRMEDdev-python/scrapy-0.14.4 fails in setup while parsing urlparse_monkeypatches.py2012-06-14 16:40:49
420271ApplicationspythonUNCONFIRMED=dev-python/twisted-11.0.0: fails test wrt twisted.test.test_udp.Server2012-06-11 10:59:36
421687Keywording and StabilizationpythonUNCONFIRMEDdev-python/pylint-0.25.1 - please stabilize2012-06-18 18:27:14
423151Ebuildslu_zeroUNCONFIRMEDapp-emulation/qemu-user-1.1.0 requires python2 >= 2.42012-06-27 21:02:40
423817DevelopmentflameeyesUNCONFIRMEDdev-util/dwarves-1.9: ostra-cg cannot find python module ostra: ImportError: No module named ostra2012-06-27 18:54:10
423953Ebuildsmaintainer-wantedUNCONFIRMED[science overlay] dev-python/pyhdf-0.8.3 ebuild2012-06-28 12:14:27
424357EbuildsnirbheekUNCONFIRMEDdev-python/pypy-1.9-r1: There is NOT at least 4 gibibytes RAM2012-12-16 10:05:41
424365EbuildsnirbheekUNCONFIRMEDdev-python/pypy-1.9-r1: AssertionError: must come from an argument to the function, got <-88;esp>2012-07-03 14:41:31
424812EbuildsgraphicsUNCONFIRMEDmedia-gfx/cairosvg should depend on dev-python/cssselect2012-07-06 04:28:24
425152ApplicationspythonUNCONFIRMEDdev-python/genshi-0.6: ebuild does not expose speedups c module2012-07-27 20:44:20
425332Ebuildsnet-dialupUNCONFIRMEDnet-dialup/capisuite-0.4.5 doesn't compile with python 3.* as active python interpreter2012-07-09 11:37:10
425758EbuildsroxUNCONFIRMEDrox-base/rox-lib - Deprecation Warning: Usage of python_mod_optimize() in packages not support......2012-07-18 09:48:32
425810EbuildscedkUNCONFIRMEDdev-python/suds fails to build when user only has python-32012-07-11 16:39:57
426194ApplicationspythonUNCONFIRMEDapp-admin/eselect-python: python wrapper breaks OpenELEC build2012-07-12 00:36:25
427162Ebuildsmaintainer-wantedUNCONFIRMEDdev-python/django-admin-tools-0.4.1 - a collection of tools for the django administration interface2012-12-12 12:25:24
427244DevelopmentpythonUNCONFIRMEDdev-python/networkx 1.7 - Syntax errors / warnings in Python modules for CPython 3.2: File "/usr/lib2013-01-22 11:57:15
427296Ebuildsmaintainer-wantedUNCONFIRMEDdev-python/django-tables2-0.11.0 - Table/data-grid framework for Django2012-12-12 11:30:43
427728Ebuildsmaintainer-wantedUNCONFIRMEDNew: dev-python/django-classy-tags-0.3.4.1 - Class based template tags for Django2012-12-12 11:41:28
427730Ebuildsmaintainer-wantedUNCONFIRMEDNew: dev-python/django-mptt-0.4.2 - Utilities for implementing a modified pre-order traversal tree i2012-12-12 11:46:23
427734Ebuildsmaintainer-wantedUNCONFIRMEDNew: dev-python/django-sekizai-0.4.2 - Django Template Blocks with extra functionality2012-12-12 11:51:41
427738Ebuildsmaintainer-wantedUNCONFIRMEDNew: dev-python/django-cms-2.3 - A Django application for managing hierarchical pages of content2012-12-12 12:04:20
427744Ebuildsmaintainer-wantedUNCONFIRMEDdev-python/django-dajaxice-0.2 - Easy to use AJAX library for django2012-12-12 12:09:22
427746Ebuildsmaintainer-wantedUNCONFIRMEDdev-python/django-dajax-0.8.4 - Easy to use library to create asynchronous presentation logic with d2012-12-12 12:17:56
427754Ebuildsmaintainer-wantedUNCONFIRMEDdev-python/django-tinymce-1.5.1_beta2 - TinyMCE integration for Django2012-12-12 12:32:51
427762Ebuildsmaintainer-wantedUNCONFIRMEDNew: dev-python/django-grappelli-2.4.0 - A grid-based alternative/extension to the Django administra2012-07-24 14:52:05
427764Ebuildsmaintainer-wantedUNCONFIRMEDNew: dev-python/django-filebrowser-3.5.0 - File management in the Django admin interface2012-12-13 06:57:02
427770Ebuildsmaintainer-wantedUNCONFIRMEDNew: dev-python/django-publisher-0.0.3 - Django external publishing app2012-12-13 07:01:05
427960EbuildspythonUNCONFIRMEDdev-python/tox-1.4 - pkg_resources.DistributionNotFound: py>=1.4.92012-07-25 01:38:14
428170EbuildspythonUNCONFIRMEDdev-python/ipython 0.10.2 should depend on dev-lang/python[threads]2012-07-26 17:48:33
428396EbuildspythonUNCONFIRMEDdev-python/m2crypto-0.21.1 - swig: ../sysdeps/unix/sysv/linux/getpagesize.c:32: __getpagesize: Asser2012-07-29 22:10:36
428462EbuildsaballierUNCONFIRMEDmedia-sound/a2jmidid should [R]DEPEND on dev-lang/python-2.72012-07-30 12:57:07
429372EbuildsnirbheekUNCONFIRMEDdev-python/pypy-1.9-r1 FEATURES=sandbox - Fatal error during initialization: out of memory2012-08-02 11:53:03
430996EbuildsradioUNCONFIRMEDnet-wireless/gnuradio-3.6.1-r1 does not byte-compile grc_gnuradio package2012-08-12 11:35:18
431058Eclasses and ProfilespythonUNCONFIRMEDdev-util/gdbus-codegen-2.32.4 - /usr/portage/eclass/python-distutils-ng.eclass: line 206: syntax err2012-08-12 16:45:06
431388ApplicationspythonUNCONFIRMEDdev-python/ipython-0.13 -AttributeError: 'StoreMagics' object has no attribute 'db'2012-08-14 15:08:54
431522ApplicationsgstreamerUNCONFIRMEDmedia-video/flumotion: fails to build with python3* as system interpreter2012-12-28 00:22:54
431608Keywording and StabilizationpythonUNCONFIRMEDStabilize dev-python/virtualenvwrapper2013-01-04 01:17:32
431788EbuildspythonUNCONFIRMEDdev-python/ipython-0.13 does not correctly calculate USE dependencies2012-08-18 22:14:28
432206ApplicationsbluenessUNCONFIRMEDnet-misc/arm with dev-lang/python:3.2 - SyntaxError: invalid syntax in print "TorCtl successfully in2013-01-15 13:00:59
432980Applicationscommon-lispUNCONFIRMEDdev-lisp/sbcl-1.0.55-r1 fails to compile with "The value 18446744073 is not of type (UNSIGNED-BYTE 32012-08-29 09:14:51
433003LibrarypythonUNCONFIRMEDdev-libs/libxml2 - File "/usr/lib/python2.7/xml/sax/__init__.py", line 93, in make_parser raise 2012-09-09 04:48:34
433175ApplicationspythonUNCONFIRMEDdev-lang/python-2.7.3-r2: Exception AttributeError: AttributeError("'_DummyThread' object has no att2012-09-03 18:23:18
433944KDEqtUNCONFIRMEDdev-python/PyQt4 does not install phonon-module2013-01-02 12:49:56
434716DevelopmentpythonUNCONFIRMEDdev-lang/python:2.7 - POSIX_SEMAPHORES_NOT_ENABLED 1 in /usr/include/python2.7/pyconfig.h2012-09-11 15:18:37
434722UnspecifiedhannoUNCONFIRMEDnet-mail/mailman-2.1.14 uses python_mod_cleanup() incorrectly2012-09-11 15:14:21
434734Applicationsphp-bugsUNCONFIRMEDapp-doc/php-docs-20101029-r1 doesn't install anything except symlink2013-01-14 14:39:05
435270LibraryproaudioUNCONFIRMEDmedia-libs/aubio-0.3.2-r1 - SyntaxError: ('invalid syntax', ('/usr/lib64/python2.7/site-packages/aub2012-09-17 11:44:31
435516Applicationsgnome-accessibilityUNCONFIRMEDapp-accessibility/accerciser-3.4.1 - /usr/lib/python2.7/site-packages/accerciser/plugin/base_plugin.2012-09-21 19:29:04
436218EbuildsclusterUNCONFIRMEDnet-misc/pssh with dev-lang/python-3.2 - pssh --help: ImportError: No module named version2013-01-04 06:31:50
436346LibrarypythonUNCONFIRMEDdev-python/llfuse-0.37.1 - .../work/llfuse-0.37.1/distribute-0.6.12-py3.2.egg/setuptools/command/eas2012-09-27 22:00:38
436814EbuildspythonUNCONFIRMEDsys-block/targetcli should depend on dev-python/urwid2012-11-10 12:32:07
437214Prefix SupportprefixUNCONFIRMEDdev-python/PyQt4-4.9.4-r1 fails to emerge2013-01-17 05:38:43
437738ApplicationspythonUNCONFIRMEDdev-python/pycurl-7.19.0-r1000 crashes python interpreter when calling reset too many times on a pyc2012-10-09 20:08:53
438560EbuildsgnomeUNCONFIRMEDmedia-sound/rhythmbox-2.98 version bump2013-01-12 11:04:35
438576DevelopmentpythonUNCONFIRMEDdev-python/pyenchant-1.6.5 doesn't build with Python3.32012-12-09 14:13:26
438578DevelopmentaidecoeUNCONFIRMEDdev-python/pyro-4.14 fails to build with Python3.32012-12-26 12:48:10
438986EbuildschutzpahUNCONFIRMEDapp-admin/salt-0.10.0 - error: file '.../work/impl_python3_2/salt-0.10.0/scripts/salt-master' does n2012-10-21 14:26:16
439640Ebuildsmaintainer-wantedUNCONFIRMEDdev-python/twilio-3.4.1: Python bindings for twilio2012-10-26 16:10:05
439656EbuildscardoeUNCONFIRMEDmedia-tv/mythtv mythbackend init script should drop need net2012-10-28 04:57:08
439662EbuildspythonUNCONFIRMED=dev-lang/python-2.7.3-r2 pydoc-2.7 init script should drop need net2012-10-26 16:14:27
440006ApplicationscardoeUNCONFIRMEDmedia-tv/mythtv-0.25 USE=-hls should depend on media-sound/lame2012-10-30 17:33:47
441652Ebuildsmaintainer-wantedUNCONFIRMEDdev-python/pybird-1.0.8 - class for talking to bird bgp daemon2012-11-04 18:50:37
442168ApplicationsproaudioUNCONFIRMEDmedia-sound/patchage - Build failure when python-3 is set as active version2012-12-23 21:12:37
442272LibrarypythonUNCONFIRMEDdev-python/pylint-0.26.0 merges with python 2.6 but not 2.72012-12-05 23:58:15
442614EbuildssoundUNCONFIRMEDmedia-sound/trommler-3.8 - Fails when python3 is set.2012-11-11 11:10:35
442992Prefix SupportprefixUNCONFIRMED2012-12-08 09:11:17
442996ApplicationscardoeUNCONFIRMEDmedia-tv/mythtv - logging to a file in /etc/conf.d/mythbackend fails because of hard-wired /etc/ini2012-12-30 16:58:46
443498LibrarydilfridgeUNCONFIRMEDmedia-libs/opencv - python/src2/cv2.cpp:1: /usr/include/python2.7/pyport.h:849:2: ??????: #error "LO2013-02-04 22:23:56
443510EbuildspythonUNCONFIRMEDdev-lang/python should install helper file for sys-devel/gdb2012-11-16 16:07:09
443556EbuildsvoyageurUNCONFIRMEDsys-devel/clang-3.1 - Updated ebuild with +python and +doc2012-11-17 09:03:06
443804EbuildssystemdUNCONFIRMEDsys-apps/systemd should install python-systemd bindings2012-11-19 09:42:48
443886UnspecifiedpythonUNCONFIRMEDdev-python/traits dev-python/chaco dev-python/pyface USE=doc - ACCESS DENIED mkdir: /root/.config/o2012-11-19 10:44:55
444946Ebuildsmaintainer-wantedUNCONFIRMEDdev-python/txscheduling-1.1 - A scheduling plugin for Twisted2013-02-17 16:25:45
445614Ebuildsmaintainer-wantedUNCONFIRMEDapp-editors/retext - New package. - Qt-based text-editor for Markdown written in Python2013-01-02 12:40:40
446016LibrarypythonUNCONFIRMEDdev-python/python-gnutls-1.2.4 does not support >=net-libs/gnutls-32012-12-05 01:13:29
446024Ebuildsmaintainer-wantedUNCONFIRMEDdev-python/python-sipsimple-0.31.1 - SDK for easy development of SIP multimedia end-points2012-12-16 23:53:59
446028Ebuildsmaintainer-wantedUNCONFIRMEDdev-python/python-backports-1.0.1 - Backported python features2012-12-06 08:27:46
446192Ebuildsmaintainer-wantedUNCONFIRMEDdev-python/python-eventlib-0.1.1 - Coroutine-based networking library2012-12-06 08:27:46
446194Ebuildsmaintainer-wantedUNCONFIRMEDdev-python/python-msrplib-0.15.0 - Client library for MSRP protocol and its relay extension (RFC 4972012-12-06 08:27:46
446198Ebuildsmaintainer-wantedUNCONFIRMEDdev-python/python-xcaplib-1.0.17 - Client for managing full or partial XML documents on XCAP servers2012-12-06 21:23:53
446275KDEkdeUNCONFIRMEDpython ABI deps support for system-config-printer-kde and printer-applet2012-12-11 14:07:52
447264UnspecifiedpythonUNCONFIRMEDdev-lang/python - QA Notice: USE Flag 'hardened' not in IUSE2012-12-15 15:50:35
447396ServerxmwUNCONFIRMEDapp-admin/bcfg2-1.2.3: missing RDEPEND on dev-python/nose2012-12-15 20:27:44
447466ApplicationsbazaarUNCONFIRMEDdev-vcs/bzr-gtk-0.103.0: USE="-nautilus" does not remove /usr/share/nautilus-python/extensions/nauti2012-12-27 23:41:30
447502LibrarysciUNCONFIRMEDdev-python/numpy-1.6.2 - FAIL: test_pareto (test_random.TestRandomDist)2013-01-05 08:15:18
447556Mac OSXprefixUNCONFIRMEDdev-python/virtualenv-1.8.4 emerge failed with error virtualenv-3.3 already exists2013-01-19 18:48:58
447714EbuildspythonUNCONFIRMEDdev-lang/python should have epatch_user2012-12-18 15:46:32
448110DevelopmentsciUNCONFIRMEDdev-python/rpy-2.2.6-r1 fails test testInterruptR - AssertionError: True is not false2013-01-23 17:03:53
448138Coredev-portageUNCONFIRMEDsys-apps/portage no longer works with dev-lang/python-2.52012-12-22 07:22:48
448208EbuildsvoyageurUNCONFIRMEDsys-devel/{llvm,clang} support for C++11 (both), doxygen docs and python (clang) USE flags2013-02-02 22:02:57
448566GNOMEgnomeUNCONFIRMEDmedia-sound/rhythmbox should RDEPEND on media-plugins/gst-plugins-gio2012-12-25 18:04:00
448818DevelopmentnirbheekUNCONFIRMEDdev-python/pypy USE=jit does no pax-marking2012-12-27 14:29:36
448892DevelopmentgnomeUNCONFIRMEDdev-python/evolution-python-2.32.0 : Only should be included directly2013-01-10 17:31:37
448896EbuildsgnomeUNCONFIRMEDdev-python/pygobject-3.4.2-r1 (and others): py-compile coming from 2012-12-28 19:03:04
448910Applicationsqmail-bugsUNCONFIRMEDmail-mta/netqmail-1.06 - Force python version to 2.x. - pkg_postinst - SyntaxError: invalid token "02012-12-28 13:08:59
449512Third-Party ToolsdolsenUNCONFIRMEDapp-portage/porthole with python3 - File "/usr/lib/portage/pym/portage/__init__.py", line 224, in __2013-02-10 22:16:25
449720Core systemferringbUNCONFIRMEDsys-apps/pkgcore-0.8.6: SyntaxError during compilation of Python modules for Python 3.22013-01-02 10:12:25
450022ServerdjcUNCONFIRMEDwww-apache/mod_wsgi lacks a way to specify which python version to use2013-01-05 17:09:38
450084Keywording and StabilizationpythonUNCONFIRMEDPlease stabilize =dev-python/virtualenv-clone-0.2.42013-01-05 17:04:31
450086Keywording and StabilizationpythonUNCONFIRMEDPlease stabilize =dev-python/stevedore-0.62013-01-05 17:04:57
450246LibrarygnomeUNCONFIRMEDdev-python/pygtk-2.24.0 - memory leak in _wrap_pango_cairo_create_layout2013-01-05 16:55:14
450340GNOMEgnomeUNCONFIRMEDgnome-extra/hamster-applet-2.32.1 possibly has wrong RESTRICT_PYTHON_ABIS2013-01-06 22:38:36
450384FreeBSDbsdUNCONFIRMEDdev-python/python-ldap for ~x86-fbsd2013-01-05 13:42:07
450392Librarynet-p2pUNCONFIRMEDnet-libs/gupnp-igd-0.2.2 fails to build with USE_PYTHON="... 2.7-pypy-1.9"2013-01-05 17:56:48
450526Applicationsmedia-videoUNCONFIRMEDmedia-video/tovid-0.34_p20120123 - Please rebuild dev-python/pypy:1.9 with the following USE flags e2013-01-07 11:52:42
450748GNOMEgnomeUNCONFIRMEDSegmentation fault with media-sound/rhythmbox-2.972013-01-07 21:31:17
450886DevelopmentsciUNCONFIRMEDdev-python/numpy-1.6.2 with dev-lang/icc - blas_*_info: libraries mkl,vml,guide not found in [libd2013-01-08 14:09:21
450910LibrarysciUNCONFIRMEDsci-libs/scipy-0.11.0 doesn't build if Python3.3 is present2013-01-14 17:24:03
450944Ebuildsmaintainer-wantedUNCONFIRMEDdev-python/flake8-9999 - code checking using pep8 and pyflakes2013-01-08 20:08:22
451246ApplicationslackUNCONFIRMEDnet-misc/pymazon should RDEPEND on qt4? ( dev-python/PyQt4[X] )2013-01-11 16:25:43
451990LibraryemacsUNCONFIRMEDapp-emacs/python-mode-6.1.0 should install autopair2013-01-15 12:34:04
451996ApplicationsdjcUNCONFIRMEDdev-vcs/hgsubversion-1.4: compilation failure with Python 2.52013-01-15 12:37:58
452178Core systemvapierUNCONFIRMEDapp-misc/pax-utils: w/python3: lddtree.py passes unicode buffers to pyelftools which expects byte bu2013-01-19 16:49:01
452546LibrarychutzpahUNCONFIRMEDdev-python/cov-core should not RDEPEND on dev-python/pytest2013-01-16 16:14:02
452622LibrarysciUNCONFIRMEDdev-python/pytables needs to be recompiled for the exact sci-libs/hdf5 version.2013-01-18 20:03:31
452656ApplicationslackUNCONFIRMEDx11-plugins/screenlets-0.1.2 does not work with python32013-01-18 10:16:15
452910Core systemsystemdUNCONFIRMEDsys-apps/systemd-196[python] needs dev-python/pygobject:3 - ImportError: No module named gi.reposito2013-01-20 17:07:04
453270LibraryalexxyUNCONFIRMEDdev-python/configshell: snapshot request2013-01-21 12:27:59
453272LibraryalexxyUNCONFIRMEDdev-python/rtslib snapshot request2013-01-21 12:28:47
453800Eclasses and ProfilespythonUNCONFIRMEDpython.eclass: dev-python/cython fails to install in environment that contains coreutils on Gentoo/F2013-01-29 23:58:29
453954DevelopmentpythonUNCONFIRMEDdev-python/psycopg - add python 3.3 support2013-01-26 15:33:56
454176DevelopmentpythonUNCONFIRMEDdev-lang/python - LONG_BIT error cross-building from 64-bit to 32-bit2013-01-26 18:17:25
454254Librarysci-mathematicsUNCONFIRMEDdev-python/cvxopt with dev-util/pkgconfig-0.28 - ?2013-02-11 19:55:23
454562ApplicationsroxUNCONFIRMEDrox-extra/archive - deprecation warning about python_mod_cleanup()2013-01-29 19:23:09
454956GNOMEgnomeUNCONFIRMEDgnome-base/orbit-2.14.19-r1 with sys-devel/automake-1.13.1 - test/everything/Makefile.am:81: error: 2013-02-01 06:41:21
455104DevelopmentpythonUNCONFIRMEDdev-python/nose-1.2.1_p2012 fails tests (fails to parse coverage output)2013-02-06 10:00:25
455162DevelopmentssuominenUNCONFIRMEDdev-util/catfish-0.4.0.2 needs dev-python/pygobject:3 in RDEPEND - Error: The required module gi.rep2013-02-04 02:33:15
455210DevelopmentpythonUNCONFIRMEDdev-lang/python-3.2.3 fails to build native Parser/pgen while crosscompiling2013-02-04 19:42:53
455226Prefix SupportprefixUNCONFIRMEDprefix has python3_2 enabled but no python:3.2 ebuilds2013-02-03 02:45:11
455276DevelopmentvapierUNCONFIRMEDdev-cpp/gmock-1.6.9 with python3 fails to execute test suite2013-02-05 11:28:28
455280ApplicationsmythtvUNCONFIRMEDmedia-tv/mythtv-0.25.2_p20120716: links upon pulseaudio even with USE=-pulseaudio2013-02-03 13:49:02
455282LibrarytitanofoldUNCONFIRMEDdev-libs/libpqxx-4.0.1 with python 3.x - TypeError: 'str' does not support the buffer interface2013-02-19 08:19:43
456310ApplicationswiredUNCONFIRMEDwww-client/uzbl - /usr/bin/uzbl-browser should specify python version in shebang2013-02-09 16:34:47
456846ApplicationscardoeUNCONFIRMEDapp-emulation/libvirt-1.0.2-r1 has broken python bindings2013-02-12 22:17:07
456898ApplicationscardoeUNCONFIRMEDmedia-tv/mythtv with sys-fs/udisks:2 fails to detect DVD drives2013-02-14 00:28:21
456918UnspecifiedfbisseyUNCONFIRMED[sage-on-gentoo overlay] dev-python/pexpect-2.4-r1 - slot conflict between sage-on-gentoo and gentoo2013-02-12 16:08:33
456994Ebuildsmaintainer-wantedUNCONFIRMEDdev-python/polib - a library to manipulate gettext catalogs file2013-02-13 10:22:11
457528Applicationsx11UNCONFIRMED[x11 overlay] x11-libs/xpyb-9999 with python3 - checking for python include dir... File ""2013-02-15 15:34:34
457574PrintingprintingUNCONFIRMEDnet-print/cups-1.6.1 - Brother USB Laser Printer no longer prints anything2013-02-15 15:36:09
457656ApplicationsnikoliUNCONFIRMEDmedia-sound/clementine (while scanning media) - segfault in TagLib::File::find(TagLib::ByteVector co2013-02-15 15:57:13
457676DevelopmentpythonUNCONFIRMEDdev-python/pymad-0.6 madmodule.so is segfaulting as soon as it is invoked2013-02-15 17:17:34
457798ApplicationsbillieUNCONFIRMEDapp-portage/pfl-2.3-r2: cron-script doesn't run since 'python2' is not supported.2013-02-20 18:57:15
458256ApplicationsprometheanfireUNCONFIRMEDmedia-sound/spotify-0.8.8.323-r1 spotify-dbus.py isn't python 3.2 compatible2013-02-19 14:22:25
458280GNOMEgnomeUNCONFIRMEDdev-python/pygtk-2.24.0-r3 installing postrm warning: Unable to establish symlink2013-02-21 03:06:11
458468ApplicationssoundUNCONFIRMEDmedia-sound/easytag-2.1.8-r1 with experimental gtk3 support2013-02-20 15:11:47


back



Support us on Content Nation

New Packages

- as rdf newsfeed
- as rss newsfeed
- as Atom newsfeed
2026-11-01
86Box - 6.0-r1
Ebuild name:

app-emulation/86Box-6.0-r1

Description

Emulator of x86-based machines based on PCem

Added to portage

2026-11-01

AusweisApp - 2.6.2
Ebuild name:

sys-auth/AusweisApp-2.6.2

Description

Official authentication app for German ID cards and residence permits

Added to portage

2026-11-01

bedrock-server - 1.26.61.1
Ebuild name:

games-server/bedrock-server-1.26.61.1

Description

The official bedrock (non-java) based server for the sandbox

Added to portage

2026-11-01

corsix-th - 0.70.0-r3
Ebuild name:

games-simulation/corsix-th-0.70.0-r3

Description

Open source clone of Theme Hospital

Added to portage

2026-11-01

corsix-th - 0.70.1-r1
Ebuild name:

games-simulation/corsix-th-0.70.1-r1

Description

Open source clone of Theme Hospital

Added to portage

2026-11-01

hl-todo - 3.9.3
Ebuild name:

app-emacs/hl-todo-3.9.3

Description

Highlight TODO and similar keywords in comments and strings

Added to portage

2026-11-01

hypopg - 1.4.4
Ebuild name:

dev-db/hypopg-1.4.4

Description

Hypothetical Indexes for PostgreSQL

Added to portage

2026-11-01

intel-metrics-discovery - 1.16.199
Ebuild name:

dev-libs/intel-metrics-discovery-1.16.199

Description

A user mode library that provides access to GPU performan

Added to portage

2026-11-01

intel-metrics-library - 1.0.248
Ebuild name:

dev-libs/intel-metrics-library-1.0.248

Description

User mode driver helper library that provides access to GPU

Added to portage

2026-11-01

intel-vc-intrinsics - 0.26.0
Ebuild name:

dev-libs/intel-vc-intrinsics-0.26.0

Description

A set of new intrinsics on top of core LLVM IR instructions

Added to portage

2026-11-01

level-zero - 1.35.0
Ebuild name:

dev-libs/level-zero-1.35.0

Description

oneAPI Level Zero headers, loader and validation layer

Added to portage

2026-11-01

libgsf - 1.14.59
Ebuild name:

gnome-extra/libgsf-1.14.59

Description

The GNOME Structured File Library

Added to portage

2026-11-01

libupnp - 22.1.10
Ebuild name:

net-libs/libupnp-22.1.10

Description

An Portable Open Source UPnP Development Kit

Added to portage

2026-11-01

metee - 6.2.6
Ebuild name:

dev-libs/metee-6.2.6

Description

Cross-platform access library for Intel CSME HECI interface

Added to portage

2026-11-01

milkytracker - 1.05.01-r1
Ebuild name:

media-sound/milkytracker-1.05.01-r1

Description

FastTracker 2 inspired music tracker

Added to portage

2026-11-01

mutter - 50.6
Ebuild name:

x11-wm/mutter-50.6

Description

GNOME compositing window manager based on Clutter

Added to portage

2026-11-01

mysqltuner - 2.9.3
Ebuild name:

dev-db/mysqltuner-2.9.3

Description

Makes recommendations for increased performance and stability for MySQL

Added to portage

2026-11-01

nautilus - 50.4
Ebuild name:

gnome-base/nautilus-50.4

Description

Default file manager for the GNOME desktop

Added to portage

2026-11-01

pytest-bdd - 9.0.1
Ebuild name:

dev-python/pytest-bdd-9.0.1

Description

BDD library for the pytest runner

Added to portage

2026-11-01

python-rtmidi - 1.5.8-r1
Ebuild name:

dev-python/python-rtmidi-1.5.8-r1

Description

Python bindings for media-libs/rtmidi implemented using Cython

Added to portage

2026-11-01

rtmidi - 6.0.0-r1
Ebuild name:

media-libs/rtmidi-6.0.0-r1

Description

A set of C++ classes that provide a common API for realtime MIDI input/o

Added to portage

2026-11-01

rtmidi - 6.1.0
Ebuild name:

media-libs/rtmidi-6.1.0

Description

A set of C++ classes that provide a common API for realtime MIDI input/outp

Added to portage

2026-11-01

spsdeclib - 5.21
Ebuild name:

dev-libs/spsdeclib-5.21

Description

Kryoflux SPS Decoder Library

Added to portage

2026-11-01

unifi - 10.6.109
Ebuild name:

net-wireless/unifi-10.6.109

Description

A Management Controller for Ubiquiti Networks UniFi APs

Added to portage

2026-11-01

unrar - 7.3.2
Ebuild name:

app-arch/unrar-7.3.2

Description

Uncompress rar files

Added to portage

2026-11-01

2026-10-31
MIME-tools - 5.522.0
Ebuild name:

dev-perl/MIME-tools-5.522.0

Description

A Perl module for parsing and creating MIME entities

Added to portage

2026-10-31

Text-CSV_XS - 1.650.0
Ebuild name:

dev-perl/Text-CSV_XS-1.650.0

Description

Comma-separated values manipulation routines

Added to portage

2026-10-31

aws-sam-translator - 1.116.0
Ebuild name:

dev-python/aws-sam-translator-1.116.0

Description

A library that transform SAM templates into AWS CloudFormatio

Added to portage

2026-10-31

aws-xray-sdk - 2.16.0
Ebuild name:

dev-python/aws-xray-sdk-2.16.0

Description

AWS X-Ray SDK for Python

Added to portage

2026-10-31

awscli - 2.39.3
Ebuild name:

app-admin/awscli-2.39.3

Description

Universal Command Line Environment for AWS

Added to portage

2026-10-31

boto3 - 1.43.123
Ebuild name:

dev-python/boto3-1.43.123

Description

The AWS SDK for Python

Added to portage

2026-10-31

botocore - 1.43.123
Ebuild name:

dev-python/botocore-1.43.123

Description

Low-level, data-driven core of boto 3

Added to portage

2026-10-31

c-blosc2 - 3.4.1
Ebuild name:

dev-libs/c-blosc2-3.4.1

Description

Blocking, shuffling and lossless compression library

Added to portage

2026-10-31

chrome-binary-plugins - 156.0.8078.79
Ebuild name:

www-plugins/chrome-binary-plugins-156.0.8078.79

Description

Binary plugins from Google Chrome for use in Chromi

Added to portage

2026-10-31

chrome-binary-plugins - 158.0.8127.2_beta
Ebuild name:

www-plugins/chrome-binary-plugins-158.0.8127.2_beta

Description

Binary plugins from Google Chrome for use in Ch

Added to portage

2026-10-31

chrome-binary-plugins - 159.0.8130.0_alpha
Ebuild name:

www-plugins/chrome-binary-plugins-159.0.8130.0_alpha

Description

Binary plugins from Google Chrome for use in C

Added to portage

2026-10-31

chromedriver-bin - 156.0.8078.79
Ebuild name:

www-apps/chromedriver-bin-156.0.8078.79

Description

WebDriver for Chrome

Added to portage

2026-10-31

conky - 1.26.0
Ebuild name:

app-admin/conky-1.26.0

Description

An advanced, highly configurable system monitor for X

Added to portage

2026-10-31

createrepo_c - 1.2.6
Ebuild name:

app-arch/createrepo_c-1.2.6

Description

C implementation of createrepo

Added to portage

2026-10-31

deprecated - 3.0.1
Ebuild name:

dev-python/deprecated-3.0.1

Description

Python @deprecated decorator to deprecate old API

Added to portage

2026-10-31

dist-kernel - 6.1.191
Ebuild name:

virtual/dist-kernel-6.1.191

Description

Virtual to depend on any Distribution Kernel

Added to portage

2026-10-31

dist-kernel - 6.12.115
Ebuild name:

virtual/dist-kernel-6.12.115

Description

Virtual to depend on any Distribution Kernel

Added to portage

2026-10-31

dist-kernel - 6.18.60
Ebuild name:

virtual/dist-kernel-6.18.60

Description

Virtual to depend on any Distribution Kernel

Added to portage

2026-10-31

dist-kernel - 6.6.161
Ebuild name:

virtual/dist-kernel-6.6.161

Description

Virtual to depend on any Distribution Kernel

Added to portage

2026-10-31

dist-kernel - 7.2.14
Ebuild name:

virtual/dist-kernel-7.2.14

Description

Virtual to depend on any Distribution Kernel

Added to portage

2026-10-31

dist-kernel - 7.3.1
Ebuild name:

virtual/dist-kernel-7.3.1

Description

Virtual to depend on any Distribution Kernel

Added to portage

2026-10-31

dominate - 3.1.0
Ebuild name:

dev-python/dominate-3.1.0

Description

Library for creating and manipulating HTML documents using an elegant DOM

Added to portage

2026-10-31

dwl - 0.8
Ebuild name:

gui-wm/dwl-0.8

Description

dwm for Wayland

Added to portage

2026-10-31

dwl - 0.9
Ebuild name:

gui-wm/dwl-0.9

Description

dwm for Wayland

Added to portage

2026-10-31

dzip - 3.2
Ebuild name:

games-util/dzip-3.2

Description

compressor/uncompressor for demo recordings from id's Quake

Added to portage

2026-10-31

efl - 1.29.0
Ebuild name:

dev-libs/efl-1.29.0

Description

Enlightenment Foundation Libraries all-in-one package

Added to portage

2026-10-31

enlightenment - 0.28.0
Ebuild name:

x11-wm/enlightenment-0.28.0

Description

Enlightenment window manager

Added to portage

2026-10-31

ffmpeg-chromium - 155.0.8059.85
Ebuild name:

media-video/ffmpeg-chromium-155.0.8059.85

Description

FFmpeg built specifically for codec support in Chromium-b

Added to portage

2026-10-31

ffmpeg-chromium - 156.0.8078.35
Ebuild name:

media-video/ffmpeg-chromium-156.0.8078.35

Description

FFmpeg built specifically for codec support in Chromium-b

Added to portage

2026-10-31

ffmpeg-chromium - 9999
Ebuild name:

media-video/ffmpeg-chromium-9999

Description

FFmpeg built specifically for codec support in Chromium-based brow

Added to portage

2026-10-31

filelock - 4.2.5
Ebuild name:

dev-python/filelock-4.2.5

Description

A platform independent file lock for Python

Added to portage

2026-10-31

gentoo-kernel - 6.1.191
Ebuild name:

sys-kernel/gentoo-kernel-6.1.191

Description

Linux kernel built with Gentoo patches

Added to portage

2026-10-31

gentoo-kernel - 6.12.115
Ebuild name:

sys-kernel/gentoo-kernel-6.12.115

Description

Linux kernel built with Gentoo patches

Added to portage

2026-10-31

gentoo-kernel - 6.18.60
Ebuild name:

sys-kernel/gentoo-kernel-6.18.60

Description

Linux kernel built with Gentoo patches

Added to portage

2026-10-31

gentoo-kernel - 6.6.161
Ebuild name:

sys-kernel/gentoo-kernel-6.6.161

Description

Linux kernel built with Gentoo patches

Added to portage

2026-10-31

gentoo-kernel - 7.2.14
Ebuild name:

sys-kernel/gentoo-kernel-7.2.14

Description

Linux kernel built with Gentoo patches

Added to portage

2026-10-31

gentoo-kernel - 7.3.1
Ebuild name:

sys-kernel/gentoo-kernel-7.3.1

Description

Linux kernel built with Gentoo patches

Added to portage

2026-10-31

gentoo-kernel-bin - 6.1.191
Ebuild name:

sys-kernel/gentoo-kernel-bin-6.1.191

Description

Pre-built Linux kernel with Gentoo patches

Added to portage

2026-10-31

gentoo-kernel-bin - 6.12.115
Ebuild name:

sys-kernel/gentoo-kernel-bin-6.12.115

Description

Pre-built Linux kernel with Gentoo patches

Added to portage

2026-10-31

gentoo-kernel-bin - 6.18.60
Ebuild name:

sys-kernel/gentoo-kernel-bin-6.18.60

Description

Pre-built Linux kernel with Gentoo patches

Added to portage

2026-10-31

gentoo-kernel-bin - 6.6.161
Ebuild name:

sys-kernel/gentoo-kernel-bin-6.6.161

Description

Pre-built Linux kernel with Gentoo patches

Added to portage

2026-10-31

gentoo-kernel-bin - 7.2.14
Ebuild name:

sys-kernel/gentoo-kernel-bin-7.2.14

Description

Pre-built Linux kernel with Gentoo patches

Added to portage

2026-10-31

gentoo-kernel-bin - 7.3.1
Ebuild name:

sys-kernel/gentoo-kernel-bin-7.3.1

Description

Pre-built Linux kernel with Gentoo patches

Added to portage

2026-10-31

gentoo-kernel-modprep - 6.1.191
Ebuild name:

sys-kernel/gentoo-kernel-modprep-6.1.191

Description

Minimal subset of gentoo-kernel-bin for building modules,

Added to portage

2026-10-31

gentoo-kernel-modprep - 6.12.115
Ebuild name:

sys-kernel/gentoo-kernel-modprep-6.12.115

Description

Minimal subset of gentoo-kernel-bin for building modules,

Added to portage

2026-10-31

gentoo-kernel-modprep - 6.18.60
Ebuild name:

sys-kernel/gentoo-kernel-modprep-6.18.60

Description

Minimal subset of gentoo-kernel-bin for building modules,

Added to portage

2026-10-31

gentoo-kernel-modprep - 6.6.161
Ebuild name:

sys-kernel/gentoo-kernel-modprep-6.6.161

Description

Minimal subset of gentoo-kernel-bin for building modules,

Added to portage

2026-10-31

gentoo-kernel-modprep - 7.2.14
Ebuild name:

sys-kernel/gentoo-kernel-modprep-7.2.14

Description

Minimal subset of gentoo-kernel-bin for building modules, f

Added to portage

2026-10-31

gentoo-kernel-modprep - 7.3.1
Ebuild name:

sys-kernel/gentoo-kernel-modprep-7.3.1

Description

Minimal subset of gentoo-kernel-bin for building modules, fo

Added to portage

2026-10-31

geos - 3.15.0
Ebuild name:

sci-libs/geos-3.15.0

Description

Geometry engine library for Geographic Information Systems

Added to portage

2026-10-31

gnome-shell - 50.6
Ebuild name:

gnome-base/gnome-shell-50.6

Description

Provides core UI functions for the GNOME desktop

Added to portage

2026-10-31

google-chrome - 156.0.8078.79
Ebuild name:

www-client/google-chrome-156.0.8078.79

Description

The web browser from Google

Added to portage

2026-10-31

google-chrome-beta - 158.0.8127.2
Ebuild name:

www-client/google-chrome-beta-158.0.8127.2

Description

The web browser from Google

Added to portage

2026-10-31

google-chrome-unstable - 159.0.8130.0
Ebuild name:

www-client/google-chrome-unstable-159.0.8130.0

Description

The web browser from Google

Added to portage

2026-10-31

grpcio - 1.85.1
Ebuild name:

dev-python/grpcio-1.85.1

Description

HTTP/2-based RPC framework

Added to portage

2026-10-31

grpcio-status - 1.85.1
Ebuild name:

dev-python/grpcio-status-1.85.1

Description

Reference package for GRPC Python status proto mapping

Added to portage

2026-10-31

hl-todo - 3.9.5
Ebuild name:

app-emacs/hl-todo-3.9.5

Description

Highlight TODO and similar keywords in comments and strings

Added to portage

2026-10-31

hl-todo - 3.9.5
Ebuild name:

app-emacs/hl-todo-3.9.5

Description

Highlight TODO and similar keywords in comments and strings

Added to portage

2026-10-31

howm - 1.5.0
Ebuild name:

app-emacs/howm-1.5.0

Description

Note-taking tool on Emacs

Added to portage

2026-10-31

hypothesis - 6.170.14
Ebuild name:

dev-python/hypothesis-6.170.14

Description

A library for property based testing

Added to portage

2026-10-31

incus - 7.0.2-r1
Ebuild name:

app-containers/incus-7.0.2-r1

Description

Modern, secure and powerful system container and virtual machine mana

Added to portage

2026-10-31

incus - 7.6
Ebuild name:

app-containers/incus-7.6

Description

Modern, secure and powerful system container and virtual machine manager

Added to portage

2026-10-31

iniparse - 0.5.2
Ebuild name:

dev-python/iniparse-0.5.2

Description

Better INI parser for Python

Added to portage

2026-10-31

intellij-idea - 2026.2.4
Ebuild name:

dev-util/intellij-idea-2026.2.4

Description

A complete toolset for web, mobile and enterprise development

Added to portage

2026-10-31

labwc - 0.20.3
Ebuild name:

gui-wm/labwc-0.20.3

Description

Openbox alternative for wayland

Added to portage

2026-10-31

labwc-menu-generator - 0.2.0
Ebuild name:

gui-apps/labwc-menu-generator-0.2.0

Description

Simple, lightweight, Labwc/Openbox XML-menu generator

Added to portage

2026-10-31

labwc-menu-generator - 9999
Ebuild name:

gui-apps/labwc-menu-generator-9999

Description

Simple, lightweight, Labwc/Openbox XML-menu generator

Added to portage

2026-10-31

libarchive - 3.8.11
Ebuild name:

app-arch/libarchive-3.8.11

Description

Multi-format archive and compression library

Added to portage

2026-10-31

libhx - 5.5
Ebuild name:

sys-libs/libhx-5.5

Description

Platform independent library providing basic system functions

Added to portage

2026-10-31

libzia - 4.75
Ebuild name:

dev-libs/libzia-4.75

Description

Platform abstraction code for tucnak package

Added to portage

2026-10-31

linode-cli - 5.70.0
Ebuild name:

app-admin/linode-cli-5.70.0

Description

Official command-line interface for interacting with the Linode API

Added to portage

2026-10-31

linode-metadata - 0.4.0-r1
Ebuild name:

dev-python/linode-metadata-0.4.0-r1

Description

Python bindings for the Linode Metadata Service

Added to portage

2026-10-31

loop-aes - 3.8j
Ebuild name:

sys-fs/loop-aes-3.8j

Description

Linux kernel module to encrypt disk partitions with AES cipher

Added to portage

2026-10-31

m17n-db - 1.8.16
Ebuild name:

dev-db/m17n-db-1.8.16

Description

Database for the m17n library

Added to portage

2026-10-31

mac - 13.45
Ebuild name:

media-sound/mac-13.45

Description

Monkey's Audio Codecs

Added to portage

2026-10-31

makemkv - 1.18.4
Ebuild name:

media-video/makemkv-1.18.4

Description

Tool for ripping and streaming Blu-ray, HD-DVD and DVD discs

Added to portage

2026-10-31

microsoft-edge - 156.0.4314.58
Ebuild name:

www-client/microsoft-edge-156.0.4314.58

Description

The web browser from Microsoft

Added to portage

2026-10-31

microsoft-edge-beta - 157.0.4341.16
Ebuild name:

www-client/microsoft-edge-beta-157.0.4341.16

Description

The web browser from Microsoft

Added to portage

2026-10-31

microsoft-edge-beta - 157.0.4341.24
Ebuild name:

www-client/microsoft-edge-beta-157.0.4341.24

Description

The web browser from Microsoft

Added to portage

2026-10-31

microsoft-edge-beta - 157.0.4341.30
Ebuild name:

www-client/microsoft-edge-beta-157.0.4341.30

Description

The web browser from Microsoft

Added to portage

2026-10-31

microsoft-edge-dev - 158.0.4357.0
Ebuild name:

www-client/microsoft-edge-dev-158.0.4357.0

Description

The web browser from Microsoft

Added to portage

2026-10-31

neon - 0.37.1
Ebuild name:

net-libs/neon-0.37.1

Description

HTTP and WebDAV client library

Added to portage

2026-10-31

nicotine+ - 3.3.11
Ebuild name:

net-p2p/nicotine+-3.3.11

Description

Graphical client for the Soulseek peer to peer network written in Python

Added to portage

2026-10-31

notebook - 7.6.4
Ebuild name:

dev-python/notebook-7.6.4

Description

Jupyter Interactive Notebook

Added to portage

2026-10-31

onlyoffice-bin - 10.0.0
Ebuild name:

app-office/onlyoffice-bin-10.0.0

Description

A free and open source office and productivity suite (binary versi

Added to portage

2026-10-31

opera - 139.0.6053.22
Ebuild name:

www-client/opera-139.0.6053.22

Description

A fast and secure web browser

Added to portage

2026-10-31

opera-developer - 140.0.6066.0
Ebuild name:

www-client/opera-developer-140.0.6066.0

Description

A fast and secure web browser

Added to portage

2026-10-31

opera-gx - 137.0.6036.65
Ebuild name:

www-client/opera-gx-137.0.6036.65

Description

Opera, but for 'gamers'

Added to portage

2026-10-31

opera-gx - 138.0.6044.45
Ebuild name:

www-client/opera-gx-138.0.6044.45

Description

Opera, but for 'gamers'

Added to portage

2026-10-31

opera-gx - 138.0.6044.65
Ebuild name:

www-client/opera-gx-138.0.6044.65

Description

Opera, but for 'gamers'

Added to portage

2026-10-31

pam_mount - 2.23
Ebuild name:

sys-auth/pam_mount-2.23

Description

A PAM module that can mount volumes for a user session

Added to portage

2026-10-31

patchelf - 0.19.3
Ebuild name:

dev-util/patchelf-0.19.3

Description

Small utility to modify the dynamic linker and RPATH of ELF executables

Added to portage

2026-10-31

pipewire - 1.6.11
Ebuild name:

media-video/pipewire-1.6.11

Description

Multimedia processing graphs

Added to portage

2026-10-31

postgis - 3.7.0
Ebuild name:

dev-db/postgis-3.7.0

Description

Geographic Objects for PostgreSQL

Added to portage

2026-10-31

ppp - 2.5.5
Ebuild name:

net-dialup/ppp-2.5.5

Description

Point-to-Point Protocol (PPP)

Added to portage

2026-10-31

pyamg - 5.4.1
Ebuild name:

dev-python/pyamg-5.4.1

Description

Algebraic multigrid solvers in Python

Added to portage

2026-10-31

python-discovery - 1.9.0
Ebuild name:

dev-python/python-discovery-1.9.0

Description

Python interpreter discovery

Added to portage

2026-10-31

radicale - 3.9.0
Ebuild name:

www-apps/radicale-3.9.0

Description

A simple CalDAV calendar server

Added to portage

2026-10-31

raspberrypi-utils - 0_p20261026
Ebuild name:

dev-embedded/raspberrypi-utils-0_p20261026

Description

Raspberry Pi userspace utilities

Added to portage

2026-10-31

rutorrent - 5.3.20
Ebuild name:

www-apps/rutorrent-5.3.20

Description

ruTorrent is a front-end for the popular Bittorrent client rTorrent

Added to portage

2026-10-31

sabctools - 9.7.3
Ebuild name:

dev-python/sabctools-9.7.3

Description

Module providing raw yEnc encoding/decoding for SABnzbd

Added to portage

2026-10-31

sqlglot - 30.27.0
Ebuild name:

dev-python/sqlglot-30.27.0

Description

An easily customizable SQL parser and transpiler

Added to portage

2026-10-31

sslscan - 2.2.3
Ebuild name:

net-analyzer/sslscan-2.2.3

Description

Fast SSL configuration scanner

Added to portage

2026-10-31

teamviewer - 15.83.3
Ebuild name:

net-misc/teamviewer-15.83.3

Description

All-In-One Solution for Remote Access and Support over the Internet

Added to portage

2026-10-31

tor - 0.4.9.15
Ebuild name:

net-vpn/tor-0.4.9.15

Description

Anonymizing overlay network for TCP

Added to portage

2026-10-31

torchvision - 0.29.1-r2
Ebuild name:

sci-ml/torchvision-0.29.1-r2

Description

Datasets, transforms and models to specific to computer vision

Added to portage

2026-10-31

tt-rss - 20261025
Ebuild name:

www-apps/tt-rss-20261025

Description

Tiny Tiny RSS - A web-based news feed (RSS/Atom) aggregator using AJAX

Added to portage

2026-10-31

tucnak - 4.75
Ebuild name:

media-radio/tucnak-4.75

Description

Amateur Radio VHF Contest Logbook

Added to portage

2026-10-31

types-docutils - 0.23.0.20261030
Ebuild name:

dev-python/types-docutils-0.23.0.20261030

Description

Typing stubs for docutils

Added to portage

2026-10-31

unicode-cldr - 49.0
Ebuild name:

app-i18n/unicode-cldr-49.0

Description

Unicode Common Locale Data Repository

Added to portage

2026-10-31

unicode-segmentation-rs - 1.0.1
Ebuild name:

dev-python/unicode-segmentation-rs-1.0.1

Description

Unicode segmentation and width for Python using Rust

Added to portage

2026-10-31

uriparser - 1.0.3
Ebuild name:

dev-libs/uriparser-1.0.3

Description

Strictly RFC 3986 compliant URI parsing library in C

Added to portage

2026-10-31

vanilla-kernel - 6.1.191
Ebuild name:

sys-kernel/vanilla-kernel-6.1.191

Description

Linux kernel built from vanilla upstream sources

Added to portage

2026-10-31

vanilla-kernel - 6.12.115
Ebuild name:

sys-kernel/vanilla-kernel-6.12.115

Description

Linux kernel built from vanilla upstream sources

Added to portage

2026-10-31

vanilla-kernel - 6.18.60
Ebuild name:

sys-kernel/vanilla-kernel-6.18.60

Description

Linux kernel built from vanilla upstream sources

Added to portage

2026-10-31

vanilla-kernel - 6.6.161
Ebuild name:

sys-kernel/vanilla-kernel-6.6.161

Description

Linux kernel built from vanilla upstream sources

Added to portage

2026-10-31

vanilla-kernel - 7.2.14
Ebuild name:

sys-kernel/vanilla-kernel-7.2.14

Description

Linux kernel built from vanilla upstream sources

Added to portage

2026-10-31

vanilla-kernel - 7.3.1
Ebuild name:

sys-kernel/vanilla-kernel-7.3.1

Description

Linux kernel built from vanilla upstream sources

Added to portage

2026-10-31

virtualenv - 21.15.2
Ebuild name:

dev-python/virtualenv-21.15.2

Description

Virtual Python Environment builder

Added to portage

2026-10-31

vivaldi - 8.2.4133.89
Ebuild name:

www-client/vivaldi-8.2.4133.89

Description

A browser for our friends

Added to portage

2026-10-31

vivaldi - 8.2.4133.91
Ebuild name:

www-client/vivaldi-8.2.4133.91

Description

A browser for our friends

Added to portage

2026-10-31

vivaldi-snapshot - 8.3.4190.36
Ebuild name:

www-client/vivaldi-snapshot-8.3.4190.36

Description

A browser for our friends

Added to portage

2026-10-31

vivaldi-snapshot - 8.3.4191.1
Ebuild name:

www-client/vivaldi-snapshot-8.3.4191.1

Description

A browser for our friends

Added to portage

2026-10-31

websockets - 17.4
Ebuild name:

dev-python/websockets-17.4

Description

Library for building WebSocket servers and clients in Python

Added to portage

2026-10-31

weston - 16.0.2
Ebuild name:

dev-libs/weston-16.0.2

Description

Wayland reference compositor

Added to portage

2026-10-31

wine-staging - 11.21
Ebuild name:

app-emulation/wine-staging-11.21

Description

Free implementation of Windows(tm) on Unix, with Wine-Staging patc

Added to portage

2026-10-31

wine-vanilla - 11.21
Ebuild name:

app-emulation/wine-vanilla-11.21

Description

Free implementation of Windows(tm) on Unix, without external patch

Added to portage

2026-10-31

wireplumber - 0.5.19
Ebuild name:

media-video/wireplumber-0.5.19

Description

Replacement for pipewire-media-session

Added to portage

2026-10-31

zchunk - 1.5.5
Ebuild name:

app-arch/zchunk-1.5.5

Description

File format designed for highly efficient deltas with good compression

Added to portage

2026-10-31

zeal - 0.9.2
Ebuild name:

app-text/zeal-0.9.2

Description

Offline documentation browser inspired by Dash

Added to portage

2026-10-31

rdf newsfeed | rss newsfeed | Atom newsfeed
Copyright 2004-2025 Sascha Nitsch Unternehmensberatung GmbH
- Copyright and legal notices -
Time to create this page: 29.8 ms