from small one page howto to huge articles all in one place
 

search text in:




Other .linuxhowtos.org sites: www.linuxhowtos.org
toolsntoys.linuxhowtos.org



Last additions:
How to make X listen on port 6000

How to make X listen on port 6000

words:

34

views:

62417

userrating:

average rating: 1.5 (4 votes) (1=very good 6=terrible)


May, 25th 2007:
April, 26th 2007:
Apr, 10th. 2007:
Druckversion . pdf icon
You are here: Portage


Details of perl-core/IO:

available versions:

releasesalphaamd64armhppaia64mipsppcppc64ppc macoss390shsparcx86USE-Flagsdependenciesebuild warnings
Legend:
+ stable
~ testing
- not available
some ebuild warning depend on specific use-flags or architectures, all ebuild-warnings are shown.

Known bugs:
bug IDcomponentassigned tostatusdescriptionlast change
400763Toolstools-portageUNCONFIRMEDglsa-check list only affected versions2012-01-25 15:50:55
417883ServerbluenessUNCONFIRMEDnet-firewall/ipsec-tools-0.8.0-r3: racoon segfaults on incoming connections if privsep is used2012-07-31 02:44:59
454266Keywording and Stabilizationrobbat2UNCONFIRMEDsys-apps/linux-misc-apps-3.6-r1 stabilization request2013-01-28 12:11:50
434900Ebuildspavel.stratil-junUNCONFIRMEDsys-apps/timer_entropyd-0.2 silently changed behavior2012-09-13 14:16:28
438304Applicationsmedia-videoUNCONFIRMEDmedia-video/gtk-recordmydesktop-0.3.8-r2 - QA Notice: .desktop file do not pass validation2012-11-21 18:48:47
436992GNOMEgnomeUNCONFIRMEDgnome-base/gvfs-1.12.3-r1 - /usr/share/applications/mount-archive.desktop: warning: key "Encoding" i2012-11-21 18:48:43
428588Applicationsc1pherUNCONFIRMEDnet-dns/djbdns: replace setup scripts with documentation2012-07-31 00:05:08
434910ApplicationsbluenessUNCONFIRMEDapp-admin/webapp-config - various bug fixes2012-09-13 15:38:10
451946ApplicationszerochaosUNCONFIRMEDdev-ruby/metasploit_data_models-0.4.0 version bump request2013-01-15 12:25:13
456818LibraryyngwinUNCONFIRMEDx11-libs/cairo-1.12.14: version bump2013-02-14 10:01:48
455076LibraryxmwUNCONFIRMEDmedia-gfx/zbar - In file included from from /usr/include/stdio.h:937:0, from zbar/debug.h:60, zbar/s2013-02-10 16:49:05
442826EbuildsxmwUNCONFIRMEDsys-power/suspend-1.0 - /usr/lib64/libfreetype.a(ftbzip2.o): In function `ft_bzip2_stream_close': (.2012-11-30 01:23:17
372285ApplicationsxmwUNCONFIRMEDapp-admin/makepasswd-1.10 does not support the option "--crypt-md5"2011-06-21 00:38:51
415345UnspecifiedxfceUNCONFIRMEDxfce-base/xfce4-session with 2 nvidia displays and 1 intel display does not initialize the backgroun2012-05-10 15:45:30
416919ApplicationsxfceUNCONFIRMEDxfce-base/xfce4-session causes X to crash on login with external monitor2012-05-23 13:59:46
421897ApplicationsxfceUNCONFIRMEDxfce-base/xfce4-panel-4.10.0 - adding system action icon to panel breaks auto-hide2012-07-06 05:45:28
440182ApplicationsxfceUNCONFIRMEDxfce-extra/xfce4-mixer-4.10.0 panel plugin doesn't play nice with pulseaudio2012-10-30 07:12:10
457588ApplicationsxboxUNCONFIRMEDmedia-tv/xbmc-11.0 with a PaX kernel - xbmc.bin: LLVM ERROR: Allocation failed when allocating new m2013-02-15 15:39:36
409015DevelopmentxarthisiusUNCONFIRMEDdev-util/intel-ocl-sdk: libOpenCL.so uses incompatible SONAME without SOVERSION2012-10-02 16:31:38
458130Libraryx11UNCONFIRMEDmedia-libs/mesa-9.0.1 files contain writable and executable sections2013-02-18 22:24:29
455468Unspecifiedx11UNCONFIRMED>x11-base/xorg-server-1.12.1 non-functional on PPC2013-02-04 21:33:52
456220Applicationsx11UNCONFIRMEDx11-base/xorg-server on hardened - X exits fatally upon failure to enable sys_iopl2013-02-12 14:40:15
450664Applicationsx11UNCONFIRMEDapp-emulation/wine-1.4.1 with >=x11-base/xorg-server-1.11 - mouse behaves erratically2013-01-08 04:22:22
446034Applicationsx11UNCONFIRMEDx11-drivers/xf86-video-intel-2.20.14 causes high cpu time consumption with X server2012-12-05 14:30:46
445902Libraryx11UNCONFIRMEDapp-emulation/emul-linux-x86-opengl-20121202{,-r1} makes some wine programs very sluggish2013-01-11 11:54:06
445590Libraryx11UNCONFIRMEDmedia-libs/mesa-9.0[g3dvl,vdpau]: Segmentation fault at surface.c:366 with media-video/mplayer2012-12-08 16:33:09
445712Libraryx11UNCONFIRMEDapp-emulation/emul-linux-x86-opengl-20121202 does not install /us/lib32/libGLU.so.12013-01-23 19:53:52
445158Libraryx11UNCONFIRMEDx11-drivers/ati-drivers-12.11_beta with x11-base/xorg-server-1.13.0-r1 - segmentation fault in X2012-12-31 15:41:10
443534Applicationsx11UNCONFIRMEDx11-apps/xconsole-1.0.4 eats 100% CPU if -file option is used2012-11-16 18:57:33
439840Applicationsx11UNCONFIRMEDx11-drivers/xf86-video-savage - EXA acceleration problems2012-11-04 09:55:04
435336Applicationsx11UNCONFIRMED>x11-base/xorg-server-1.9.5 - panning across virtual resolution does not work2012-12-06 21:04:54
430070Applicationsx11UNCONFIRMEDx11-base/xorg-server-1.12.99.903 - using space in media-gfx/gimp-2.8.0-r1 causes segmentation fault 2012-08-08 18:40:49
427632Applicationsx11UNCONFIRMEDx11-drivers/xf86-input-evdev-2.7.0 breaks y-direction emulateWheel for Kensington Expert Mouse2012-07-25 22:35:22
419985Ebuildsx11UNCONFIRMEDx11-drivers/xf86-video-intel - Add plymouth integration2012-09-11 07:58:49
413981Core systemx11UNCONFIRMEDsys-kernel/gentoo-sources-3.2.12: i915 driver sets strange resolution 1922x1080 on HDMI2012-05-01 05:35:57
401779Developmentx11UNCONFIRMEDx11-base/xorg-server-1.11.4 - XIO: fatal IO error 11 (Resource temporarily unavailable) on X server2012-02-01 17:35:48
392767Ebuildsx11UNCONFIRMEDmedia-libs/mesa: Bad string substitution in mesa-7.11.2.ebuild (when doing a prefix build with 'dri'2011-12-04 13:02:37
390639Applicationsx11UNCONFIRMEDx11-drivers/xf86-video-ati - DRM/Radeon: black screen in DE sessions2012-03-29 18:39:50
386707Gamesx11UNCONFIRMEDx11-libs/libdrm-2.4.26: assertion fails at intel_bufmgr_gem.c:13612011-10-18 05:30:06
379827Ebuildsx11UNCONFIRMEDx11-base/xorg-server Patch for Hotkey Release Layout Switching (unofficial solution to bug on freed2012-06-06 06:40:18
371841Libraryx11UNCONFIRMEDx11-libs/libdrm-2.4.25 assertion failure triggered by sci-astronomy/stellarium-0.10.62011-06-17 09:33:02
365665Ebuildsx11UNCONFIRMEDx11-base/xorg-server-1.9.5 CONFIGURE_OPTIONS are deprecated, use XORG_CONFIGURE_OPTIONS instead2011-11-19 01:13:08
400927Core systemwschlichUNCONFIRMEDsys-block/megarc-1.11-r1 needs fetch restriction2012-04-15 19:43:17
436900EbuildswschlichUNCONFIRMEDnet-misc/connect-1.103(?) version bump and HOMEPAGE change2012-10-02 13:46:58
452864ApplicationswschlichUNCONFIRMEDsys-power/sispmctl-3.1 - Version bump2013-01-18 22:41:39
455956ApplicationswxwidgetsUNCONFIRMEDapp-editors/wxhexeditor-0.21 version bump2013-02-07 11:28:22
456826DevelopmentwxwidgetsUNCONFIRMEDdev-util/codeblocks-12.11 - Version bump.2013-02-11 19:12:11
456310ApplicationswiredUNCONFIRMEDwww-client/uzbl - /usr/bin/uzbl-browser should specify python version in shebang2013-02-09 16:34:47
453208ApplicationswiredUNCONFIRMEDwww-client/uzbl-9999 - src/uzbl-core.h:16:25: fatal error: glib/gstdio.h: No such file or directory2013-01-21 19:18:42
453802Keywording and StabilizationwineUNCONFIRMEDapp-emulation/winetricks stable request2013-01-24 15:05:15
407245EbuildswineUNCONFIRMEDapp-emulation/crossover-office-pro-bin-11.0.0 version bump2012-11-17 19:10:14
400897EbuildswineUNCONFIRMEDapp-emulation/crossover-office-pro-bin-10.2.0 version bump2012-02-27 22:15:26
383395UnspecifiedwineUNCONFIRMEDapp-emulation/wine-1.3.28 can't find gecko2012-08-18 09:34:28
388425ApplicationswineUNCONFIRMEDapp-emulation/wine-1.3.30 sound not working, several apps stopped working.2012-03-22 12:19:51
448062ApplicationswilliamhUNCONFIRMEDapp-accessibility/speech-dispatcher-0.7.1-r1 src_compile(): mv: cannot stat '.deps/spd_audio.Tpo': N2013-01-01 12:02:28
449032Serverweb-appsUNCONFIRMEDwww-apps/ampache-3.5.* needs additional dependency < dev-lang/php-5.42012-12-28 21:06:13
444368Applicationsweb-appsUNCONFIRMEDwww-apps/lxr fails with current dev-db/mysql. Bump version to 1.0.0?2012-11-23 16:04:59
438086Applicationsweb-appsUNCONFIRMEDwww-apps/gallery-2.3.1 - "Begin Installation" fails with "The requested URL /gallery/install/
<
2012-10-12 16:43:46
396289Ebuildsweb-appsUNCONFIRMEDapp-text/htp-1.17: version bump2011-12-29 16:27:39
439516Core systemvserver-devsUNCONFIRMEDsys-kernel/openvz-sources-2.6.32.53.5 - In function 'setup_boot_APIC_clock': arch/x86/kernel/apic/ap2013-02-18 02:39:23
439822Applicationsvserver-devsUNCONFIRMEDapp-backup/vzdump use "--rsyncable" gzip option2013-01-20 19:35:42
450772DevelopmentvoyageurUNCONFIRMEDsys-devel/llvm-9999 - subversion: can't fetch to /var/portage/distfiles/svn-src/llvm/trunk from http2013-01-09 19:43:43
455262DevelopmentvoyageurUNCONFIRMEDsys-devel/clang-3.2 WX sections2013-02-05 00:51:32
441778DevelopmentvoyageurUNCONFIRMEDsys-devel/clang-3.1 ICE's when a type with multiple copy-ctors is in a union2012-11-04 23:13:59
427830Core systemvoyageurUNCONFIRMEDsys-devel/clang-3.1-r4 - clang: error: unable to execute command: Illegal instruction (in .../work/l2012-07-25 14:59:26
437938EbuildsvostorgaUNCONFIRMEDnet-nds/phpldapadmin-1.2.3 version bump2012-10-11 13:24:27
455348EbuildsvostorgaUNCONFIRMEDnet-news/liferea 1.10 rc1 version bump2013-02-05 11:25:38
448930EbuildsvoipUNCONFIRMEDmedia-libs/mediastreamer needs a local description of bindist USE-flag2013-02-16 14:09:18
448934EbuildsvoipUNCONFIRMEDmedia-plugins/mediastreamer-silk needs a local description of bindist USE-flag2012-12-27 20:27:17
396679ApplicationsvoipUNCONFIRMEDnet-misc/sipsak segmentation fault2012-01-04 21:08:51
388983EbuildsvmwareUNCONFIRMEDapp-emulation/vmware-modules-238.5 with sys-kernel/hardened-sources-3.0.4-r4 - work/vmci-only/linux/2013-01-18 22:06:24
392379ApplicationsvmwareUNCONFIRMEDapp-emulation/vmware-modules-238.5: vmmon-only/linux/hostif.c:2749:4: error: implicit declaration of2012-03-26 11:36:37
381201ApplicationsvmwareUNCONFIRMEDapp-emulation/vmware-player and app-emulation/vmware-workstation: verify if we can drop libsexy depe2011-08-31 12:14:50
373333EbuildsvmwareUNCONFIRMEDapp-emulation/vmware-ovftool-2.0.1.260188: version bump2011-07-03 16:45:55
412695ApplicationsvirtualizationUNCONFIRMED[virtualization overlay] app-emulation/xen-tools-9999 fails to unpack2012-04-21 17:28:46
444602ApplicationsvirtualizationUNCONFIRMEDapp-emulation/virtinst-0.600.3 - Exception in thread Checking storage allocation2013-02-16 18:03:56
448472ApplicationsvimUNCONFIRMEDapp-editors/gvim - segmentation fault when using clang_complete2012-12-25 15:39:05
455914ApplicationsvimUNCONFIRMEDapp-editors/{g,}vim-7.3.806 version bump2013-02-07 03:13:05
441864ApplicationsvimUNCONFIRMEDapp-editors/vim-7.3.646 vim: stack smashing attack in function - terminated2012-11-05 13:04:29
417921ApplicationsvimUNCONFIRMEDapp-editors/vim - bash completion fails with paths containing spaces2012-05-28 11:50:58
394353ApplicationsvimUNCONFIRMEDapp-vim/gtk-syntax-20110214-r1 mishighlights the "if" keyword as a function.2012-07-14 07:02:40
393419Eclasses and ProfilesvimUNCONFIRMEDapp-vim/gtk-syntax-20110214-r1 file collision2011-12-12 14:21:29
446614ApplicationsvadimkUNCONFIRMEDapp-emulation/vmware-workstation-9.0.1.894247 - vmui| I120: SymBacktrace[0] 00007fff80c53fc0 rip=0002013-02-13 10:37:51
374259Core systemvimUNCONFIRMEDapp-editors/vim: confirm function in .vimrc causes cpu 100% & process lockup2011-08-12 18:52:09
439280LibraryvadimkUNCONFIRMEDapp-emulation/vmware-modules-264.4 - missing return carriage in printk in VNetUserIfSetUplinkState()2012-10-23 10:12:15
413793ApplicationsvadimkUNCONFIRMEDapp-emulation/vmware-workstation-8.0.2.591240 should tell users to be in vmware group2012-05-01 22:10:58
411901EbuildsvadimkUNCONFIRMEDapp-emulation/vmware-workstation-8* - Add system.d service2012-09-09 03:55:17
396431ApplicationsvadimkUNCONFIRMEDapp-emulation/vmware-workstation-8.0.1.528992-r2 - segfault in libnvidia-glcore.so2011-12-29 18:43:30
368955ApplicationsvadimkUNCONFIRMEDapp-emulation/open-vm-tools default scripts break network connectivity on pause/resume2011-12-03 05:48:53
367799ApplicationsvadimkUNCONFIRMEDapp-emulation/vmware-player doesn't install thnuclnt (thinprint), so virtual printers do not work (b2011-05-18 00:14:08
456048ServerultrabugUNCONFIRMEDwww-servers/uwsgi-1.4.5 init script race condition if starting multiple uwsgi instances with differe2013-02-07 16:47:54
445534GamestuponeUNCONFIRMEDmedia-libs/varconf-1.0.0: version bump request2012-12-02 01:59:02
393605ApplicationstuponeUNCONFIRMED[BUMP] app-misc/geneweb-6.05 version bump2013-02-19 18:52:27
416265EbuildstuponeUNCONFIRMEDVersion bump: media-libs/glm-0.9.3.32012-05-16 12:48:08
398089ApplicationstristanUNCONFIRMEDx11-misc/revelation-0.4.11-r2 USE=applet - configure:13842: error: failed to find module gnomeapplet2012-01-10 00:03:01
404035ApplicationstoveUNCONFIRMEDapp-shells/zsh - add GREP_OPTIONS to profile2012-02-16 05:55:31
453774Third-Party Toolstools-portageUNCONFIRMEDapp-portage/genlop-9999: -u option does not filter2013-01-24 08:29:43
453674Third-Party Toolstools-portageUNCONFIRMEDapp-portage/ufed: Shortening/cleaning flag descriptions by eliminating "[Enables/Adds/Includes] Supp2013-01-23 13:44:40
423313Toolstools-portageUNCONFIRMEDrevdep-rebuild does not fix /usr/lib/libstartup-notification-1.so.0 // www-client/firefox-10.0.5 - l2012-08-03 11:54:41
447538Toolstools-portageUNCONFIRMED=app-portage/gentoolkit-0.3.0.7: equery doesn't report package description2012-12-17 01:10:30
447436Applicationstools-portageUNCONFIRMED=app-portage/genlop-0.30.8-r2 - Use of uninitialized value in concatenation (.) or string at /usr/b2012-12-17 07:12:11
434496Toolstools-portageUNCONFIRMEDapp-portage/gentoolkit-0.3.0.6-r3 - equery crashes on unhandled exception portage.exception.InvalidD2012-09-10 06:45:50
421287Toolstools-portageUNCONFIRMEDgentoolkit 0.3.0.6 euse -i option causes a lot of no such file or directory with app-admin/eselect-12012-06-20 16:02:59
401475Core - Ebuild Supporttools-portageUNCONFIRMEDgentoolkit.query throws exceptions on close sys.stdin2012-01-30 13:28:31
378053Toolstools-portageUNCONFIRMEDgentoolkit: revdep-rebuild optimization2013-01-30 05:52:33
436636JavatoolchainUNCONFIRMEDsys-devel/gcc-{4.5,4.6,4.7?}: gcj fails to compile java source code on ia64 (hardened) - Exception i2012-12-14 08:15:05
367203Toolstools-portageUNCONFIRMEDapp-portage/gentoolkit equery d --name-only (as with option b) would be useful2011-05-20 16:39:30
365371Enhancement/Feature Requeststools-portageUNCONFIRMEDapp-portage/gentoolkit: equery - add EQUERY_DEFAULTS_OPTIONS for default global options2012-12-25 01:54:54
457684DevelopmenttoolchainUNCONFIRMEDdev-util/mingw64-runtime-2.0.7 version bump2013-02-19 04:36:50
448124DevelopmenttoolchainUNCONFIRMEDsys-devel-gcc-4.5.3: internal compiler error on sci-biology/ncbi-tools++-9.0.0/work/ncbi_cxx--9_0_0/2012-12-26 17:28:43
447708Core systemtoolchainUNCONFIRMEDsys-devel/gcc-4.7.2 fails to crosscompile for mingw64: options.c:952:3: error: ‘HAVE_GAS_ALIGNED_COM2013-02-18 16:35:04
446698LibrarytoolchainUNCONFIRMEDdev-libs/ppl-1.0 version bump request2013-02-05 08:27:08
444762Core systemtoolchainUNCONFIRMEDsys-devel/gcc-4.6.3: multilib libjava wants 32bit jack (app-emulation/emul-linux-x86-soundlibs)2013-01-02 01:03:40
434180Core systemtoolchainUNCONFIRMEDsys-devel/gcc sandbox violation in /usr/include/DONE (dev-db/oracle-instantclient-basic creates a li2012-12-25 08:33:27
432872Core systemtoolchainUNCONFIRMEDsys-libs/glibc-2.15-r2 - `getent passwd': segmentation fault in __rawmemchr_sse2 () at ../sysdeps/x82012-08-29 23:15:08
425728Core systemtoolchainUNCONFIRMEDsys-libs/libstdc++-v3 sys-devel/gcc:3.3: no version information available in ia64 libstdc++.so2012-08-12 14:58:44
423971Core systemtoolchainUNCONFIRMEDcross-i686-pc-mingw32/gcc-4.6.3: .../build/./gcc/as: line 87: exec: -o: invalid option2012-08-11 18:52:56
376455DevelopmenttoolchainUNCONFIRMEDsys-devel/gdb-7.2 build broken by CFLAGS='-finline-functions -ftracer'2011-07-26 17:59:11
456172ApplicationstommyUNCONFIRMEDdev-vcs/subversion-(1.7.* ?) needs dev-db/sqlite:3 to be compiled with threadsafe2013-02-11 11:20:24
454496ServertommyUNCONFIRMEDdev-vcs/subversion - running /etc/xinetd.d/svnserve requires setting up a user/group through `emerge2013-01-29 14:37:34
452900DevelopmenttommyUNCONFIRMEDdev-vcs/subversion-1.7.7 when rubygems isn't installed for ruby18 - .../work/subversion-1.7.7/libtoo2013-01-21 11:54:22
453020ApplicationstommyUNCONFIRMEDdev-vcs/subversion, please consider patch to fix paths reported for externals2013-01-19 19:26:52
452410DevelopmenttommyUNCONFIRMEDdev-vcs/subversion-1.7.7 - AutoSplit: Can't open blib/lib/SVN/Client.pm: No such file or directory2013-01-16 16:06:49
435426ApplicationstommyUNCONFIRMEDdev-vcs/subversion-1.6.17-r7 USE=-perl still depends on dev-lang/perl through perl-module.eclass2012-11-05 09:43:38
414429EbuildstommyUNCONFIRMEDdev-vcs/subversion-1.7.4 mod_dav_svn UTF8 patch2012-05-03 03:43:46
376643ApplicationstommyUNCONFIRMEDdev-libs/libtommath-0.42.0 cross compilation fix2013-01-26 23:25:03
410389ApplicationstomjbeUNCONFIRMEDmedia-radio/fldigi segfaults at start up2012-04-07 22:14:10
406783DevelopmenttexUNCONFIRMEDdev-tex/pgf-2.10: TikZ "callout" positioning problem2012-03-05 19:49:20
417927ApplicationstexUNCONFIRMEDdev-tex/latexmk - bash completion fails with paths containing spaces2012-05-28 11:51:57
421881DevelopmenttexUNCONFIRMEDdev-tex/isotope version bump2012-06-19 11:47:38
423981EbuildstexUNCONFIRMEDdev-tex/dot2texi-3.0_p1 version bump2012-10-29 15:33:31
427208EbuildstexUNCONFIRMEDdev-tex/rubber-20100306 version bump request and HOMEPAGE update2012-12-22 18:27:45
435338ApplicationstexUNCONFIRMEDdev-tex/chktex-1.7.0 - .../work/chktex-1.7.0/FindErrs.c:320: warning: implicit declaration of functi2012-09-18 13:41:50
437116EbuildstexUNCONFIRMEDdev-tex/biblatex-2.5 version bump request2013-02-02 09:26:44
449198LibrarytexUNCONFIRMEDdev-tex/serienbrief-0.2.4 version bump2012-12-29 15:26:48
414185ApplicationstheologyUNCONFIRMEDapp-text/xiphos-3.1.5 segmentation fault2012-05-03 00:35:43
449212ApplicationstitanofoldUNCONFIRMEDapp-office/odeskteam-3.6.1 version bump2012-12-29 17:14:26
417871LiveCD/DVDtenUNCONFIRMED12.1 amd64 livedvd sshd default configuration AllowUsers line makes usage difficult2012-07-08 17:05:19
458388EbuildstetrominoUNCONFIRMEDmedia-libs/libv4l-0.9.3 version bump2013-02-21 10:36:12
370819LiveCD/DVDtenUNCONFIRMEDLiveDVD 11.0 nox option causes init respawn2011-10-26 19:03:54
453278Core systemsystemdUNCONFIRMEDsys-apps/systemd - please port netcfg from Arch Linux for easier network configuration2013-01-21 20:21:49
457042ServersysadminUNCONFIRMEDnet-analyzer/nagios-plugins check_rpc plugin missing dependency2013-02-13 19:23:00
455806EbuildssysadminUNCONFIRMEDnet-analyzer/{nagios,nagios-core}-3.4.4 - version bump request2013-02-06 12:51:08
453626ApplicationssysadminUNCONFIRMEDnet-analyzer/nagios-core-3.3.1 incomplete privilege grant2013-01-23 16:36:54
444390ServersysadminUNCONFIRMEDnet-analyzer/nagios - Directory permissions for /etc/nagios are wrong, apache can't start2012-11-23 17:41:24
444022ApplicationssysadminUNCONFIRMEDnet-analyzer/nagios-plugins-1.4.16-r{2,3}: check_ping CRITICAL - You need more args!!!2012-11-21 09:27:19
443502EbuildssysadminUNCONFIRMEDnet-analyzer/nagios-plugins-1.4.16-r2 check_http Plugin does not support checking certificates2012-12-03 20:28:53
417323ApplicationssysadminUNCONFIRMEDnet-analyzer/nagios-core version bump to 3.4.12012-10-30 00:47:14
434192ApplicationssysadminUNCONFIRMEDnet-analyzer/nagios-plugins - clean up rblservers in rblcheck-dns2012-09-23 02:54:31
438464UnspecifiedsysadminUNCONFIRMEDnet-analyzer/nagios-3.3.1: apache-2.4.3 fails to start with Syntax error on line 6 of /etc/apache2/2012-12-14 16:11:32
458018ServerswegenerUNCONFIRMEDnet-dns/pdns need more strict permissions for pdns.conf (security threat)2013-02-17 18:26:06
407421ApplicationssysadminUNCONFIRMEDnet-analyzer/nagios-plugins-1.4.15 script contrib/check_email_loop.pl doesn't work2012-08-19 15:26:58
401237ApplicationssysadminUNCONFIRMEDnet-analyzer/nagios should [R]DEPEND on sys-devel/libtool2012-08-19 15:26:59
391827EbuildssysadminUNCONFIRMEDnet-analyzer/nagios-check_logfiles 2.3.2.1-r1 -> 3.4.5.2 version bump2012-08-19 15:26:59
456412ServerswegenerUNCONFIRMEDnet-dns/pdns-3.2 version bump2013-02-10 14:48:24
448918EbuildsswegenerUNCONFIRMEDdev-db/opendbx needs a local description of bindist USE-flag2012-12-27 20:13:18
442092ApplicationsspingUNCONFIRMEDmedia-gfx/gimp-9999 - Portage patch failed to apply (ltmain.sh version 2.4.2)!2012-11-10 00:24:49
410553UnspecifiedswaponUNCONFIRMEDx11-drivers/xf86-video-virtualbox / app-emulation/virtualbox-guest-additions fail to cross-compile2012-04-03 15:23:22
416573EbuildsswaponUNCONFIRMEDx11-drivers/xf86-video-virtualbox - invalid conversion from ‘void*’ to ‘RTHEAPSIMPLEBLOCK*’ [-fpermi2012-06-16 18:59:56
426990LibraryswaponUNCONFIRMEDnet-libs/gsoap-2.8.9 USE=examples - chaining.o: In function `ns__pow': chaining.c:(.text+0x55): unde2013-01-12 16:57:59
454322UnspecifiedsoundUNCONFIRMEDmedia-sound/lame-3.99.5 - console.o: In function `get_termcap_{string,number},apply_termcap_settings2013-01-28 18:33:17
453636ApplicationssoundUNCONFIRMEDmedia-sound/abcde-2.5.4: Add USE-flag "cdio"2013-01-23 16:39:21
453748EbuildssoundUNCONFIRMEDmedia-libs/fmod-4.44.04 version bump2013-01-24 02:59:38
448928EbuildssoundUNCONFIRMEDmedia-libs/libaacplus needs a local description of bindist USE-flag2012-12-27 20:21:50
446940ApplicationssoundUNCONFIRMEDmedia-sound/shell-fm-0.8-r1 - Invalid HTTP: HTTP/1.0 403 Forbidden from: http://ws.audioscrobbler.2012-12-12 03:37:12
448466EbuildssoundUNCONFIRMEDmedia-sound/gpodder 3.4.0 version bump request2012-12-25 03:39:36
441884LibrarysoundUNCONFIRMEDmedia-libs/libvisual-0.4.0-r2 enables threads unconditionally2012-11-05 18:58:43
437186LibrarysoundUNCONFIRMEDmedia-libs/libclthreads has wrong DESCRIPTION and HOMEPAGE and should be moved to different category2012-10-04 17:21:28
431066UnspecifiedsoundUNCONFIRMEDmedia-libs/libvisual - error: 'sigill_handler_sse' undeclared (first use in this function)2012-11-05 15:00:00
418065EbuildssoundUNCONFIRMEDmedialibs/libclthreads-2.4.0 doesn't create major version symlink to libclthreads.so.2.4.02012-10-04 15:44:15
418063EbuildssoundUNCONFIRMEDmedia-libs/libclxclient-3.6.1 doesn't create major version symlink to libclxclient.so.3.6.12013-01-26 17:59:37
410333ApplicationssoundUNCONFIRMEDmedia-sound/milkytracker-0.90.85 - In member function ‘virtual bool DecompressorGZIP::decompress(con2013-01-30 18:31:25
401723ApplicationssoundUNCONFIRMEDmedia-libs/libaacplus USE=fftw causes segmentation faults - ?2012-02-01 17:47:41
440428Applicationsshell-toolsUNCONFIRMEDapp-shells/bash-completion-1.3: some elog messages should only be shown for the first install.2012-10-31 16:10:30
442544Applicationsshell-toolsUNCONFIRMEDapp-shells/bash-completion-1.3 - No support for XZ compression with Okular.2012-11-11 16:23:59
370581ApplicationssoundUNCONFIRMEDmedia-sound/freebirth-0.3.2-r1 - /bin/sh: line 1: 19963 Segmentation fault ./fusebirth > fused_2011-06-09 22:50:31
439978Applicationsshell-toolsUNCONFIRMEDapp-shells/zsh-completion - please add additional completions for ebuild2012-10-29 03:50:21
434366Ebuildsshell-toolsUNCONFIRMEDapp-text/pastebin: malfunctions because pastebin.com has changed their API2012-09-13 22:48:44
431958Unclassifiedshell-toolsUNCONFIRMEDapp-shells/zsh-completion-20091203-r1 is broken because =sys-apps/portage-2.2.0_alpha121 does not in2013-01-28 08:57:32
432378Applicationsshell-toolsUNCONFIRMEDapp-shells/bash-completion - hard-coded path "/sbin/modinfo" in /usr/share/bash-completion/module-in2012-11-03 18:30:08
426570Applicationsshell-toolsUNCONFIRMEDapp-shells/gentoo-bashcomp extended by a completion for eshowkw2012-07-17 16:56:11
426346Applicationsshell-toolsUNCONFIRMEDapp-shells/bash-completion - cd autocomplete's non-directories2012-07-17 20:17:44
457678Enhancement/Feature RequestssecurityUNCONFIRMEDAdd security information to the portage tree2013-02-15 16:57:18
443630ApplicationsselinuxUNCONFIRMEDSELinux + >app-emulation/libvirt-0.9.13-r1 - Segfault starting qemu domains.2013-02-16 18:03:09
403123Unspecifiedshell-toolsUNCONFIRMEDapp-shells/gentoo-bashcomp - Add ebuild(1) --skip-manifest completion support2012-02-13 17:23:49
408859Applicationsshell-toolsUNCONFIRMEDapp-misc/byobu-5.16: byobu-config option Help broken, IOError: No such file '/usr/share/doc/byobu/he2013-02-06 16:13:39
417717Unspecifiedshell-toolsUNCONFIRMED[Tracker] bash completion files that fail with paths containing spaces2012-05-28 10:15:02
417925Applicationsshell-toolsUNCONFIRMEDapp-shells/gentoo-bashcomp - bash completion fails with paths containing spaces2012-05-28 11:51:25
417929Applicationsshell-toolsUNCONFIRMEDapp-shells/bash-completion: some builtin completions don't work with spaces2012-05-28 11:52:38
417945Applicationsshell-toolsUNCONFIRMEDapp-misc/devtodo - bash completion fails with paths containing spaces2012-05-28 12:08:16
418567Applicationsshell-toolsUNCONFIRMEDapp-misc/byobu-5.18: create session failed: /usr/bin/byobu-shell: Too many open files2013-02-06 16:13:27
431628Default ConfigssecurityUNCONFIRMEDinformation disclosure of the IP address of all connected users to all simple users2012-09-10 06:20:24
395711KernelsecurityUNCONFIRMEDkernel: tight loop and no preemption can cause system stall (CVE-2011-4621)2011-12-22 19:16:12
392349VulnerabilitiessecurityUNCONFIRMEDsys-devel/gdb Loads untrusted files with possible arbitrary code execution (CVE-2011-4355)2011-12-30 07:19:51
451626Applicationssci-mathematicsUNCONFIRMED[science overlay] sci-mathematics/scilab-5.4.0 - buildDoc: Error while building documentation: Could2013-02-12 03:35:49
445824Applicationssci-geosciencesUNCONFIRMEDsci-libs/shapelib-1.3.0-r1 with perl-gcpan/DBD-XBase - file collision in /usr/bin/dbfdump2012-12-04 15:31:13
421459Applicationssci-geosciencesUNCONFIRMEDsci-geosciences/grass-6.4.2, strange Exec entries in /usr/share/applications/grass64-grass.desktop2012-11-21 18:48:02
436432Keywording and Stabilizationsci-geosciencesUNCONFIRMEDsci-libs/geos-3.3.5 stabilisation2013-02-02 12:08:29
421325Applicationssci-geosciencesUNCONFIRMEDsci-geosciences/osm2pgsql-20100413 with sci-libs/geos-3.3.3 - In function ‘char* get_wkt_simple(osmN2012-10-10 14:53:15
447532Applicationssci-chemistryUNCONFIRMEDsci-chemistry/avogadro segmentation fault with icc-built openbabel2012-12-18 16:45:45
439438Ebuildssci-chemistryUNCONFIRMEDsci-chemistry/wxmacmolplt-7.4.3 version bump2012-10-23 19:24:23
435676Applicationssci-chemistryUNCONFIRMEDsci-chemistry/ghemical-2.99.2-r2 - /usr/lib64/libSCwfn.so: undefined reference to `sc::DenFunctional2012-09-21 16:11:33
403649Applicationssci-chemistryUNCONFIRMEDsci-chemistry/gperiodic-2.0.10-r2 doesn't honor LINGUAS for locale files2012-02-23 21:47:07
450322Applicationssci-biologyUNCONFIRMEDsci-biology/mira-3.4.0.2 - libtool: Version mismatch error. This is libtool 2.4, but the definition2013-02-17 09:09:47
392061Ebuildssci-chemistryUNCONFIRMEDsci-chemistry/platon-20110126 checksum failure - version bump ?2011-11-29 15:58:48
418625Applicationssci-biologyUNCONFIRMEDsci-biology/gatk-1.5: error: name clash: sum(Collection) and sum(Collection) have t2013-02-17 08:28:02
406279Applicationssci-biologyUNCONFIRMEDsci-biology/emboss-6.3.1_p4 - add dependency on sci-libs/plplot?2012-02-29 16:17:32
402849Applicationssci-biologyUNCONFIRMEDsci-biology/GBrowse: add USE="chado" and its dependencies2013-02-17 08:26:23
405035Applicationssci-biologyUNCONFIRMED[science overlay] sci-biology/embassy-6.3.1 fails to emerge because of dependency on embassy-domaina2012-02-20 14:33:45
402835Applicationssci-biologyUNCONFIRMEDsci-biology/ucsc-genome-browser: add -fPIC to CFLAGS and USE=+static-libs2013-02-17 08:24:19
401943Applicationssci-biologyUNCONFIRMEDsci-biology/transfac-3.2 - tfextract segmentation fault in 0x00007f5df6cc4487 in ajStrDel (Pstr=0x72012-02-04 17:26:44
393311Ebuildssci-biologyUNCONFIRMEDsci-biology/emboss-6.0.1 does not respect CFLAGS="-O?"2012-02-02 17:39:58
368473Applicationssci-biologyUNCONFIRMEDsci-biology/hmmer-3.0 fails to build with "mpi.c:27:23: error: impl_dummy.: No such file or director2011-06-21 09:31:43
382321Applicationssci-biologyUNCONFIRMEDsci-biology/emboss-6.3 runtime functionality missing2011-09-09 23:18:48
383789Applicationssci-biologyUNCONFIRMEDsci-biology/ncbi-tools++-2010.06.15-r1: libmzXML.so: undefined reference to `ncbi::CMemberInfo::SetN2013-02-17 08:11:13
389765Applicationssci-biologyUNCONFIRMEDsci-biology/unafold - add graphic capabilities of mfold_utils2013-02-17 08:24:03
453188LibrarysciUNCONFIRMED[science overlay] kde-base/kdelibs-4.9.3 and sci-libs/plasma-2.4.6 file collision in /usr/include/pl2013-01-21 11:46:54
452622LibrarysciUNCONFIRMEDdev-python/pytables needs to be recompiled for the exact sci-libs/hdf5 version.2013-01-18 20:03:31
442880EbuildssciUNCONFIRMED[science overlay] sci-libs/trilinos-10.12.2 - Version bump; install location fix; prefix support.2012-11-12 19:00:06
446356ApplicationssciUNCONFIRMEDsci-visualization/mayavi-4.2.0 - /var/tmp/portage/sci-visualization/mayavi-4.2.0/temp/environment: l2012-12-27 09:32:14
448110DevelopmentsciUNCONFIRMEDdev-python/rpy-2.2.6-r1 fails test testInterruptR - AssertionError: True is not false2013-01-23 17:03:53
448824ApplicationssciUNCONFIRMEDsci-visualization/ggobi-2.1.9-r1 - autom4te-2.69: ../../m4/lt~obsolete.m4: no such file or directory2012-12-27 14:07:04
449320LibrarysciUNCONFIRMEDsci-libs/cholmod-2.0.1 - configure: .../temp/ccKrajc0.o: In function `main': conftest.c:(.text+0x7):2013-01-05 00:28:07
404249ApplicationssciUNCONFIRMED[science overlay] sci-biology/embassy-6.3.1 multiple slot conflicts.2012-02-20 14:33:49
396657ApplicationssciUNCONFIRMED[science-overlay] dev-perl/Bio-BigFile-1.06 fails to emerge due to missing jkweb.a2012-02-11 16:02:44
396091ApplicationssciUNCONFIRMED[science-overlay] dev-perl/Bio-BigFile-1.06 fails to emerge because of relocation problem2012-01-01 08:50:47
395891ApplicationssciUNCONFIRMED[science overlay] sci-biology/embassy-memenew-4.0.0-r1 fails to fetch embassy-memenew-4.0.0-r1.tar.g2012-02-20 14:34:30
392243JavasciUNCONFIRMED[science overlay] dev-java/jlatexmath-0.9.4 fails to emerge because of ACCESS VIOLATION at /root/.ja2011-12-04 02:58:03
383659ApplicationssciUNCONFIRMED[science overlay] sci-biology/emboss-6.4 version bump2012-02-24 18:29:22
381595EbuildssciUNCONFIRMEDsci-libs/mkl-10.0.5.025 tarball verification fails2011-09-03 10:33:04
458412DevelopmentschemeUNCONFIRMEDdev-scheme/racket-5.3.3 version bump2013-02-20 14:34:10
366975ApplicationssciUNCONFIRMED[science overlay] sci-biology/gbrowse-2.33 fails to install, due to ACCESS VIOLATION2012-01-04 08:07:11
388073ApplicationssbriesenUNCONFIRMEDmedia-gfx/iscan scan area selection selection problem with >=gcc-4.52012-08-26 02:58:08
397355ServersambaUNCONFIRMEDnet-fs/samba cluster flags wrong config file /etc/ctdb/functions2012-01-16 23:57:57
453262EbuildsrubyUNCONFIRMEDdev-ruby/pdf-reader-1.3.0 version bump request2013-01-21 12:10:53
431200ApplicationsrubyUNCONFIRMEDdev-lang/rubinius-1.2.4.20110705 - m/builtin/unpack.cpp:284:5: error: narrowing conversion of ‘214742013-02-12 09:50:38
454562ApplicationsroxUNCONFIRMEDrox-extra/archive - deprecation warning about python_mod_cleanup()2013-01-29 19:23:09
425758EbuildsroxUNCONFIRMEDrox-base/rox-lib - Deprecation Warning: Usage of python_mod_optimize() in packages not support......2012-07-18 09:48:32
392463EbuildsroxUNCONFIRMEDrox-extra/roxcd: Deprecation Warning about of python_mod_cleanup()2012-09-09 01:16:09
377339EbuildsroxUNCONFIRMEDNew Version rox-base/zeroinstall-injector-1.22011-08-02 10:52:56
456184Ebuildsrobbat2UNCONFIRMEDsys-block/tw_cli-10.2.2.1 version bump2013-02-08 17:23:20
455212Developmentrobbat2UNCONFIRMEDdev-vcs/git-1.8.1.2[subversion] does not respect CC/LDFLAGS2013-02-03 00:56:45
454746Core systemrobbat2UNCONFIRMEDsys-fs/lvm2-2.02.97-r1, sys-fs/udev-197-r4: /dev/mapper entries absent for dm-crypt partitions mount2013-02-04 01:37:50
451452Core systemrobbat2UNCONFIRMEDsys-fs/lvm2-2.02.97-r1 - Errors on LV create/delete operations in systemd-196 environment.2013-02-07 01:16:09
448914Ebuildsrobbat2UNCONFIRMEDdev-db/libdbi-drivers needs a local description of bindist USE-flag2012-12-27 19:52:27
446828Applicationsrobbat2UNCONFIRMEDnet-analyzer/sslsniff-0.8-r1 - conftest.cpp:21:26: fatal error: boost/asio.hpp: No such file or dire2012-12-11 22:11:50
436062Developmentrobbat2UNCONFIRMEDapp-portage/g-cpan - perl-gcpan/RT-Extension-Nginx-0.02 - mkdir /usr/etc: Permission denied at /usr/2012-09-24 11:14:58
431080Toolsrobbat2UNCONFIRMEDapp-portage/g-cpan-0.16.4-r1 does not handle quotes in description properly2012-08-13 01:48:00
408089Keywording and Stabilizationrobbat2UNCONFIRMEDsys-power/pmtools-20110323: stabilize any version providing turbostat utility2012-10-07 09:45:03
411115Developmentrobbat2UNCONFIRMEDdev-util/rats-2.3 version bump and HOMEPAGE change2012-04-07 08:41:07
409181Applicationsrobbat2UNCONFIRMEDapp-misc/g15stats - script does not parse extra options2013-01-31 19:03:48
405265Developmentrobbat2UNCONFIRMED"git svn clone/fetch/rebase" fail with dev-vcs/subversion[webdav-serf]2012-03-15 13:31:46
403371Applicationsrobbat2UNCONFIRMEDsys-apps/rescan-scsi-bus-1.48: line 592: [: 1.03: integer expression expected2012-02-13 17:42:59
402277Applicationsrobbat2UNCONFIRMEDnet-misc/memcached-1.4.13 version bump (1.4.11 does not build)2013-01-01 15:39:01
401473Ebuildsrobbat2UNCONFIRMEDapp-misc/dnetc-2.9110.519 version bump2012-11-19 09:35:41
401249Applicationsrobbat2UNCONFIRMEDnet-mail/qmailadmin-1.2.16 version bump2012-01-30 11:52:34
392953Ebuildsrobbat2UNCONFIRMEDdev-java/lucene-3.6.1 Version Bump2012-11-19 09:35:47
449352Gamesrich0UNCONFIRMEDgames-rpg/eternal-lands Assertion `self' failed (runtime error)2013-01-03 00:24:17
456764Keywording and StabilizationrentorbuyUNCONFIRMED=net-firewall/shorewall{,-core}-4.5.11.2 stabilisation request2013-02-11 17:03:57
437458InstallCDreleaseUNCONFIRMEDinstall-amd64-minimal-20120917.iso doesn't autodetect VirtIO blockdevice/network devices2012-12-16 06:09:55
431912InstallCDreleaseUNCONFIRMEDinstall-x86-minimal-20120710.iso - boot hangs while looking for cdrom when encounters swap partition2013-02-21 02:38:59
398677GamesreavertmUNCONFIRMEDdev-games/openscenegraph-3.0.1 - /usr/lib64/libdcmimgle.a(dcmimage.o): relocation R_X86_64_32S again2012-11-18 23:58:42
437028UnspecifiedrafaelmartinsUNCONFIRMEDdev-lua/luafilesystem-1.6.0 version bump2013-02-03 13:08:28
451132ApplicationsrajivUNCONFIRMEDnet-dns/dnstop version bump request2013-02-03 15:00:48
433153ApplicationsramerethUNCONFIRMEDapp-emulation/ganeti should install logrotate config2012-09-03 11:31:29
399481ApplicationsrafaelmartinsUNCONFIRMEDapp-portage/g-octave - g-octave/odepkg-0.6.10 octave-3.6.0 - odepkg_auxiliary_functions.cc:457:52: e2012-12-20 00:22:48
430996EbuildsradioUNCONFIRMEDnet-wireless/gnuradio-3.6.1-r1 does not byte-compile grc_gnuradio package2012-08-12 11:35:18
430348EbuildsradioUNCONFIRMEDnet-wireless/gnuradio-3.6.1-r1 USE="doc" - some documentation is installed outside /usr/share/doc/${2012-08-13 23:02:49
419389ApplicationsradhermitUNCONFIRMEDwww-client/lynx-2.8.8_pre12 fails to build: ../../../WWW/Library/Implementation/HTUtils.h:735:17: fa2012-06-16 09:40:28
368497ApplicationsradhermitUNCONFIRMEDapp-admin/lsyncd - add init.d and configuration files2012-11-24 08:30:17
458170EbuildsqtUNCONFIRMEDnet-news/quiterss-0.12.1 - version bump request2013-02-18 22:02:11
451456LibraryqtUNCONFIRMED[qt overlay] Qt5 packages try to link against already installed versions during recompilation2013-02-14 11:59:11
450444EbuildsqtUNCONFIRMED[qt overlay] dev-util/gammaray - Tool to poke around in a Qt-application and also to manipulate the 2013-02-06 04:07:10
442220ApplicationsqtUNCONFIRMEDapp-editors/focuswriter - segmentation fault in Xfce42013-01-06 15:59:32
447368Eclasses and ProfilesqtUNCONFIRMEDqt4-build.eclass - cpu autodetection and cpu specific flags2013-01-30 03:29:52
448830LibraryqtUNCONFIRMEDx11-libs/qt-openvg-4.8.4 - qpaintengine_vg.cpp:3212:5: error: narrowing conversion of ‘d->QVGPaintEn2013-02-17 11:26:14
448910Applicationsqmail-bugsUNCONFIRMEDmail-mta/netqmail-1.06 - Force python version to 2.x. - pkg_postinst - SyntaxError: invalid token "02012-12-28 13:08:59
375879Ebuildsqmail-bugsUNCONFIRMED[PATCH] mail-mta/netqmail: Add SMTP authentication support (AUTH LOGIN) to qmail-remote2012-02-24 13:11:27
421845ApplicationsqemuUNCONFIRMEDapp-emulation/qemu: ABI=x32 support2012-12-13 22:09:00
435534ApplicationsqemuUNCONFIRMEDapp-emulation/qemu-kvm-1.1.1-r1 - manual pages are not installed2012-11-30 12:14:46
442326ApplicationsqemuUNCONFIRMEDsys-firmware/sgabios-0.1_pre8 - Compile phase failure - ld: i386:x86-64 architecture of input file `2012-11-08 10:43:27
449354ApplicationsqemuUNCONFIRMEDapp-emulation/qemu-guest-agent fails to shutdown the guest2013-01-01 20:32:37
456814EbuildsqemuUNCONFIRMEDapp-emulation/qemu-1.2.2-r3[ncurses] fails configure with sys-libs/ncurses[tinfo]2013-02-14 14:14:03
440214EbuildsqaUNCONFIRMED[tracker] packages with emerge messages that can be improved by checking the previous installed vers2013-02-14 19:45:48
407597DevmanualqaUNCONFIRMEDhardblockers and versioned slot deps missing under general-concepts/dependencies2013-01-01 18:38:03
405727Eclasses and ProfilesqaUNCONFIRMEDalternatives.eclass - various improvements2012-02-27 00:05:53
371637DevmanualqaUNCONFIRMEDarrow syntax (->) is missing in SRC_URI documentation2011-12-20 19:42:23
427960EbuildspythonUNCONFIRMEDdev-python/tox-1.4 - pkg_resources.DistributionNotFound: py>=1.4.92012-07-25 01:38:14
433175ApplicationspythonUNCONFIRMEDdev-lang/python-2.7.3-r2: Exception AttributeError: AttributeError("'_DummyThread' object has no att2012-09-03 18:23:18
401651Core - DependenciespythonUNCONFIRMEDdev-lang/python 3.1.4-r3 and 2.7.2-r3 sys-libs/readline is conditional on ncurses?2012-02-01 06:29:39
404063DevelopmentpythonUNCONFIRMEDVersion bump: =dev-python/kinterbasdb-3.3.02012-03-09 08:44:10
413863DevelopmentpythonUNCONFIRMEDdev-lang/python-3.2.3 - improve cross compilation2012-12-17 14:57:26
391185UnspecifiedpythonUNCONFIRMED=dev-python/utidylib-0.2-r1 - src_test(): Segmentation fault in trial2012-02-18 20:19:49
394103Core systempythonUNCONFIRMEDdev-lang/python-2.7.2-r3 fix for exception: "handle out of range in select()"2011-12-10 21:27:35
381809EbuildspythonUNCONFIRMEDgames-simulation/singularity-0.30c fails to run with Python32012-12-29 15:00:48
366571DevelopmentpythonUNCONFIRMEDapp-admin/eselect-python: override python version from environment2011-07-29 06:41:23
442168ApplicationsproaudioUNCONFIRMEDmedia-sound/patchage - Build failure when python-3 is set as active version2012-12-23 21:12:37
435270LibraryproaudioUNCONFIRMEDmedia-libs/aubio-0.3.2-r1 - SyntaxError: ('invalid syntax', ('/usr/lib64/python2.7/site-packages/aub2012-09-17 11:44:31
440316ApplicationsproaudioUNCONFIRMEDmedia-sound/sonic-visualiser-2.0 version bump2013-01-11 12:08:59
407163LibraryproaudioUNCONFIRMEDmedia-libs/portmidi needs kernel config checks for CONFIG_SND_USB_AUDIO, CONFIG_SND_SEQUENCER2012-03-07 16:40:02
391675EbuildsproaudioUNCONFIRMEDmedia-plugins/swh-plugins - make x86 extensions optional at compile time2012-07-04 13:47:31
372525ApplicationsproaudioUNCONFIRMEDmedia-sound/jack-audio-connection-kit-0.120.2 crashes with buffer overflow detected in jack_alsa.so2011-10-10 00:02:33
457518PrintingprintingUNCONFIRMEDapp-text/gsview 5.0 version bump2013-02-14 14:02:47
450080ApplicationsprintingUNCONFIRMEDapp-text/pdftk-1.45 version bump2013-01-21 15:08:02
450220ApplicationsprintingUNCONFIRMED=net-print/cups-1.5.2-r4 - German localization file has empty strings.2013-01-05 18:07:19
440886PrintingprintingUNCONFIRMEDnet-print/cups-bjnp-1.1 - In file included from bjnp-io.c:22:0: bjnp-protocol.h:100:5: error: redefi2013-02-11 11:01:36
443076PrintingprintingUNCONFIRMEDnet-print/foomatic-filters-4.0.16 - configure.ac:6: version mismatch. This is Automake 1.11.6, but2013-01-19 06:59:22
432418PrintingprintingUNCONFIRMEDnet-print/gutenprint should optionally support Epson printers2012-11-09 14:13:17
420623PrintingprintingUNCONFIRMEDnet-print/foo2zjs-99999999 fails emerge with permission denied, access attempt outside the sandbox2013-01-27 23:07:16
455546Prefix SupportprefixUNCONFIRMEDsys-libs/zlib as a wrong install_name in the optional minizip library2013-02-05 02:58:40
433972Prefix SupportprefixUNCONFIRMEDapp-text/tree-1.6.0-r1: failed to compile on Mac OSX Mountain Lion2012-10-10 01:23:24
435044Prefix SupportprefixUNCONFIRMEDbootstrap-prefix.txt fails on comilation of portage/app-editors/nano-2.3.1-r22012-10-01 14:08:25
419793Prefix SupportprefixUNCONFIRMEDapp-emulation/hercules-3.07: install failed due to chown root2012-08-25 06:35:42
402465UnspecifiedprefixUNCONFIRMEDmedia-video/avidemux-2.5.6 - work/avidemux_2.5.6/plugins/ADM_audioDevices/Sdl/ADM_deviceSDL.cpp:15:12012-02-07 23:23:49
384581Mac OSXprefixUNCONFIRMEDapp-editors/emacs-23.3-r2: emerge failed with error unexec: my_endbss_static is not in section __bss2011-10-31 03:04:33
448294Applicationspolynomial-cUNCONFIRMEDapp-emulation/virtualbox-4.2.6: cannot open shared object libstdc++.so.62012-12-24 10:19:17
449436Applicationspolynomial-cUNCONFIRMEDapp-emulation/virtualbox-4.1.22-r1 - Checking for Mesa / GLU: Mesa not found at -L/usr/X11R6/lib 2012-12-31 16:33:12
456354Applicationspolynomial-cUNCONFIRMEDapp-emulation/virtualbox-4.2.6-r1 fails to build. kmk_builtin_mv shows options help. kmk error 642013-02-11 17:25:35
367199Applicationsportage-utilsUNCONFIRMEDapp-portage/portage-utils 'qlop' - gauge option's description is vague and misleading2011-05-17 10:12:02
447534Applicationspolynomial-cUNCONFIRMEDapp-emulation/virtualbox-4.1.22-r1 - VBox/Runtime/common/string/strformatrt.cpp:829:19: internal com2012-12-23 18:30:14
447302Applicationspolynomial-cUNCONFIRMEDapp-emulation/virtualbox-modules-4.2.4 with gentoo-sources-3.7.0 - Header files were moved and re-or2013-02-03 19:32:07
447356Unspecifiedpolynomial-cUNCONFIRMEDapp-emulation/virtualbox-modules-4.2.4 with kernel 3.7 - modprobe: FATAL: Error inserting vboxdrv (/2013-02-14 10:04:16
444464Applicationspolynomial-cUNCONFIRMEDapp-emulation/virtualbox-4.1.22 - .../work/VirtualBox-4.1.22/src/VBox/Runtime/common/err/errmsg.sed 2012-12-23 18:15:49
442876Applicationspolynomial-cUNCONFIRMEDapp-emulation/virtualbox-4.2.4: after upgrade some VMs do not start anymore2013-01-02 19:55:58
440532Applicationspolynomial-cUNCONFIRMEDapp-emulation/virtualbox-modules-4.1.22: some elog messages should only be shown when upgrading from2012-10-31 16:22:12
427974Applicationspolynomial-cUNCONFIRMEDapp-emulation/virtualbox-4.1.12 - .../work/VirtualBox-4.1.12/src/VBox/Devices/PC/Etherboot-src/arch/2012-07-25 02:41:01
428124Applicationspolynomial-cUNCONFIRMEDapp-emulation/virtualbox-4.1.12: "Failed to create the VirtualBox COM object"2012-09-21 15:25:00
431144Applicationspolynomial-cUNCONFIRMEDnet-irc/xchat-2.8.8-r2 - saved configuration is corrupted on read or write2012-08-15 12:32:17
432884Ebuildspolynomial-cUNCONFIRMEDapp-emulation/virtualbox-modules: undeclared 'VM_RESERVED'2013-01-24 15:45:20
438164Unspecifiedpolynomial-cUNCONFIRMEDapp-emulation/virtualbox - EQ overflow in X server when virtualbox starts with Wacom tablet's mouse 2012-10-14 18:22:06
438930Ebuildspolynomial-cUNCONFIRMEDapp-emulation/virtualbox-4.2 USE=vnc - vnc module is built but not installed2012-12-21 18:07:10
427228Applicationspolynomial-cUNCONFIRMED>=www-client/seamonkey-2.10: cannot install any more addons dictionaries2012-07-26 07:50:15
426656Ebuildspolynomial-cUNCONFIRMEDapp-emulation/virtualbox-4.18 should depend on >=dev-util/kbuild-0.1.9998_pre20110817-r12012-07-18 15:40:35
426898Applicationspolynomial-cUNCONFIRMED=app-emulation/virtualbox-modules-4.1.12 with sys-kernel/vanilla-sources-3.4.5 - src_test(): .../wor2012-11-13 17:18:09
423355Applicationspolynomial-cUNCONFIRMEDapp-emulation/virtualbox - remove `-f' from VBox_load_modules2012-07-26 14:30:14
409961Applicationspolynomial-cUNCONFIRMEDapp-emulation/virtualbox-4.1.10[vboxwebsrv] with net-libs/gsoap-2.8.8[gnutls] - /usr/lib64/libgsoaps2012-03-28 12:53:46
413467Applicationspolynomial-cUNCONFIRMEDapp-emulation/virtualbox-4.1.12: parallel build sometimes fails2013-01-07 06:25:45
408607Applicationspolynomial-cUNCONFIRMEDapp-emulation/virtualbox - make --disable-vmmraw optional2012-03-18 05:32:07
404345Applicationspolynomial-cUNCONFIRMEDapp-emulation/virtualbox-modules-4.1.4 - work/vboxpci/linux/VBoxPci-linux.c:989:9: Fehler: Zu wenige2012-02-18 16:57:37
401823Applicationspolynomial-cUNCONFIRMEDseamonkey desktop file lists unhandled mimetype associations2012-02-16 12:48:55
395927Applicationspolynomial-cUNCONFIRMEDapp-emulation/virtualbox-4.1.8, app-emulation/virtualbox-extpack-oracle-4.1.8 - broken /usr/lib64/vi2011-12-26 10:21:44
395429Ebuildspolynomial-cUNCONFIRMEDapp-emulation/virtualbox-modules: need check CONFIG_HZ=value2011-12-21 02:10:58
383669Applicationspolynomial-cUNCONFIRMEDapp-emulation/virtualbox-4.1.2: fails to compile due to Java name clash2011-12-21 14:52:14
380301Applicationspolynomial-cUNCONFIRMEDapp-emulation/virtualbox-4.1.2 crashes when compiling with -O2 option2012-02-01 09:06:12
380105Core systempolynomial-cUNCONFIRMEDsys-libs/libsmbios - insecure RUNPATHs:/usr/sbin/smbios-sys-info-lite2011-08-25 12:50:02
379967Applicationspolynomial-cUNCONFIRMEDapp-emulation/virtualbox-modules-4.0.12 doesn't check kernel config on compatibility2011-08-22 12:36:13
377285Applicationspolynomial-cUNCONFIRMEDapp-emulation/virtualbox-4.0.12 - Windows guest has USB disk woes2012-10-18 13:10:29
372475Ebuildspolynomial-cUNCONFIRMEDRename app-emulation/virtualbox-additions to app-emulation/virtualbox-[guest-]additions[-bin]2012-04-08 19:23:25
368659Unspecifiedpolynomial-cUNCONFIRMEDapp-emulation/virtualbox - add USE flag for net-misc/vde2011-11-23 09:07:24
366215Applicationspolynomial-cUNCONFIRMEDapp-emulation/virtualbox has incomplete dependencies2013-01-01 09:29:16
367443Ebuildspolynomial-cUNCONFIRMEDapp-emulation/virtualbox-9999 sets RPATH to /opt/VirtualBox but is installed to /usr/lib/virtualbox2011-05-17 17:41:46
365643Ebuildspolynomial-cUNCONFIRMEDapp-emulation/virtualbox-additions-4.* License wrongly stated as PUEL2012-07-18 02:27:12
456892Portage Documentationpms-bugsUNCONFIRMEDMissing formal specification of ebuild naming policy2013-02-13 00:48:01
457162Core systempms-bugsUNCONFIRMEDebuild's keepdir() alter target-dir permissions.2013-02-19 14:13:52
438494Conceptual/Abstract Ideaspms-bugsUNCONFIRMEDHave configuration file protection against new files in conf.d/ directories2012-10-16 15:46:11
440218Conceptual/Abstract Ideaspms-bugsUNCONFIRMEDportage should have a ebuild-accessible variable for the USE flags of previously-installed versions2012-10-30 16:30:36
414811PMS/EAPIpms-bugsUNCONFIRMED[Future EAPI] globstar shell option enabled by default2013-02-07 19:03:35
423245PMS/EAPIpms-bugsUNCONFIRMED[Future EAPI] dohtml: Extend default list of extensions2012-09-11 19:45:13
425214PMS/EAPIpms-bugsUNCONFIRMED'dohtml -r ${directory}/' has undocumented behavior2012-07-08 06:59:50
456800Developmentphp-bugsUNCONFIRMEDdev-php/pecl-memcache-3.0.7 version bump2013-02-11 17:02:08
455156Developmentphp-bugsUNCONFIRMEDdev-php/PEAR-MDB2 + drivers version bump2013-02-04 02:31:17
453840Libraryphp-bugsUNCONFIRMEDdev-php/pecl-ssh2-0.12 version bump request2013-01-28 13:43:19
453412Developmentphp-bugsUNCONFIRMEDdev-php/PHPUnit_MockObject-1.2.3 - Version Bump2013-02-19 17:42:20
453410Developmentphp-bugsUNCONFIRMEDdev-php/PHP_CodeCoverage-1.2.7 - Version Bump2013-02-19 14:37:27
451512Libraryphp-bugsUNCONFIRMEDdev-php/xcache-3.0.1 version bump2013-02-05 20:33:39
449264Libraryphp-bugsUNCONFIRMEDdev-php/pecl-mongo-1.3.2 version bump2013-01-08 14:42:51
448750Applicationsphp-bugsUNCONFIRMEDdev-php/PEAR-Mail: Fix non-static function warning2012-12-27 02:01:00
448558Applicationsphp-bugsUNCONFIRMEDdev-php/PEAR-Mail_Mime-1.8.7 version bump request2012-12-25 17:46:14
443070Ebuildsphp-bugsUNCONFIRMEDdev-php/PEAR-Spreadsheet_Excel_Writer-0.9.3 version bump2013-01-14 14:16:17
435742Applicationsphp-bugsUNCONFIRMEDdev-php/igbinary-1.1.1-r1 with dev-lang/php[threads] compilation fails with: apc_serializer.h:57:5: 2012-09-21 16:43:14
422459Applicationsphp-bugsUNCONFIRMEDdev-php/smarty-2.6.26 version bump request2013-01-21 18:16:37
453122ApplicationsperlUNCONFIRMEDPlease stabilize =app-text/po4a-0.42 (was: 0.38 misparses CDATA section)2013-02-19 20:59:42
439920Core systemperlUNCONFIRMEDdev-lang/perl-5.12.4-r1 - pp.o: In function `Perl_pp_pow': pp.c:(.text+0x3a8a): undefined reference 2012-10-28 16:20:23
440142LibraryperlUNCONFIRMEDdev-perl/XML-LibXML - Segmentation fault when removing child nodes with entity or namespace subnodes2012-10-29 19:19:42
420245DevelopmentperlUNCONFIRMEDdev-perl/DBD-mysql-4.021 version bump2012-06-08 16:58:51
407801EbuildsperlUNCONFIRMEDdev-libs/syck to 0.70 version bump2012-03-28 10:17:03
381711ApplicationsperlUNCONFIRMEDdev-perl/IO-Tty-1.100.0 fails tests on amd642011-09-04 07:54:02
375837EbuildsperlUNCONFIRMEDmail-filter/spamassassin-3.3.2 fails to build (Sandbox violation)2011-10-11 15:56:38
374149DevelopmentperlUNCONFIRMEDMoose-2.1.0 conflicts with all existent versions of File-ChangeNotify, MooseX-Params-Validate, and M2011-07-10 03:47:03
452608ApplicationspdaUNCONFIRMEDapp-pda/gtkpod-2.1.3-r1 with dev-util/anjuta-3.4.3 - In function ‘on_layout_lock_toggle’: anjuta-act2013-02-01 22:49:13
404453EbuildspchristUNCONFIRMED=dev-lang/swig-2.0.4-r1 - Invalid conversion breaks PHP 5.4 support2012-12-28 19:37:35
453516ApplicationspatrickUNCONFIRMEDapp-emulation/virtualbox-bin-4.2.6 - can not use Bridged Adapter in network config2013-01-23 14:33:55
446318ApplicationspatrickUNCONFIRMEDdev-lang/rakudo-2012.11 - pbc_to_exe: Missing or wrong version of dependency 'src/Perl6/Grammar.pm'2012-12-07 17:14:57
438150ServerpatrickUNCONFIRMEDwww-servers/apache-2.4.3 - configuration files have "require host", should be "require ip"2013-02-16 14:07:53
432326EbuildspatrickUNCONFIRMEDapp-emulation/virtualbox-guest-additions should add group "vboxsf" to support automount shared folde2012-10-23 10:19:47
425008ApplicationspatrickUNCONFIRMEDapp-crypt/gorilla-1.5.3.6 version bump2013-02-05 22:02:45
424373ApplicationspatrickUNCONFIRMEDnet-misc/strongswan-5.0.0 - Outdated description about (non-)root privileges2012-07-03 14:39:13
424797EbuildspatrickUNCONFIRMEDapp-emulation/virtualbox-guest-additions-4.1.12: Successfully built on no-multilib amd642012-07-06 04:27:50
424816ApplicationspatrickUNCONFIRMEDapp-emulation/virtualbox-guest-additions-4.1.12 and x11-drivers/xf86-video-virtualbox-4.1.12 fail to2012-12-26 21:09:46
405151ApplicationspatrickUNCONFIRMEDapp-emulation/virtualbox-guest-additions-4.1.4-r1: Failure to build with 3.2 kernel2012-04-02 07:44:24
403953ServerpatrickUNCONFIRMEDwww-servers/apache-2.2.21 - CONNECT does not work over existing SSL connection2013-02-16 14:06:13
392769ApplicationspatrickUNCONFIRMEDapp-emulation/virtualbox-guest-additions-4.1.6-r1 fails to build from /etc/kernel/postinst.d - make[2012-03-14 22:38:37
385783ApplicationspatrickUNCONFIRMEDwww-servers/apache-2.2.21 cross-compilation fix (libtool related)2013-02-16 13:33:00
385779ApplicationspatrickUNCONFIRMEDapp-admin/apache-tools-2.2.21 cross-compilation fix (libtool related)2013-02-16 13:32:00
373979EbuildspatrickUNCONFIRMEDapp-emulation/virtualbox-modules-4.0.10 does not compile if KBUILD_OUTPUT != KERNEL_DIR2012-09-11 09:29:19
456908Core systempam-bugsUNCONFIRMEDsys-libs/pam-1.1.6-r2: /usr/lib64/portage/bin/isolated-functions.sh: line 215: wait: `Failed Running2013-02-16 21:10:14
412941Applicationspam-bugsUNCONFIRMEDsys-auth/pam_blue-0.9.0: various username matching problems2012-05-21 21:45:01
410421Core systempam-bugsUNCONFIRMEDauth: PAM unable to resolve symbol: pam_sm_open_session2012-05-22 05:00:57
384603Core systempam-bugsUNCONFIRMEDsys-auth/pam_ssh-1.97-r2 (and r3) forgets to set gids in session start2011-10-09 03:06:42
437420ApplicationspachoUNCONFIRMEDmail-client/mail-notification-5.4-r6 - wrong rendering for the icon in message tray of Gnome 32012-10-07 07:24:26
452162ApplicationspachoUNCONFIRMED=net-wireless/bluez-5.2 version bump request2013-02-08 20:41:38
456934Other documentsoverlaysUNCONFIRMEDSince the 2012-09-09-make.conf-and-make.profile-move the overlay instructions are out of date2013-02-13 10:03:36
458074OpenRCopenrcUNCONFIRMEDsys-apps/openrc-0.11.8 doesn't parse correctly options contained two words abreast self2013-02-18 13:35:38
454914OpenRCopenrcUNCONFIRMEDsys-apps/openrc: Feature Request: Open logfile before chuid option2013-01-31 23:56:37
448802OpenRCopenrcUNCONFIRMEDsys-apps/openrc-0.11.8 - udhcpc client should set "search" option in resolv.conf2012-12-27 21:21:17
444610OpenRCopenrcUNCONFIRMEDsys-apps/openrc output is unfriendly on high resolution/wide monitors2012-11-24 19:46:03
425126OpenRCopenrcUNCONFIRMEDsys-apps/openrc-0.10.5 brings up br0 interface with nonfunctional route2012-07-07 00:20:16
434020OpenRCopenrcUNCONFIRMEDnet.example in docs dir suggest a faulty bond0-configuration.2012-09-05 11:55:57
372551OpenRCopenrcUNCONFIRMEDsys-apps/openrc: rc.c:read_key() hangs waiting for input at Interactive? prompt (termios problem)2012-02-15 12:49:05
429616LibraryopenofficeUNCONFIRMEDdev-libs/icu-49.1.2 - ../sysdeps/unix/sysv/linux/getpagesize.c:32: __getpagesize: Assertion `_rtld_g2012-11-02 15:22:44
446892ApplicationsopenofficeUNCONFIRMEDapp-office/libreoffice-bin-3.6.3.2 - Conditional formatting in Calc cells disappears2013-01-02 06:17:09
451582LibraryopenofficeUNCONFIRMEDdev-cpp/libcmis-0.3.0 and dev-cpp/libcmis-0.2.3-r1 collision: /usr/share/man/man1/cmis-client.1.xz2013-01-14 22:34:27
436558Ebuildsoli.huberUNCONFIRMEDwww-apps/joomla-3.0.0 version bump2012-11-26 22:52:16
436534EbuildsnirbheekUNCONFIRMEDmedia-fonts/source-sans-pro-1.036 version bump2012-09-29 15:26:54
457092ApplicationsnirbheekUNCONFIRMEDnet-misc/networkmanager disables IPv6 Privacy Extensions2013-02-13 19:21:04
457940ApplicationsnirbheekUNCONFIRMEDnet-misc/networkmanager should prioritise ethernet over wifi2013-02-18 15:59:18
458274ApplicationsnirbheekUNCONFIRMEDnet-misc/networkmanager-0.9.6.4 does not save settings for wired connection with 802.1x authenticati2013-02-21 08:24:51
448142EbuildsnixphoeniUNCONFIRMEDsci-electronics/eagle-6.4.0 - Version bump.2013-01-29 13:36:42
426260ServernxUNCONFIRMEDnet-misc/x2goserver - x2go loses the applications menu under gnome2012-07-17 18:04:16
448938EbuildsnikoliUNCONFIRMEDmedia-video/mplayer2 needs a local description of bindist USE-flag2012-12-27 20:30:03
452484ApplicationsnikoliUNCONFIRMED=media-video/mplayer2-2.0_p20120828 ABI=x32 - cpudetect.c:206: Error: invalid instruction suffix for2013-01-29 12:55:58
401559Ebuildsoli.huberUNCONFIRMEDwww-apps/joomla-2.5.0 version bump2012-04-23 21:29:49
412545DevelopmentolemarkusUNCONFIRMEDdev-php/phpmd 1.3.3 version bump2012-04-18 19:40:01
435762ApplicationsnirbheekUNCONFIRMEDnet-misc/networkmanager-0.9.6.0 disconnects shortly after establishing connection2012-10-26 23:03:17
429372EbuildsnirbheekUNCONFIRMEDdev-python/pypy-1.9-r1 FEATURES=sandbox - Fatal error during initialization: out of memory2012-08-02 11:53:03
424365EbuildsnirbheekUNCONFIRMEDdev-python/pypy-1.9-r1: AssertionError: must come from an argument to the function, got <-88;esp>2012-07-03 14:41:31
376201ApplicationsnirbheekUNCONFIRMEDx11-themes/murrine-themes-0.98.0: NOX theme shows "Murrine configuration option 'gradients' is no lo2011-08-27 23:06:28
457566LibrarynikoliUNCONFIRMEDmedia-libs/libechonest-2.0.3 version bump2013-02-15 15:35:23
410549ServernetmonUNCONFIRMEDnet-analyzer/ntop init.d script looks for ntop data at a hardcoded location2012-04-06 22:12:41
420473ApplicationsnetmonUNCONFIRMEDnet-analyzer/fail2ban-0.8.6 violates Date-Mailheader standards when using sendmail*-actions and havi2012-12-17 11:17:57
430428EbuildsnetmonUNCONFIRMEDnet-analyzer/ntop-5.0.1 version bump2013-01-11 16:41:42
386621ApplicationsnetmonUNCONFIRMEDnet-analyzer/metasploit SLOT correction request2012-03-26 03:21:46
374085ApplicationsnetmonUNCONFIRMEDnet-analyzer/tcptrace cross compilation fix2011-07-08 19:12:28
447902Ebuildsnet-proxyUNCONFIRMEDnet-proxy/dansguardian-2.12.0.3 version bump request2012-12-21 05:38:19
437970Servernet-proxyUNCONFIRMEDnet-proxy/http-replicator-3.0-r3 - ERROR: HttpClient 1 caught an exception in __getattr__: HttpClien2012-10-11 13:53:15
455816Librarynet-p2pUNCONFIRMEDnet-libs/gupnp-igd - src_prepare(): libgupnp-igd/Makefile.am:64: HAVE_INTROSPECTION does not appear 2013-02-06 13:54:26
389419Applicationsnet-proxyUNCONFIRMEDnet-proxy/ntlmaps - add multiple configuration support2011-11-03 15:39:17
383969Applicationsnet-proxyUNCONFIRMEDnet-proxy/tsocks manpage mentions TSOCKS_CONFFILE, but the program uses TSOCKS_CONF_FILE2011-10-13 01:17:57
445776Ebuildsnet-p2pUNCONFIRMEDnet-p2p/wire-1.1.3 version bump request2012-12-03 11:25:21
446186Applicationsnet-p2pUNCONFIRMEDnet-p2p/rtorrent-0.9.2: bad configure check prevents cross-compilation2012-12-06 05:03:19
427936Ebuildsnet-p2pUNCONFIRMEDmedia-libs/gupnp-dlna-0.6.6 USE=introspection - sandbox violation in /dev/dri/card0 by gst-plugin-sc2013-02-05 18:34:08
406685Ebuildsnet-p2pUNCONFIRMEDapp-arch/torrentzip-0.9 version bump request2012-12-30 07:20:56
388879Servernet-p2pUNCONFIRMEDnet-p2p/mldonkey-3.1.0: Exception setgid failed: Operation not permitted trying to set group_gid2011-11-21 00:31:52
445276Ebuildsnet-mailUNCONFIRMEDmail-client/alpine-2.10 - Version bump request.2013-01-22 08:16:27
445568Librarynet-mailUNCONFIRMEDmail-mta/postfix with dev-libs/cyrus-sasl-2.1.25-r3 - broken SASL authentication2012-12-20 12:06:09
424854Ebuildsnet-mailUNCONFIRMEDdev-libs/cyrus-2.1.25-r2: subversion lose support for SASL with DIGEST-MD5 after upgrade cyrus-sasl 2012-07-05 06:54:33
432706Applicationsnet-imUNCONFIRMEDnet-im/pidgin 2.10.6 XMMP/IRC accounts do not connect automatically, "waiting for network connection2012-08-28 09:58:27
435238Applicationsnet-imUNCONFIRMEDnet-im/pidgin does not detect network connection after upgrading to net-misc/networkmanager-0.9.4.0-2012-09-17 11:35:16
403459Applicationsnet-mailUNCONFIRMEDnet-mail/perdition-1.18 - options.h:42:14: error: conflicting types for ‘gdbm_version’2012-12-04 18:16:40
400609Unspecifiednet-mailUNCONFIRMEDnet-mail/perdition-1.18 - fails to build with errors because of a multi line macro in net-libs/vanes2012-12-04 18:16:40
387009Applicationsnet-mailUNCONFIRMEDnet-mail/fetchmail - modified initscript to allow multiple daemons AND inlined configuration2011-11-08 12:12:48
428486Ebuildsnet-ircUNCONFIRMEDnet-irc/ngircd-19.2 version bump2012-07-29 05:08:33
449526Applicationsnet-imUNCONFIRMEDnet-im/pidgin-2.10.6 fails to compile with USE="eds" and gnome-extra/evolution-data-server-3.62013-02-12 16:15:52
381051Ebuildsnet-imUNCONFIRMEDnet-im/ekg version bump to 1.8rc22012-05-04 04:26:34
399489Applicationsnet-imUNCONFIRMEDnet-im/pidgin XMPP/SASL authentication fail with >=dev-libs/cyrus-sasl-2.1.252012-02-07 20:53:55
409555Applicationsnet-imUNCONFIRMEDnet-im/gg-transport-2.2.4 segmentation fault in local_translate (str=0x34eb52fbcac "\203=\365\377\062012-12-16 14:28:04
453778Ebuildsnet-fsUNCONFIRMEDnet-fs/autofs - sandbox violation in `mount -s' touching /run/mount2013-02-16 13:20:27
445288Ebuildsnet-fsUNCONFIRMEDnet-fs/nfs-utils-1.2.7 version bump2013-01-03 16:19:34
448958Ebuildsnet-dialupUNCONFIRMEDnet-dialup/gtk-imonc description should say "GTK+ 2" not "GTK+-2"2012-12-28 14:39:28
406139Applicationsnet-dialupUNCONFIRMEDnet-dialup/ppp-2.4.5-r2: /etc/resolv.conf gets emptied upon connection re-negotiation.2012-04-06 22:11:33
430406DocumentationneddyseagoonUNCONFIRMEDTypo on Foundation_news.xml2012-08-08 06:43:21
451978ApplicationsnaotaUNCONFIRMEDmedia-video/v4l2loopback-0.6.2 - Version bump to support kernel 3.72013-01-14 22:49:56
455280ApplicationsmythtvUNCONFIRMEDmedia-tv/mythtv-0.25.2_p20120716: links upon pulseaudio even with USE=-pulseaudio2013-02-03 13:49:02
444054Servermysql-bugsUNCONFIRMEDdev-db/mysql-5.1.66 crashes in replication setup2012-11-21 11:39:44
442346Applicationsmysql-bugsUNCONFIRMEDdev-db/mysql-5.5.28 - InnoDB: Assertion failure in thread 140230384047936 in file trx0rseg.c line 332012-11-08 22:04:30
382283Ebuildsmysql-bugsUNCONFIRMEDMySQL C API missing handle_options and get_tty_password functions2012-08-15 14:25:50
383405Servermysql-bugsUNCONFIRMEDmod-auth-mysql: version bump and enhancements2012-11-27 20:00:29
416553Ebuildsmysql-bugsUNCONFIRMEDdev-db/mysql++ version bump 3.1.02013-02-14 15:02:05
371369Applicationsmysql-bugsUNCONFIRMEDmod-auth-mysql-4.3.9: LoadModule statement is wrong (with solution)2012-11-27 19:59:19
442322Ebuildsmysql-bugsUNCONFIRMEDdev-db/myodbc-5.1.6 - Build fails against dev-db/mysql-5.5.28 - error: too many arguments to functio2013-02-09 20:29:48
436978Applicationsmysql-bugsUNCONFIRMEDdev-db/mysql-5.6 version bump2013-02-07 05:41:47
444720GamesmvaUNCONFIRMED[gamerlay-overlay] games-emulation/vbam-1.8.0.1090 USE=link - .../work/vbam-1.8.0.1090/src/gba/GBALi2012-11-28 16:07:29
426814Servermr_bones_UNCONFIRMEDapp-admin/syslog-ng - default configuration should @include "scl.conf"2012-07-18 16:14:44
427700Ebuildsmr_bones_UNCONFIRMEDapp-misc/figlet-2.2.5 version bump2012-07-23 12:15:04
417947Applicationsmr_bones_UNCONFIRMEDapp-misc/figlet - bash completion fails with paths containing spaces2012-05-28 12:08:37
445044ApplicationsmozillaUNCONFIRMEDwww-client/firefox-10.0.6 - File collisions: /usr/bin/firefox and /usr/lib/firefox/plugins2012-11-30 02:43:00
442692ApplicationsmozillaUNCONFIRMEDwww-client/firefox-16.0.2 mail-client/thunderbird-16.0.1-r1 - comm-release/tbird/mozi - Segmentation2012-11-30 06:41:13
439260ApplicationsmozillaUNCONFIRMEDwww-client/firefox(-bin)-(15|16).0.1 segfaults a lot in different situations2012-11-12 06:10:38
427038ApplicationsmozillaUNCONFIRMEDthunderbird: useflag "crypt" use uncompatible version of enigmail or gnupgp2012-07-25 01:52:10
415705EbuildsmozillaUNCONFIRMEDdev-libs/nspr-4.9: native-nsinstall: cannot access nspr-config (error installations by cross compila2013-01-05 13:03:46
388647Eclasses and ProfilesmozillaUNCONFIRMEDmozextension.eclass: Add new function for installing extensions in new standard install location2012-05-23 18:22:51
382237ApplicationsmozillaUNCONFIRMEDwww-client/icecat-3.6.16-r3 inoperable remember ssl client certificate choice function2013-01-28 05:45:18
453204Librarymobile-phoneUNCONFIRMEDdev-libs/libvformat-1.13-r2: fix some API documentation errors2013-01-21 12:38:15
435674Applicationsmobile-phoneUNCONFIRMEDapp-mobilephone/gnome-phone-manager-0.68: phonemgr.c:47:2: error: too many arguments to function 'bl2012-12-18 08:29:47
417525Ebuildsmobile-phoneUNCONFIRMEDapp-mobilephone/dfu-util-0.7 version bump2013-01-25 02:12:45
377079ApplicationsmmokrejsUNCONFIRMEDsci-biology/GBrowse-2.39 fails to compile2011-08-02 20:22:32
391705Applicationsmobile-phoneUNCONFIRMEDapp-mobilephone/kannel-1.5.0 version bump2011-11-24 17:47:28
445055ApplicationsmlUNCONFIRMEDnet-misc/unison-2.40.102 version bump2012-11-28 15:44:46
458062Core systemmiskaUNCONFIRMEDsys-power/acpid-2.0.18 version bump2013-02-18 13:37:27
443958Server Problemmirror-adminUNCONFIRMEDrsync.nl.gentoo.org / 195.241.77.98 (tiscali) often reports "@ERROR: max connections (15) reached --2012-11-19 21:19:27
427536Core systemmipsUNCONFIRMEDMIPS Kernel has a Direct IO bug2012-10-21 00:59:15
394771Server Problemmirror-adminUNCONFIRMEDChanges to Gentoo Mirror of Star Studio, UESTC2012-07-02 08:20:51
411829Applicationsmirror-adminUNCONFIRMEDwww-apps/mirmon-2.5 version bump2012-04-24 16:58:27
428582ApplicationsmichaelUNCONFIRMEDnet-dns/djbdns-1.05-r26: djbdns-setup should source /etc/init.d/functions.sh2013-01-06 09:35:05
411521ApplicationsmgornyUNCONFIRMEDapp-arch/zpaq-4.04 execution attempt in: 2013-01-12 17:31:30
456110Applicationsmedia-videoUNCONFIRMED[multimedia overlay] mpv-9999 --disable-tv-bsdbt848 and --disable-radio-bsdbt848 does not exist anym2013-02-09 15:41:09
452482Applicationsmedia-videoUNCONFIRMEDmedia-video/libav-0.8.5 ABI=x32 - libavutil/x86/cpu.c:52: Error: invalid instruction suffix for `pus2013-02-03 00:43:50
451888Applicationsmedia-videoUNCONFIRMEDmedia-libs/mlt-0.8.2 - consumer_jack.o: In function `consumer_thread': consumer_jack.c:(.text+0x139e2013-01-15 12:21:47
449306Applicationsmedia-videoUNCONFIRMEDmedia-video/gaupol-0.21 version bump request2012-12-30 16:48:12
445962Applicationsmedia-videoUNCONFIRMEDmedia-video/dvdauthor-0.7.1 files contain writable and executable sections2012-12-04 19:02:06
442886Applicationsmedia-videoUNCONFIRMEDmedia-video/devede' - elog mentions "lame" for mplayer, but that flag isn't used in mplayer.2012-11-12 18:50:32
445544Applicationsmedia-videoUNCONFIRMEDmedia-video/dvdstyler-2.3.4 - Fails to generate iso, consider to hard-mask this version.2012-12-03 05:50:21
430564Applicationsmedia-videoUNCONFIRMEDmedia-video/devede - when converting mkv, devede passes an obsolete options to mencoder2012-08-09 23:46:58
406367GNOMEmedia-videoUNCONFIRMEDmedia-libs/libdvdnav: assertion in set_PTT() triggered (was: media-video/totem-3.2.1: Crashes when p2012-03-01 03:04:44
406735Applicationsmedia-videoUNCONFIRMEDmedia-video/vlc-2.0.0 - erratic audio volume behaviour under Gnome32012-09-19 13:09:42
412457Librarymedia-videoUNCONFIRMEDmedia-video/gpac-0.4.5-r4 - ld: wxOsmo4.o: in function wxCreateApp():wxOsmo4.cpp(.text+0x1c): error:2012-04-18 15:19:39
405173Applicationsmedia-videoUNCONFIRMEDmedia-video/vlc-2.0.0 - /bin/sh: line 4: 2215 Segmentation fault ./vlc-cache-gen ../modules2012-09-19 13:09:28
395387Librarymedia-videoUNCONFIRMEDmedia-libs/x264-0.0.20111218 - fatal: ambiguous argument 'origin/master': unknown revision or path n2012-02-04 20:00:18
384313Applicationsmedia-videoUNCONFIRMEDmedia-video/vlc vlc-cache-gen Segmentation fault on hardened system2012-09-19 13:08:49
383513Applicationsmedia-videoUNCONFIRMED>media-video/transcode-1.0.7 can handle only the first audio track when transcoding from media-video2011-12-06 10:16:57
413457Applicationsmedia-tvUNCONFIRMEDmedia-tv/dvbstreamer-2.1.0 version bump2012-04-29 13:11:46
388189Ebuildsmedia-tvUNCONFIRMEDVersion bump: media-tv/freevo-1.9.2b22011-10-23 11:53:46
454618Applicationsmedia-opticalUNCONFIRMEDapp-cdr/kcdemu-0.5.0 version bump2013-01-30 14:05:54
455790Applicationsmedia-opticalUNCONFIRMEDapp-cdr/pburn-3.7.14 version bump2013-02-06 13:41:07
413681ServermattmUNCONFIRMEDnet-misc/hylafaxplus - connection refused from another machine2012-05-01 22:55:07
457172Eclasses and ProfilesmaxUNCONFIRMEDssl-cert.eclass should use more secure defaults for crypto functions / keylengths2013-02-19 06:49:28
384199Ebuildsmedia-opticalUNCONFIRMEDapp-cdr/qpxtool new version2011-09-23 15:02:23
438530ApplicationsmaksbotanUNCONFIRMEDx11-wm/awesome-3.4.13 USE=gnome - add application file for gdu-notification-daemon2013-02-06 12:31:57
418343ApplicationsmarioUNCONFIRMEDapp-cdr/xfburn-0.4.3-r3 - /usr/share/applications/xfburn.desktop: file contains key "MimeType" in gr2012-05-31 14:59:11
458152Ebuildsmaintainer-wantedUNCONFIRMEDdev-db/odb-2.2.0 - C++ Object-Relational Mapping (ORM) implemented as a gcc plugin2013-02-19 22:42:42
455704Gamesmaintainer-wantedUNCONFIRMEDgames-util/desura - a digital distribution service for gamers2013-02-13 10:54:12
455706Gamesmaintainer-wantedUNCONFIRMEDgames-util/desurium - a digital distribution service for gamers, open source2013-02-13 10:53:54
454396Ebuildsmaintainer-wantedUNCONFIRMEDNew ebuild: gnome-extra/proxy_applet-0.2 - GNOME applet for changing network proxy configuration fro2013-01-28 08:58:55
453658Ebuildsmaintainer-wantedUNCONFIRMEDdev-util/jenkins - application that monitors executions of repeated jobs, such as building a softwar2013-01-30 11:30:11
453476Ebuildsmaintainer-wantedUNCONFIRMEDgameandwatch-0.3.ebuild - This is a generic engine for simulation of Game & Watch-like games2013-01-23 03:24:22
453348Ebuildsmaintainer-wantedUNCONFIRMEDdev-ada/zlib-ada-1.3 - a thick [Ada] binding to the popular compression/decompression library ZLib2013-02-18 20:21:56
453472Ebuildsmaintainer-wantedUNCONFIRMEDgames-emulation/handheld-quake-0.7.ebuild - Handheld Quake (aka HQ) is a simulator of soviet, russia2013-01-23 03:26:50
452850Ebuildsmaintainer-wantedUNCONFIRMEDwww-apps/snorby - Ruby on Rails application for network security monitoring2013-01-18 17:12:00
452800Ebuildsmaintainer-wantedUNCONFIRMEDapp-office/gnuaccounting - a Free Java cross-platform accounting and bookkeeping application2013-01-19 16:41:10
450912Ebuildsmaintainer-wantedUNCONFIRMEDsci-libs/pg2plplot - Assist the transition from PGPlot to PLplot in Fortran programs2013-01-08 17:10:27
450068Ebuildsmaintainer-wantedUNCONFIRMEDsys-apps/evemu - Tools and bindings for kernel input event device emulation, data capture and replay2013-01-03 23:06:27
449794Ebuildsmaintainer-wantedUNCONFIRMEDapp-emulation/tilem-2.0 - an emulator and debugger for Texas Instruments Z80-based graphing calculat2013-01-03 00:16:42
449478Ebuildsmaintainer-wantedUNCONFIRMEDdev-tex/mnsymbol - Mathematical symbol font for Adobe MinionPro2013-01-11 22:15:11
449476Ebuildsmaintainer-wantedUNCONFIRMEDdev-tex/fontaxes - Additional font axes for LaTeX2013-01-11 22:14:39
448400Librarymaintainer-wantedUNCONFIRMEDdev-php/PEAR-Image_Barcode2 - generate barcode representations of given strings2012-12-24 16:11:53
447920Ebuildsmaintainer-wantedUNCONFIRMEDnet-analyzer/check_mk - Nagios / Icinga general purpose plugin to retrieve data2013-01-11 16:04:32
446974Ebuildsmaintainer-wantedUNCONFIRMEDdev-libs/libpreludedb, app-admin/prelude-manager, net-analyzer/prewikka resurrection request2012-12-27 21:31:08
446194Ebuildsmaintainer-wantedUNCONFIRMEDdev-python/python-msrplib-0.15.0 - Client library for MSRP protocol and its relay extension (RFC 4972012-12-06 08:27:46
444756Developmentmaintainer-wantedUNCONFIRMEDdev-ruby/rails-api - Rails for API only applications2012-11-26 19:00:29
442516Ebuildsmaintainer-wantedUNCONFIRMEDnet-p2p/uhub-0.4.1 (New submission)2012-11-11 16:16:55
443456Ebuildsmaintainer-wantedUNCONFIRMEDNew ebuild: media-sound/oom an OpenOctave MIDI & audio sequencer2012-11-15 21:08:06
439754Ebuildsmaintainer-wantedUNCONFIRMEDsys-apps/inxi - A full featured system information script2012-11-19 17:19:20
439640Ebuildsmaintainer-wantedUNCONFIRMEDdev-python/twilio-3.4.1: Python bindings for twilio2012-10-26 16:10:05
438302Ebuildsmaintainer-wantedUNCONFIRMEDdev-db/mysql-mmm - Multi-Master Replication Manager for MySQL2012-10-15 11:04:50
438490Ebuildsmaintainer-wantedUNCONFIRMEDwww-plugins/mozilla-gnome-keyring-0.6.4 - A firefox extension that enables Gnome Keyring integration2012-10-15 18:59:37
439396Ebuildsmaintainer-wantedUNCONFIRMEDmedia-sound/postfish - The Postfish is a digital audio post-processing, restoration, filtering and m2012-10-26 06:43:41
439408Ebuildsmaintainer-wantedUNCONFIRMEDdev-db/rockmongo-1.1.5 - Web-based administration for Mongo database in PHP2013-02-07 14:35:09
437960Ebuildsmaintainer-wantedUNCONFIRMEDdev-libs/libdivecomputer-0.2.0 - Library for communication with dive computers from various manufact2012-10-11 13:48:40
436976Applicationsmaintainer-wantedUNCONFIRMEDnet-mail/geary - A lightweight email program designed around conversations and built for the GNOME d2012-10-08 16:10:46
436076Librarymaintainer-wantedUNCONFIRMEDmedia-plugins/ladspa-trigger: Audio trigger LADSPA plugin2012-09-24 11:22:18
436278Librarymaintainer-wantedUNCONFIRMEDnet-analyzer/nagios-afs-monitor - Nagios plugins to monitor openafs server status2012-09-26 13:37:17
436486Servermaintainer-wantedUNCONFIRMEDmail-mta/exim-p0f - p0f version 3 dlfunc library for Exim2012-09-28 16:07:34
435596Ebuildsmaintainer-wantedUNCONFIRMEDdev-ruby/rainbow - extension to ruby's String class adding support for colorizing text on ANSI termi2012-10-03 17:50:28
435712Ebuildsmaintainer-wantedUNCONFIRMEDnet-nntp/es-f-2.6.0 - web based HTML frontend for esniper, a lightweight console application for sni2013-01-23 03:27:50
434828Ebuildsmaintainer-wantedUNCONFIRMEDapp-editors/gedit-collaboration-9999 - GNOME Text Editor Collaboration Plugin2012-09-18 23:55:14
433864Ebuildsmaintainer-wantedUNCONFIRMEDapp-misc/format-junkie - a program that can convert your media files (audio files, videos and pictur2012-09-10 17:00:15
434728Applicationsmaintainer-wantedUNCONFIRMEDapp-text/calibre-bin - binary version of app-text/calibre2012-09-13 15:09:28
433786Ebuildsmaintainer-wantedUNCONFIRMEDmedia-fonts/opengostfont-0.3 - Open-source version of the fonts by Russian standard GOST 2.304-812012-09-04 09:14:50
432688Ebuildsmaintainer-wantedUNCONFIRMEDapp-shells/zsh-completions-0.6.0 - Additional completion definitions for Zsh2012-10-22 11:21:26
432292Ebuildsmaintainer-wantedUNCONFIRMEDmedia-gfx/iscan-plugin-(???) for Epson Perfection V2002013-02-19 10:47:20
431842Ebuildsmaintainer-wantedUNCONFIRMEDmedia-sound/lyvi - A simple command-line lyrics viewer for various audio players2012-08-18 16:10:35
431802Ebuildsmaintainer-wantedUNCONFIRMEDwww-apps/gitlab Project management and code hosting application written in ruby2013-01-23 04:07:24
431566Ebuildsmaintainer-wantedUNCONFIRMEDdev-tex/blahtexml - Blahtex and Blahtexml: Converting TeX equations into MathML2012-08-17 23:46:19
427746Ebuildsmaintainer-wantedUNCONFIRMEDdev-python/django-dajax-0.8.4 - Easy to use library to create asynchronous presentation logic with d2012-12-12 12:17:56
427754Ebuildsmaintainer-wantedUNCONFIRMEDdev-python/django-tinymce-1.5.1_beta2 - TinyMCE integration for Django2012-12-12 12:32:51
427762Ebuildsmaintainer-wantedUNCONFIRMEDNew: dev-python/django-grappelli-2.4.0 - A grid-based alternative/extension to the Django administra2012-07-24 14:52:05
427734Ebuildsmaintainer-wantedUNCONFIRMEDNew: dev-python/django-sekizai-0.4.2 - Django Template Blocks with extra functionality2012-12-12 11:51:41
427738Ebuildsmaintainer-wantedUNCONFIRMEDNew: dev-python/django-cms-2.3 - A Django application for managing hierarchical pages of content2012-12-12 12:04:20
426946Ebuildsmaintainer-wantedUNCONFIRMEDx11-wm/beshell - a simple desktop shell on KDE technology (namely KIO and Solid) for the rest of us2012-09-06 15:53:17
427162Ebuildsmaintainer-wantedUNCONFIRMEDdev-python/django-admin-tools-0.4.1 - a collection of tools for the django administration interface2012-12-12 12:25:24
425132Ebuildsmaintainer-wantedUNCONFIRMEDdev-db/riak - "the most powerful open-source, distributed database you'll ever put into production."2012-07-08 14:09:00
424003Ebuildsmaintainer-wantedUNCONFIRMED[science overlay] sci-physics/thepeg - Toolkit for High Energy Physics Event Generation2013-02-08 01:02:18
423867Ebuildsmaintainer-wantedUNCONFIRMEDdev-vcs/gync - Synchronize data of desktop applications with Git2012-09-27 07:19:07
419847Ebuildsmaintainer-wantedUNCONFIRMEDmedia-plugins/gst-editing-services - a high-level library for facilitating the creation of audio/vi2012-07-08 08:53:36
418211Ebuildsmaintainer-wantedUNCONFIRMEDsys-process/xjobs - reads job descriptions line by line and executes them in parallel2012-06-01 14:23:50
418285Ebuildsmaintainer-wantedUNCONFIRMEDmedia-libs/dcmtk - DCMTK - a collection of libraries and applications implementing large parts the D2012-05-30 18:44:00
419167Ebuildsmaintainer-wantedUNCONFIRMEDgames-rpg/bastion-20120529-r2 - an original action role-playing game set in a lush imaginative world2012-09-25 08:31:15
418403Ebuildsmaintainer-wantedUNCONFIRMEDapp-admin/puppet-dashboard - a web interface providing node classification and reporting features fo2012-10-09 03:21:48
417009Ebuildsmaintainer-wantedUNCONFIRMEDwww-misc/monitorix-2.5.2 version bump2012-05-22 06:37:42
417161Ebuildsmaintainer-wantedUNCONFIRMEDsys-fs/csvfs - file system representation of CSV data2012-06-10 03:48:18
415829Ebuildsmaintainer-wantedUNCONFIRMEDsci-chemistry/cclib-1.0.1 - Library for parsing and interpreting the results of computational chemis2012-05-15 15:01:01
412921Ebuildsmaintainer-wantedUNCONFIRMEDapp-text/peg-multimarkdown - An implementation of MultiMarkdown in C, using a PEG grammar2012-04-24 14:13:30
412041Ebuildsmaintainer-wantedUNCONFIRMEDmedia-sound/mudita24-1.0.3 - an application controlling the digital mixer, channel gains and other h2012-04-16 10:43:36
411895Ebuildsmaintainer-wantedUNCONFIRMEDapp-text/peg-markdown -- an implementation of John Gruber's markdown in C2012-06-30 09:24:16
411619Ebuildsmaintainer-wantedUNCONFIRMEDmedia-sound/rockbox-utility - Graphical utility for automating Rockbox firmware installation and man2012-11-07 20:02:26
410383Ebuildsmaintainer-wantedUNCONFIRMEDdev-cpp/cppcms - a Free C++ Web Development Framework aimed for Rapid Web Application Development2013-01-14 21:48:56
409869Ebuildsmaintainer-wantedUNCONFIRMEDapp-emulation/virtualbricks-0.6.352 - A GTK frontend for VDE and QEMU/KVM2012-12-08 17:33:25
408405Ebuildsmaintainer-wantedUNCONFIRMEDmedia-sound/nuvola_player - Nuvola Player - Cloud music integration for your Linux desktop2013-01-15 14:41:55
408221Ebuildsmaintainer-wantedUNCONFIRMEDdev-python/SquareMap-1.0.1_beta3: Hierarchic data-visualisation control for wxPython2012-03-15 01:15:37
408215Ebuildsmaintainer-wantedUNCONFIRMEDdev-util/line_profiler-1.0_beta3: Profile individual lines (not only function calls) of python sourc2012-03-15 01:28:00
408013Ebuildsmaintainer-wantedUNCONFIRMEDdev-python/netzob - Network protocol modelization by reverse engineering2012-05-09 15:21:42
406865Ebuildsmaintainer-wantedUNCONFIRMEDwww-servers/distcache - Distributed session caching2012-03-05 20:17:46
403913Gamesmaintainer-wantedUNCONFIRMEDgames-emulation/fs-uae - a multi-platform Amiga emulator based on WinUAE/E-UAE/PUAE, with a focus on2012-02-15 17:27:10
404273Ebuildsmaintainer-wantedUNCONFIRMEDx11-misc/dunst-9999 - (new ebuild) lightweight notification system with the looks of dmenu2012-07-02 10:02:30
405093Applicationsmaintainer-wantedUNCONFIRMEDmedia-gfx/macrofusion - GUI for Enfuse2012-10-24 12:33:35
405643Ebuildsmaintainer-wantedUNCONFIRMEDapp-misc/stackapplet-1.5.1 - a small application that uses the new AppIndicator framework to display2012-02-26 17:22:22
401409Ebuildsmaintainer-wantedUNCONFIRMEDsys-auth/oath-toolkit - Toolkit for using one-time password authentication with HOTP/TOTP algorithms2012-02-01 20:03:54
398491Ebuildsmaintainer-wantedUNCONFIRMEDmedia-sound/qloud-0.30 - Tool to measure loudspeaker frequency and step response, distortions' SPL a2012-01-11 17:10:33
398731Ebuildsmaintainer-wantedUNCONFIRMEDnet-analyzer/slowhttptest-1.3.ebuild Application Layer DoS attack simulator2012-01-13 14:35:35
398733Ebuildsmaintainer-wantedUNCONFIRMEDnet-fs/unfs3-0.9.22 A portable user-space implementation of the NFSv3 server specification2012-01-15 19:29:12
399339Applicationsmaintainer-wantedUNCONFIRMEDRequest for ebuild of Wii Backup Fusion2012-01-19 15:12:29
399199Ebuildsmaintainer-wantedUNCONFIRMEDmedia-sound/acoustid-fingerprinter - GUI application for submitting audio fingerprints to Acoustid2012-01-17 21:28:50
398487Ebuildsmaintainer-wantedUNCONFIRMEDmedia-sound/coquillo-1.9 - a metadata editor / tagger for various audio file formats2012-01-11 17:10:51
396543Ebuildsmaintainer-wantedUNCONFIRMEDEbuild for Cherrytree - A hierarchical note taking application2013-01-30 17:37:55
396071Applicationsmaintainer-wantedUNCONFIRMEDB2Uconverter: a libreoffice's extension for Vietnamese2011-12-26 23:54:30
396151Ebuildsmaintainer-wantedUNCONFIRMEDx11-misc/xinequery-0.3 - utility to view information regarding active Xinerama screens2012-01-06 21:16:00
393275Ebuildsmaintainer-wantedUNCONFIRMEDdev-php/phpqrcode-1.1.4 - Generate QR Code 2-dimensional barcode with PHP2011-12-05 20:22:15
391923Ebuildsmaintainer-wantedUNCONFIRMEDapp-office/charm-1.5.2 - Charm time tracking application2013-01-15 17:57:57
389707Developmentmaintainer-wantedUNCONFIRMEDoh-my-zsh: framework for managing your zsh configuration2011-11-08 03:31:32
390169Ebuildsmaintainer-wantedUNCONFIRMEDebuild for ADMB (Automatic Differentiation Model Builder) software suite2011-11-11 15:42:12
390391Ebuildsmaintainer-wantedUNCONFIRMEDx11-misc/pdf_presenter_console - a GTK based presentation viewer application2012-08-12 14:09:53
390415Ebuildsmaintainer-wantedUNCONFIRMEDmedia-gfx/iscan-plugin-perfection-gt-s630-0.1.1 for Epson Perfection V300 PHOTO2013-02-19 10:50:34
389673Ebuildsmaintainer-wantedUNCONFIRMEDmedia-sound/gsharkdown: Download and play audio files from the grooveshark.com service2011-11-08 20:53:53
389129Gamesmaintainer-wantedUNCONFIRMEDgames-action/voxatron - game set in a world completely made of tiny cubes that can be blasted to smi2012-06-03 22:42:56
389017Ebuildsmaintainer-wantedUNCONFIRMEDdev-python/acutil - Tool for setting up authentication from network services ( Python2 library )2011-11-01 15:34:30
389015Ebuildsmaintainer-wantedUNCONFIRMEDdev-libs/libpki - Provide an easy-to-use PKI library and tools for PKI enabled application developme2011-11-01 15:33:59
388903Ebuildsmaintainer-wantedUNCONFIRMED[science-overlay] dev-ml/zarith-1.1 - Arithmetic and logic operations over arbitrary-precision integ2012-08-04 16:25:32
388645Applicationsmaintainer-wantedUNCONFIRMEDapp-office/moneyguru - a personal finance management application2011-10-27 17:51:06
381563Librarymaintainer-wantedUNCONFIRMEDSISL - "The SINTEF Spline Library", a comprehensive NURBS library for the modeling and interrogation2011-10-07 01:01:21
377859Ebuildsmaintainer-wantedUNCONFIRMEDapp-misc/libspnav - A free, compatible alternative for 3Dconnexion's 3D input SDK2011-09-22 19:29:47
378843Ebuildsmaintainer-wantedUNCONFIRMED[Science overlay] omniORBpy version 3.6 ebuild2011-09-17 21:27:40
379429Ebuildsmaintainer-wantedUNCONFIRMEDnew ebuild for CProwl, a command-line utility to generate Prowl notifications2011-08-21 15:21:44
381487Ebuildsmaintainer-wantedUNCONFIRMEDdev-python/DerApproximator - A python module for numerical optimization2011-09-05 11:36:51
380021Ebuildsmaintainer-wantedUNCONFIRMEDNew ebuild: app-emulation/pearpc-0.52012-02-09 22:23:37
377137Ebuildsmaintainer-wantedUNCONFIRMEDNew Ebuild: net-im/poezio2011-07-31 16:42:35
377747Ebuildsmaintainer-wantedUNCONFIRMEDmedia-gfx/sK1 is an open-source illustration program2011-08-05 21:49:02
377831Ebuildsmaintainer-wantedUNCONFIRMEDsys-kernel/rtai-sources - Real Time Application Interface kernel sources2011-08-12 14:51:57
377811Ebuildsmaintainer-wantedUNCONFIRMEDGaalet - Geometric Algebra Library C++ (Expression Template)2011-08-13 16:40:09
375555Ebuildsmaintainer-wantedUNCONFIRMEDnew ebuild app-office/wxbanker (version 0.8.2)2011-07-22 12:04:17
374101Ebuildsmaintainer-wantedUNCONFIRMEDEbuild for gnome-shell-extensions-gpaste2012-02-03 11:05:41
373217Applicationsmaintainer-wantedUNCONFIRMEDmedia-sound/audacious-mplayer plugin: new package2012-02-03 02:38:51
371707Ebuildsmaintainer-wantedUNCONFIRMEDdev-libs/librets - a Real Estate Transaction Standard (RETS) client library2013-01-15 00:37:53
371457GNOMEmaintainer-wantedUNCONFIRMED[gnome overlay] Ebuild for unofficial gnome-shell-extensions2011-12-17 15:03:37
371373Ebuildsmaintainer-wantedUNCONFIRMEDapp-i18n/wordforge-0.8_rc1 - Offline translation and localization program working internally with XL2011-06-13 22:39:51
371165GNOMEmaintainer-wantedUNCONFIRMED[gnome overlay] Ebuild for gnome-shell-extensions-mediasplayers2011-12-17 15:02:38
370445GNOMEmaintainer-wantedUNCONFIRMED[gnome overlay] Ebuild for gnome-shell-extensions-weather applet2011-12-30 11:49:48
369399Ebuildsmaintainer-wantedUNCONFIRMEDgames-action/descent2-vertigo ebuild submission2012-09-15 02:57:38
368855Ebuildsmaintainer-wantedUNCONFIRMEDx11-plugins/gnome-shell-extensions-pidgin (new ebuild)2013-01-23 09:30:59
367429Ebuildsmaintainer-wantedUNCONFIRMEDmedia-sound/jackctlmmc-4 - JackCtlMMC is a slightly simpler command-line version of QJackMMC2011-05-17 11:44:37
368819Ebuildsmaintainer-wantedUNCONFIRMEDapp-emacs/sepia - perl+emacs integration (New Package)2011-06-08 06:30:23
366649Applicationsmaintainer-wantedUNCONFIRMEDCQRLOG - an advanced ham radio logger based on [the] Firebird database2011-05-12 21:53:26
367027Ebuildsmaintainer-wantedUNCONFIRMEDnet-analyzer/amun - Low-interaction honeypot, capture autonomous spreading malware in an automated f2012-03-08 02:09:36
457830Applicationsmaintainer-neededUNCONFIRMEDmedia-gfx/freecad-0.13 - Version bump.2013-02-17 09:29:20
457184Applicationsmaintainer-neededUNCONFIRMEDsys-fs/archfs - 1.0.0 version bump and rename to sys-fs/rdiff-backup-fs2013-02-14 04:32:11
455414Librarymaintainer-neededUNCONFIRMEDdev-libs/libmix-2.05-r6 with clang-3.2 - aes/saferp.c:22:8: error: redefinition of 'expf' as differe2013-02-05 12:13:40
454964Librarymaintainer-neededUNCONFIRMEDdev-libs/ucl-1.03-r1: RWX sections2013-02-01 12:21:53
438466Ebuildsmaintainer-neededUNCONFIRMEDsci-libs/opencascade-6.5.4 version bump2013-01-15 05:59:37
438622Ebuildsmaintainer-neededUNCONFIRMEDnet-wireless/broadcom-sta-6.20.55.19 version bump2013-02-07 12:05:08
437898Core systemmaintainer-neededUNCONFIRMEDnet-wireless/broadcom-sta-5.100.82.112-r2 with gentoo-sources-3.6.x - general protection fault in wl2013-02-03 13:08:44
437460Unspecifiedmaintainer-neededUNCONFIRMEDdev-libs/libaio-0.3.109-r3 USE=multilib - /usr/lib*/libaio.so: different ABIs have the same "OUTPUT_2013-01-27 02:19:44
433004Applicationsmaintainer-neededUNCONFIRMEDapp-office/mdbtools version upgrade 0.7 now on git2012-08-28 10:48:54
427030Applicationsmaintainer-neededUNCONFIRMEDnet-misc/sks version bump (and it should install an init.d script along with a uid/gid)2013-01-05 21:37:02
410033Core systemmaintainer-neededUNCONFIRMEDsys-power/cpufreqd crashes on AC transition or startup with ACPI battery support2012-11-18 12:15:37
409239Ebuildsmaintainer-neededUNCONFIRMEDapp-arch/ppmd-10.1_p4 version bump2012-04-24 09:03:00
408335Ebuildsmaintainer-neededUNCONFIRMEDapp-misc/ckermit-9.0.302 version bump2012-03-17 12:07:46
406255Sandboxmaintainer-neededUNCONFIRMEDdev-libs/apr-1.4.6 failed test: testlfs : \/bin/bash: line 2: 3428 Segmentation fault (core d2012-12-29 17:08:08
400623Ebuildsmaintainer-neededUNCONFIRMEDapp-text/ots-0.5.0: shared libraries don't have .so extension2012-03-04 10:37:54
385775Applicationsmaintainer-neededUNCONFIRMEDdev-libs/apr-util-1.3.11 cross compilation fix (libtool related)2013-01-01 20:20:51
381031Applicationsmaintainer-neededUNCONFIRMED[version bump] app-arch/rpm5-5.4.12012-07-26 08:04:22
378125Unspecifiedmaintainer-neededUNCONFIRMEDmedia-gfx/bootsplash-themes - Suggestion: per-resolution USE flags etc.2013-01-20 10:18:16
370761Ebuildsmaintainer-neededUNCONFIRMEDwww-apache/mod_auth_imap2 patch to fix compilation2013-01-04 14:14:29
405127UnspecifiedlxnayUNCONFIRMEDnet-nds/389-ds-base-1.2.10.0 version bump2012-10-02 20:26:41
415607ApplicationslxnayUNCONFIRMEDx11-apps/ardesia-1.0 version bump request2012-05-12 19:55:08
434812ApplicationslxdeUNCONFIRMEDlxde-base/lxdm-0.4.1-r5 - session selection not working2012-09-12 18:15:27
417239ApplicationslxdeUNCONFIRMEDIf LXDE session is running the kbd input on tty1 is broken (need to press keys twice)2012-06-14 13:17:06
451326Corelu_zeroUNCONFIRMEDapp-emulation/qemu-user-1.1.0-r1: "qemu: Unsupported syscall: 373" for epoll syscall inside arm chro2013-01-20 17:32:15
442672Ebuildslu_zeroUNCONFIRMEDapp-emulation/qemu-user-9999 - Invalid git source.2012-11-11 17:11:10
447626Applicationslu_zeroUNCONFIRMEDmedia-gfx/blender should not use environment variables to set installation directories2013-01-31 09:26:50
448152Applicationslu_zeroUNCONFIRMEDapp-emulation/qemu-user-1.0 should depend on sys-apps/usbredir[static-libs]2012-12-24 16:15:07
435088Core systemlu_zeroUNCONFIRMEDsys-libs/libspe2-2.3.0.138 - version bump / snapshot2012-09-16 14:41:39
433127Applicationslu_zeroUNCONFIRMEDmedia-video/lives-1.6.3 version bump2012-11-14 19:05:41
435086Core systemlu_zeroUNCONFIRMEDsys-apps/spu-tools-2.3.0.136 - version bump2012-09-16 14:40:23
432110Core systemlu_zeroUNCONFIRMEDsys-libs/libspe2-2.2.80_p95-r1 without dev-vcs/subversion - make: svnversion: Command not found2012-08-21 13:59:13
410631Applicationslu_zeroUNCONFIRMEDx11-drivers/ati-drivers-12.3 DMA bug with intel_iommu2012-05-04 15:26:08
423151Ebuildslu_zeroUNCONFIRMEDapp-emulation/qemu-user-1.1.0 requires python2 >= 2.42012-06-27 21:02:40
428716Ebuildslu_zeroUNCONFIRMEDapp-emulation/qemu-user-9999 - ?2012-07-30 22:56:27
391721Applicationslu_zeroUNCONFIRMEDapp-emulation/qemu-user-0.12.2 USE=static - lib64/libc.a(elf-init.o): In function `__libc_csu_irel':2012-01-16 15:48:56
365749Ebuildslu_zeroUNCONFIRMEDapp-emulation/bochs-2.4.5 unable to build in amd64 emulation on x86 platforms2011-05-10 21:14:05
380399ApplicationsljakabUNCONFIRMEDnet-misc/vpnc-0.5.3: couldn't set up connection to remote server ...2013-02-07 15:22:30
442418ApplicationslehoUNCONFIRMEDmedia-tv/tvheadend-3.2.18 version bump2013-02-15 12:16:40
441888ApplicationslehoUNCONFIRMEDmedia-tv/tvheadend-3.2 usage of xmltv is mysterious2012-11-05 17:16:09
438702Core systemldap-bugsUNCONFIRMEDsys-auth/nss_ldap-265 encodes wrong libc version in library name if compiling for $ROOT2012-10-17 13:23:33
454874Developmentlang-miscUNCONFIRMEDdev-lang/tcc-0.9.26_pre1 - access violation in install tcc-doc.info /usr/share/info2013-02-04 05:50:10
416641Ebuildslang-miscUNCONFIRMEDdev-lang/fpc-2.6.0 configuration files contain paths with ${D}2012-05-21 03:37:35
376519Ebuildslang-miscUNCONFIRMEDdev-lang/dmd-2.054 version bump2011-09-19 08:24:26
399619EbuildslackUNCONFIRMEDx11-plugins/gkrellstock-0.5.1 version bump2012-01-22 15:05:17
410371ApplicationslackUNCONFIRMEDwww-plugins/adobe-flash-11.2.202.228 segmentation fault in mozalloc_abort(char const*) () from /usr/2012-12-15 19:35:06
416161EbuildslackUNCONFIRMEDx11-misc/nts-82 version bump request2012-05-16 03:08:43
417701Ebuildsl33tmmxUNCONFIRMEDmedia-sound/a2jmidid-7 version bump2012-12-18 11:47:01
442822Ebuildskernel-miscUNCONFIRMEDdev-libs/klibc-2.0.2 version bump2012-11-12 12:23:59
445110Eclasses and Profileskernel-miscUNCONFIRMEDkernel-2.eclass v1.277 - Default DESCRIPTION incorrectly built.2012-11-28 23:37:02
436442Eclasses and Profileskernel-miscUNCONFIRMEDkernel-2.eclass - Offer a mean to install the kernel distribution under a tunable directory name2012-09-28 14:34:11
438730Core systemkernel-miscUNCONFIRMEDSandbox violations when emerging kernel modules from /etc/kernel/postinst.d hook against a kernel bu2012-11-05 03:29:40
438734Eclasses and Profileskernel-miscUNCONFIRMEDlinux-mod.eclass - KERNEL_DIR/KBUILD_OUTPUT version mismatch is not detected, KERNEL_DIR is not infe2012-10-18 07:40:38
402967Applicationskernel-miscUNCONFIRMEDsys-fs/fuse-2.8.7 - ld.gold: error: symbol fuse_new has undefined version2012-12-25 21:39:12
410923Core systemkernel-miscUNCONFIRMEDsys-kernel/module-rebuild - command line options are consistent (should be "module-rebuild --action"2012-04-06 14:44:25
390293Unspecifiedkernel-miscUNCONFIRMED[enhancement] sys-fs/sshfs-fuse: Improve remote permissions when files and directories are created2011-11-15 00:36:35
458384Core systemkernelUNCONFIRMEDsys-kernel/gentoo-sources 3.5.7.6 version bump?2013-02-20 02:12:47
377049Eclasses and Profileskernel-miscUNCONFIRMEDlinux-mod.eclass should warn of bad permission into ${KV_OUT_DIR}2011-08-02 13:51:54
455880Core systemkernelUNCONFIRMEDCONFIG_DEVTMPFS default value in kernel configuration (gentoo-sources and potentially others)2013-02-17 19:40:19
456118Core systemkernelUNCONFIRMEDsys-kernel/gentoo-sources-3.7.4 - memory exhaustion in AS firmware//lib/firmware/.gen.o2013-02-12 03:36:33
445222Core systemkernelUNCONFIRMEDsys-kernel/vanilla-sources uli526x module incompatible with GART_IOMMU2012-12-11 12:37:18
439546Core systemkernelUNCONFIRMEDRace condition between writeback vs fallocate in ext4 extents code2012-10-25 03:59:20
457742EbuildskdeUNCONFIRMEDmedia-libs/phonon-vlc-0.6.2 version bump request2013-02-15 19:14:23
455338KDEkdeUNCONFIRMEDmedia-libs/phonon-gstreamer-4.6.3 version bump2013-02-05 11:25:08
453088ApplicationskdeUNCONFIRMEDmedia-sound/amarok-2.7.0: sandbox access violation2013-02-14 11:48:25
455218KDEkdeUNCONFIRMEDx11-themes/oxygen-gtk-1.3.2.1:2 x11-themes/oxygen-gtk-1.1.2:3 version bump request2013-02-15 12:45:02
442912KDEkdeUNCONFIRMEDkde-misc/kio-upnp-ms-1.0.0_p20110602 works only if the debug IUSE flag is set2012-11-12 20:02:48
449296KDEkdeUNCONFIRMEDnet-im/ktp-call-ui-0.5.1: gsttaglist.h:152:28: error: conflicting declaration ‘typedef struct _GstTa2013-01-18 10:50:15
406063KDEkdeUNCONFIRMEDkde-base/kmail-4.7.4-r1: clamav integration may crash kmail2012-03-03 23:00:18
456100ApplicationsjwzUNCONFIRMEDx11-misc/xscreensaver-5.21 version bump2013-02-07 22:36:30
453644Core systemjsbronderUNCONFIRMEDsys-cluster/torque-2.5.12 - qstat-qstat.o: In function `tcl_run': qstat.c:(.text+0x1ac5): undefined 2013-02-06 16:34:18
414623Core systemjsbronderUNCONFIRMEDsys-cluster/torque-4.0.1 version bump2012-05-04 21:38:17
373923LibraryjsbronderUNCONFIRMEDsys-cluster/openmpi-1.5.3-r1: mpirun hangs or fails with Segmentation faults2012-02-06 19:20:57
385297GamesjokerUNCONFIRMEDgames-emulation/mupen64plus-9999 live ebuild / prep for 2.02012-06-25 09:16:03
409867EbuildsjmbsvicettoUNCONFIRMEDnet-misc/vde-2.3.2 version bump including Python support2012-06-08 13:16:39
434610ApplicationsjlecUNCONFIRMEDgnome-extra/zeitgeist-datahub-0.9.5 version bump2012-09-11 14:22:09
417661ApplicationsjlecUNCONFIRMEDgnome-extra/zeitgeist-datasources[bzr] dev-vcs/bzr-gtk file collision: /usr/share/pixmaps/bzr-icon-62012-05-28 00:01:10
405089ApplicationsjlecUNCONFIRMEDapp-arch/p7zip-9.13 - ../../../Windows/Control/Controls.cpp:492:53: error: invalid conversion from '2012-05-30 19:43:20
387567ApplicationsjlecUNCONFIRMEDx11-terms/terminator-0.96: Segmentation fault when starting2011-10-24 05:16:07
455086ApplicationsjerUNCONFIRMEDnet-misc/chrony-1.27 - Version bump2013-02-02 08:13:18
456832ApplicationsjerUNCONFIRMEDnet-misc/putty and net-misc/pssh - File collision: /usr/bin/pscp2013-02-11 19:20:34
381333ApplicationsjerUNCONFIRMEDx11-terms/rxvt-unicode feature request (disable underline and cursor behaviour)2012-02-26 18:39:51
456718LibraryjdhoreUNCONFIRMEDmedia-plugins/audacious-plugins-3.3.4 is incompatible with media-video/libav, fails during configure2013-02-11 17:14:50
403605ApplicationsjdhoreUNCONFIRMEDmedia-plugins/audacious-plugins-3.2 doesn't honor LINGUAS for locale files2012-02-23 21:52:28
403621ApplicationsjdhoreUNCONFIRMEDmedia-sound/audacious-3.2 doesn't honor LINGUAS for locale files2012-02-23 21:38:44
458264JavajavaUNCONFIRMEDdev-java/sablecc-3.7 version bump2013-02-19 15:22:14
382211LibraryjdhoreUNCONFIRMEDdev-libs/libmcs-0.7.2 - ld: mcs_getconfval.o: relocation R_X86_64_32 against `.rodata.str1.1' can no2012-02-03 06:39:29
453804JavajavaUNCONFIRMEDCreate ebuilds for jdk 8 (early access release), a current Java 8 partial implementation2013-01-24 12:02:05
442804JavajavaUNCONFIRMEDdev-java/jgoodies-forms-{1.5.1,1.6.0} version bump2013-01-20 18:41:59
450298JavajavaUNCONFIRMEDdev-lang/scala-2.10.0 version bump2013-02-14 01:32:57
440636JavajavaUNCONFIRMEDdev-java/icedtea-web-1.3-r7: IcedTea-Web-Plugin displays garbage after version number in www-client/2012-10-31 17:38:32
440994JavajavaUNCONFIRMEDdev-java/xmlgraphics-commons-1.5 version bump2012-11-03 20:31:14
434222JavajavaUNCONFIRMEDdev-java/ant-ivy-2.0.0 compilation failed2012-09-07 15:04:44
435256JavajavaUNCONFIRMEDdev-java/xml-security-1.5.2 (aka apache santuario) version bump2012-09-16 20:18:33
435764JavajavaUNCONFIRMEDdev-java/wss4j-1.6.7 version bump request2012-09-21 18:44:27
435808JavajavaUNCONFIRMEDdev-java/opensaml-2.5.3 version bump request2012-09-22 06:45:45
430432JavajavaUNCONFIRMED[java-overlay overlay] dev-util/eclipse-sdk-bin-4.2.0 - segmentation fault in: C [libgobject-2.0.so2012-08-26 15:50:14
430054JavajavaUNCONFIRMEDdev-java/pdfbox-1.7 version bump2013-01-17 07:48:53
430184JavajavaUNCONFIRMEDdev-java/jansi and dev-java/jansi-native: Version bump (+ new dependency)2012-08-06 14:27:16
430062JavajavaUNCONFIRMEDdev-java/glazedlists-1.8 version bump2012-08-05 19:29:55
428340JavajavaUNCONFIRMEDVersion Bump: dev-java/jsr250-1.12012-07-27 16:31:44
427932JavajavaUNCONFIRMED[java-overlay] dev-java/j3d-core-1.5.1: compile phase fails with image resolution errors2012-07-24 19:35:50
426380JavajavaUNCONFIRMEDdev-java/cglib-{2.2.2,3.0} version bump request2012-08-18 14:17:39
426382JavajavaUNCONFIRMEDdev-java/nekohtml-1.9.16 version bump2012-08-07 21:02:08
426294JavajavaUNCONFIRMEDnet-nds/jxplorer-3.3 - version bump request2013-01-28 15:25:13
421077JavajavaUNCONFIRMEDdev-java/icedtea-7.2.2 compilation fails with Unrecognised option: -XX:-PrintVMOptions2012-10-18 16:15:26
421223JavajavaUNCONFIRMEDdev-java/gnu-classpath should make installing /usr/gnu-classpath-*/bin scripts optional2012-06-15 11:06:00
421503JavajavaUNCONFIRMEDdev-java/groovy-{1.8.8,2.0.6,2.1.0} version bump request2013-01-29 00:25:12
405715JavajavaUNCONFIRMEDjava eclass improved documentation2012-02-25 09:32:02
390399JavajavaUNCONFIRMEDicedtea-bin-1.10.4 always redownloads web start application2011-12-05 12:55:11
385467DevelopmentjavaUNCONFIRMEDdev-util/eclipse-sdk-4.2 version bump2013-02-04 12:41:26
380493JavajavaUNCONFIRMEDdev-java/saxon-9.1.0.8 version bump2012-02-16 10:02:58
373105ApplicationsjavaUNCONFIRMEDdev-util/eclipse-sdk-3.5.1-r1 GLib, Gtk, Gdk assertions fail2013-02-04 12:40:26
368377JavajavaUNCONFIRMEDjava-config should support JNI related native config options and ld.so.conf pathes2012-04-04 14:19:10
368205JavajavaUNCONFIRMEDjava-vm-2.eclass:pkg_prerm could mention eselect java-vm instead.2012-12-30 15:53:24
423681Ebuildsin-gentooUNCONFIRMEDmail-client/nmh 1.5 version bump2012-06-27 02:39:38
447628Applicationsidl0rUNCONFIRMEDmedia-plugins/vdr-imonlcd-1.0.0 version bump2012-12-17 18:54:12
445760Applicationsidl0rUNCONFIRMEDmedia-plugins/vdr-xineliboutput-9999 CVS-Server: Connection reset by peer2012-12-04 15:07:50
430316Ebuildsidl0rUNCONFIRMEDFeature request: Add a check for sane folder/file permission in net-dns/bind2012-08-07 16:19:51
377599Applicationsidl0rUNCONFIRMEDVersion bump: media-plugins/vdr-xineliboutput-1.0.72012-11-13 16:04:32
403473Applicationsidl0rUNCONFIRMEDmedia-plugins/vdr-xineliboutput-1.0.5-r1 - xine_post_audiochannel.c:97:7: error: ‘post_audio_port_t’2012-09-27 15:47:31
410053Applicationsidella4UNCONFIRMEDapp-emulation/xen-tools-4.1.2-r2 init script throws: option 'a' not supported2012-06-08 07:16:47
420067Ebuildsidella4UNCONFIRMEDapp-emulation/xen-tools init script for baselayout 22012-07-03 18:30:16
426872Serveridella4UNCONFIRMEDapp-emulation/xen-tools-4.1* - disable HPET broadcast2012-08-13 09:47:39
454354Applicationsidella4UNCONFIRMEDapp-emulation/xen-tools-4.2.1 - Fails to compile with KeyError: '.text.asm.out/../src/smp.c.68'2013-02-01 21:20:22
458160Applicationsidella4UNCONFIRMEDapp-emulation/xen-4.2.0-r1 - x86_64-pc-linux-gnu-ld: unrecognized option '--subsystem=10'2013-02-21 12:48:18
453566ApplicationshwoarangUNCONFIRMEDmedia-sound/lastfmplayer 2.1.30 version bump2013-02-11 11:46:14
451172Eclasses and ProfileshattyaUNCONFIRMEDsubversion eclass passes --ignore-externals to "svn info"2013-01-11 15:45:08
455498ApplicationshaubiUNCONFIRMEDdev-db/tora-2.1.4 version bump2013-02-21 10:45:19
447614Ebuildshd_brummyUNCONFIRMEDapp-misc/iguanaIR-1.0.3 version bump2012-12-17 18:53:44
456770Libraryhd_brummyUNCONFIRMEDmedia-libs/FusionSound-1.1.1-r1 - core_sound.c:328:6: error: too few arguments to function 'fusion_o2013-02-11 14:57:06
397587ApplicationshollowUNCONFIRMEDwww-servers/nginx - add Naxsi web application firewall support2013-02-21 09:09:26
401397ServerhollowUNCONFIRMEDwww-servers/nginx: add automatic minification module (jitify)2012-11-26 08:02:58
446934Eclasses and ProfileshattyaUNCONFIRMEDsubversion.eclass v1.83 drops local checkout if svn client fails (on transport errors)2012-12-12 01:48:29
454476ApplicationshasufellUNCONFIRMEDnet-misc/badvpn-1.999.127 version bump2013-01-29 13:32:19
456386DevelopmenthaskellUNCONFIRMEDdev-lang/ghc-7.6.2 - Segmentation fault [libraries/haskell98/dist-install/build/Prelude.o] & others 2013-02-14 10:41:34
457714DevelopmenthaskellUNCONFIRMED=dev-haskell/cabal-1.14.0 has invalid dependency specifications.2013-02-15 16:29:54
457780Keywording and StabilizationhaskellUNCONFIRMEDstabilization request dev-lang/ghc-7.4.22013-02-16 21:14:28
421623DevelopmenthaskellUNCONFIRMEDdev-lang/ghc-7.4.1-r1: unable to compile with portage because it results in a segmentation fault.2012-06-19 16:29:37
456970Applicationshardened-kernelUNCONFIRMEDapp-editors/emacs-24.2 failed to emerge with a segmentation fault on hardened-sources-3.7.4-r12013-02-12 22:17:52
457708Core systemhardened-kernelUNCONFIRMEDapp-emulation/virtualbox-4.{1.22,2.6}-r1 on sys-kernel/hardened-sources - Can't start virtual machin2013-02-16 21:53:53
457662HardenedhardenedUNCONFIRMEDFusion MPT base driver 3.04.20 on SAS1064ET very slow boot2013-02-15 06:40:34
401669Core systemhardened-kernelUNCONFIRMEDsys-kernel/hardened-sources-2.6.32-r89: Compilation broken on ia642012-02-27 01:07:20
417409Core systemhardened-kernelUNCONFIRMEDsys-kernel/hardened-sources-3.2.11 - beam: page allocation failure: order:1, mode:0x20 or swapper: p2012-05-28 10:16:10
447682Core systemhardened-kernelUNCONFIRMEDsys-kernel/hardened-sources-3.7.0 on ia64 - drivers/built-in.o: In function `show_yoffset': bgrt.c:(2012-12-19 09:12:02
450776HardenedhardenedUNCONFIRMEDapp-emulation/wine-1.5.21 - configure: checking for -lGL... ./conftest: error while loading shared l2013-02-11 21:23:57
452828HardenedhardenedUNCONFIRMEDsys-apps/util-linux-2.21.2 - dmesg: *** glibc detected *** dmesg: double free or corruption (!prev):2013-01-18 16:31:50
437732HardenedhardenedUNCONFIRMEDmedia-video/ffmpeg-0.10.3 can't install ffmpeg due to grsec restrictions2012-10-09 14:52:20
443782HardenedhardenedUNCONFIRMEDapp-misc/cdrpager all versions buffer overflow2012-11-18 14:01:21
428682HardenedhardenedUNCONFIRMEDSystem.map has an incorrect kernel version reported when grsec enabled2012-08-03 15:29:25
416415HardenedhardenedUNCONFIRMEDsys-apps/v86d-0.1.10 fails to read EBDA with GRKERNSEC_KMEM=y on some configurations2012-06-11 17:44:30
400951HardenedhardenedUNCONFIRMEDJava does not run properly on non-root with Grsecurity Hardened Gentoo [workstation] level2012-01-26 19:28:36
401667EbuildshardenedUNCONFIRMEDnet-libs/libproxy-0.4.7 - Segmentation fault /usr/bin/gmcs /nologo /target:library /out:/var/tmp/por2012-02-03 21:57:47
391839HardenedhardenedUNCONFIRMEDcompiling external module which is using file_operations fails2011-11-25 08:09:59
443648ApplicationshannoUNCONFIRMEDapp-emulation/dosemu-1.4.1_pre20091009 hangs2012-11-17 18:49:41
436102EbuildshannoUNCONFIRMEDnet-analyzer/greenbone-security-desktop-1.2.2: version bump2012-09-24 22:50:20
438316ApplicationshannoUNCONFIRMEDsci-geosciences/viking-1.3.2.1 version bump2012-10-15 04:31:21
430422ApplicationshannoUNCONFIRMEDapp-emulation/dosemu-1.4.1_pre20091009 : svga USE flag is not handled properly2012-08-08 09:56:45
428724Core systemhannoUNCONFIRMEDsys-auth/pam_mount-2.13: man: invalid option -- 'l', ERROR: ld.so: object 'libsandbox.so' from LD_PR2012-07-31 00:10:12
429778ApplicationshannoUNCONFIRMEDapp-emulation/dosemu-1.4.1_pre20091009 should depend on media-libs/libsdl2012-08-04 09:42:48
419841ApplicationshannoUNCONFIRMEDsci-geosciences/merkaartor-0.17.2 - In member function 'virtual void QGPSDDevice::run()': GPS/qgpsde2012-06-08 15:52:51
422727ApplicationshannoUNCONFIRMEDapp-emulation/dosemu-1.4.1_pre20091009 - exits with SIGILL2012-06-21 15:43:13
416587LibraryhannoUNCONFIRMEDmedia-libs/gegl-0.2.0: fails to compile with USE="introspection"2012-11-17 12:46:15
411275EbuildshannoUNCONFIRMEDnet-im/python-otr-1.0.0_beta6 version bump2012-10-27 11:06:09
414697EbuildshannoUNCONFIRMEDnet-analyzer/greenbone-security-assistant-3.0.3 version bump2012-10-10 19:39:05
402379EbuildshannoUNCONFIRMEDnet-analyzer/openvas-* version bumps2013-02-17 13:47:30
409943EbuildshannoUNCONFIRMEDmail-mta/courier installs esmtpd with bad permissions2012-06-28 11:34:17
399687ApplicationshannoUNCONFIRMEDSVGs exported by app-office/libreoffice cause segmentation fault in media-gfx/gimp-2.6.11-r52012-01-23 09:36:24
394417ApplicationshannoUNCONFIRMEDmail-mta/courier - wrong ownership/permissions on /etc/courier/ldapaliasrc2012-09-27 07:54:34
392261UnspecifiedhannoUNCONFIRMEDapp-emulation/dosemu -fno-pic causes build failure when using hardened compiler with PIE2012-12-23 17:38:30
387147Core systemhannoUNCONFIRMEDsys-auth/pam_mount-2.12: running xfce4-session-logout eats all memory2013-01-08 13:37:30
373847ApplicationshannoUNCONFIRMEDmedia-gfx/gimp-2.6.11-r1: crash on startup with error GLib-WARNING ignoring no-arg, optional-arg or 2011-10-22 18:15:20
448576LibrarygurligebisUNCONFIRMEDdev-php/ZendFramework-2.0.6 version bump2012-12-26 11:47:26
431522ApplicationsgstreamerUNCONFIRMEDmedia-video/flumotion: fails to build with python3* as system interpreter2012-12-28 00:22:54
371869UnspecifiedgstreamerUNCONFIRMEDgst-plugins-bad-0.10.21: Regression in playback of avi with multiple ac3 audio tracks2011-10-22 06:53:58
391381ApplicationsgstreamerUNCONFIRMEDmedia-video/flumotion-0.10.0 version bump2012-10-01 15:17:35
457632ApplicationsgrobianUNCONFIRMEDmail-client/mutt: Occasional segfault in set_buffystats at sidebar.c:3432013-02-15 15:46:57
384311ApplicationsgregkhUNCONFIRMEDnet-misc/bti add patch to allow compilation on non-GNU systems2012-09-23 09:36:41
456990LibrarygraphicsUNCONFIRMEDmedia-libs/lensfun-0.2.7 version bump2013-02-12 21:58:13
457080EbuildsgraphicsUNCONFIRMEDmedia-gfx/cellwriter-1.3.5 - version bump request and please move it to app-accessibility/2013-02-13 18:34:41
448900LibrarygraphicsUNCONFIRMEDmedia-libs/gexiv2-0.5.0 version bump request2012-12-28 14:52:07
440960ApplicationsgraphicsUNCONFIRMEDmedia-gfx/wings crashes at startup with incorrect version of erl_driver.h2012-11-02 17:02:33
422643ApplicationsgraphicsUNCONFIRMEDmedia-gfx/graphviz-2.28.0 sci-biology/phrap-1.080812 - file collision in /usr/bin/cluster2012-06-21 14:28:59
387373ApplicationsgraphicsUNCONFIRMEDmedia-gfx/imagemagick-6.7.1.0 segmentation fault if not enough space in /tmp2011-10-21 07:30:54
385897ApplicationsgraphicsUNCONFIRMEDmedia-gfx/enblend-4.0 fails compilation with use="+image-cache"2011-10-07 00:52:55
386019ApplicationsgraphicsUNCONFIRMEDmedia-gfx/openclipart-2.3 version bump2012-06-19 16:44:15
383239EbuildsgraphicsUNCONFIRMEDmedia-gfx/wings-1.4.1 version bump2011-09-16 21:42:53
403085ApplicationsgpeUNCONFIRMEDVersion bump for x11-misc/xoo-0.82012-05-12 23:10:02
312935EbuildsgraphicsUNCONFIRMEDmedia-gfx/ufraw: Optionalize more dependencies and improve metadata.xml2011-10-09 07:35:16
393335Javagnu_andrewUNCONFIRMEDdev-java/icedtea-7.2.0-r3 - segmentation fault in /var/tmp/portage/dev-java/icedtea-7.2.0-r3/work/ic2011-12-25 05:58:41
408153ApplicationsgnustepUNCONFIRMED[gnustep overlay] gnustep-apps/sogo-1.3.14 and 2.0.0rc1 version bumps2012-11-22 15:43:06
410727ApplicationsgnustepUNCONFIRMEDgnustep-base/gnustep-back-xlib-0.18.0 - sandbox violation in /root/var by plmerge libgnustep-back-012012-05-02 06:36:52
448874Applicationsgnome-officeUNCONFIRMEDapp-office/glabels-3.0.1: /usr/include/evolution-data-server-3.6/libebook/e-contact.h:10:2: error: #2013-02-16 20:05:55
456748Keywording and StabilizationgnomeUNCONFIRMED=www-client/epiphany-extensions-3.6.0 keyword request2013-02-11 11:36:03
458068GNOMEgnomeUNCONFIRMEDx11-themes/gnome-themes-standard: narrow scrollbars might violate accessibility regulation2013-02-19 06:38:31
443950Ebuildsgnome-mmUNCONFIRMEDdev-cpp/cairomm-1.10.0 USE="doc" installs documentation outside /usr/share/doc/$PF2012-11-19 20:31:56
449274GNOMEgnomeUNCONFIRMEDnet-im/empathy-3.6.2-r2 main menu doesn't function properly2012-12-30 13:23:21
449656GNOMEgnomeUNCONFIRMEDgnome-base/gnome-session-3.6.2: No .xsession-errors2013-01-12 10:19:26
449688GNOMEgnomeUNCONFIRMEDgnome-extra/libgda-5.1.1 ingoring introspection flag2013-01-01 20:43:41
450748GNOMEgnomeUNCONFIRMEDSegmentation fault with media-sound/rhythmbox-2.972013-01-07 21:31:17
448964GNOMEgnomeUNCONFIRMEDgnome-extra/bug-buddy-2.32.0-r2 eds build fails with gnome-extra/evolution-data-server-3.62012-12-27 23:11:40
448566GNOMEgnomeUNCONFIRMEDmedia-sound/rhythmbox should RDEPEND on media-plugins/gst-plugins-gio2012-12-25 18:04:00
448890DevelopmentgnomeUNCONFIRMEDgnome-extra/evolution-webcal-2.32.0 : Only should be included directly2013-02-03 08:52:56
448892DevelopmentgnomeUNCONFIRMEDdev-python/evolution-python-2.32.0 : Only should be included directly2013-01-10 17:31:37
445864GNOMEgnomeUNCONFIRMED[gnome-overlay] gnome-extra/gnome-clock: 0.1.5 version bump2012-12-03 20:58:07
445840GNOMEgnomeUNCONFIRMED[gnome-overlay] gnome-base/nautilus: 3.7.2 version bump2012-12-03 19:18:41
439964GNOMEgnomeUNCONFIRMED[gnome-overlay] app-text/evince: 3.7.1 version bump2012-10-28 16:08:13
439246ApplicationsgnomeUNCONFIRMEDmedia-gfx/gthumb-3.0.0 - segmentation fault in strlen(""), called from g_str_has_prefix at gstrfuncs2012-11-19 23:40:51
438560EbuildsgnomeUNCONFIRMEDmedia-sound/rhythmbox-2.98 version bump2013-01-12 11:04:35
433706GNOMEgnomeUNCONFIRMEDGnome 3.4 Exiting games change desktop resolution2012-09-02 18:54:50
426676GNOMEgnomeUNCONFIRMEDmail-client/evolution-2.32.3-r1 deleted whole directory with calendars2012-07-21 12:09:48
378931GNOMEgnomeUNCONFIRMEDmail-client/evolution-2.32.3: Changes in Account Editor windows cannot be submitted because of the d2012-03-05 08:17:37
398419New DocumentationgnomeUNCONFIRMEDPlease provide documentation for using pam_ldap.so in combination with sys-auth/pambase[gnome-keyrin2012-07-08 23:26:02
403281GNOMEgnomeUNCONFIRMEDmail-client/evolution-3.2.3: crash if I search the messages in 'Current Account'2012-02-17 18:56:33
422695GNOMEgnomeUNCONFIRMEDmail-client/evolution-3.2.3-r1 fails to compile with USE flag clutter2012-06-20 19:07:36
422909ApplicationsgnomeUNCONFIRMEDmail-client/evolution-3.2.3-r1 lost configuration information - (evolution:11395): evolution-network2012-06-23 07:38:20
423993GNOMEgnomeUNCONFIRMEDgnome-base/gnome-keyring: unable to create a new keyring due general protection2013-02-01 20:57:07
455796genkernelgenkernelUNCONFIRMEDDetect version of building kernel from CALLBACK2013-02-06 05:53:05
366147Ebuildsgentoo-perlUNCONFIRMEDdev-perl/Fuse version bump request2011-05-06 21:14:01
453742genkernelgenkernelUNCONFIRMEDgenkernel 3.4.24_p2 cannot build UVC driver for USB webcam - In function `usbvision_write_reg_irq': 2013-01-28 04:52:09
455266genkernelgenkernelUNCONFIRMED=sys-kernel/genkernel-3.4.45 inoperable --disklabel option2013-02-05 11:27:40
452746genkernelgenkernelUNCONFIRMEDgenkernel(8) ramdisk options text2013-01-17 22:52:13
446916genkernelgenkernelUNCONFIRMEDsys-kernel/genkernel-3.4.45 produces bad volume names with --dmraid option2012-12-12 01:41:14
447100genkernelgenkernelUNCONFIRMEDsys-kernel/genkernel should have an option to avoid firmware installation at all2013-02-17 11:31:29
439214genkernelgenkernelUNCONFIRMEDsys-kernel/genkernel-3.4.44.2 and sys-fs/mdadm-3.2.3-r2; no auto-detection even with mdadm.conf?2013-01-04 19:27:33
435358genkernelgenkernelUNCONFIRMEDProvide better semantics for oldconfig, add some new kernel configuration options2012-09-17 20:26:30
426338genkernelgenkernelUNCONFIRMEDgenkernel 3.4.24_p2: missing separator between old and new kernel version2012-12-03 20:03:30
395095genkernelgenkernelUNCONFIRMEDgenkernel add support for custom location of boot config file2011-12-17 22:26:49
457888GamesgamesUNCONFIRMEDgames-simulation/bcs-demo: broken link in description2013-02-16 21:03:10
457904GamesgamesUNCONFIRMEDgames-strategy/freecraft: broken link in description of package2013-02-19 03:24:45
455538GamesgamesUNCONFIRMEDgames-strategy/x2 broken link in description2013-02-20 23:59:09
436600GamesgamesUNCONFIRMEDgames-simulation/fgrun-1.6.0 fails to find dev-games/openscenegraph libs during linking2012-11-08 21:11:12
437894GamesgamesUNCONFIRMEDgames-emulation/virtualjaguar-1.0.7 -> 2.0.2 ebuild submission2013-02-10 05:05:50
441876GamesgamesUNCONFIRMEDgames-emulation/gens patch for amd642012-11-26 11:09:37
447842GamesgamesUNCONFIRMEDgames-roguelike/adom-1.2.0_pre3 version bump - Ebuild included2012-12-19 21:19:26
429286GamesgamesUNCONFIRMEDMouse behavior in games-fps/quake2-icculus is inverted in both x and y axis.2012-08-01 00:20:46
434148GamesgamesUNCONFIRMEDgames-sports/vdrift version bump 2012-07-222012-12-20 19:10:16
435092GamesgamesUNCONFIRMEDgames-fps/quake2-data update - support expansion packs2012-09-15 04:21:45
435830GamesgamesUNCONFIRMEDgames-action/psychonauts - new ebuild2013-01-20 23:18:02
436140GamesgamesUNCONFIRMEDgames-action/descent3 - updated ebuild to support installation from GOG package2012-09-24 22:54:46
424321GamesgamesUNCONFIRMEDgames-emulation/hatari-1.6.2 version bump2012-10-06 07:31:47
421309GamesgamesUNCONFIRMEDgames-emulation/jpcsp-bin - new ebuild2012-06-16 23:31:27
419557GamesgamesUNCONFIRMEDgames-action/cortex-command-0.25 new ebuild2012-06-06 20:46:34
419491GamesgamesUNCONFIRMEDgames-action/trackballs-1.1.4: play game and crash2013-01-31 19:46:11
419055GamesgamesUNCONFIRMEDgames-emulation:mednafen-0.9.21 does not compile2012-06-01 20:48:36
416211Keywording and StabilizationgamesUNCONFIRMEDPlease stabilize app-emulation/vice-2.3 for PPC2012-05-16 11:36:08
415913GamesgamesUNCONFIRMEDgames-sports/speed-dreams new version 2.0 available - please update2013-01-28 08:07:00
413743EbuildsgamesUNCONFIRMEDapp-emulation/vice: Add a USE-flag for the SDL-UI2012-04-27 15:56:03
410527GamesgamesUNCONFIRMEDgames-board/scid-vs-pc-4.7 - A free chess database application2012-05-12 10:28:17
411099GamesgamesUNCONFIRMEDgames-simulation/tpt_merbo-1.0 - A mod of The Powder Toy, a particle simulator2012-04-07 15:00:08
406621GamesgamesUNCONFIRMEDgames-board/pioneers better with optional deps2012-03-05 12:53:20
399867GamesgamesUNCONFIRMEDnew ebuilds: games-action/minetest games-action/minetest_game2013-02-20 16:12:41
395389GamesgamesUNCONFIRMEDgames-puzzle/cuyo-2.1.2: version bump2011-12-20 18:55:36
396545GamesgamesUNCONFIRMEDgames-action/supermeatboy - Super Meat Boy (new ebuild)2012-06-19 19:22:13
395309GamesgamesUNCONFIRMEDgames-emulation/dosbox: Only use "alsa" USE flag for MIDI2011-12-19 21:39:22
394849GamesgamesUNCONFIRMEDgames-action/shank - A side scrolling beat 'em up with a comic book art style2012-09-23 17:44:45
394625GamesgamesUNCONFIRMEDgames-action/cavestory+ (new ebuild)2013-01-03 05:34:18
383319GamesgamesUNCONFIRMEDgames-fps/ezquake-bin: version bump (-> 2.1)2011-09-17 09:39:58
383321GamesgamesUNCONFIRMEDgames-fps/doom3-mitm: please add additional map2011-09-17 09:54:51
385873GamesgamesUNCONFIRMEDgames-action/survivor: new game, ebuilds provided (1.0.1, 9999)2012-04-30 19:22:26
387061GamesgamesUNCONFIRMEDVersion bump games-roguelike/tome-4.0.0b32 and correct HOMEPAGE in ebuild2013-01-07 17:31:33
380887GamesgamesUNCONFIRMEDgames-emulation/ssnes (plus libsnes) - SNES emulator based on bsnes (new ebuild)2012-09-04 21:28:30
379729EbuildsgamesUNCONFIRMEDgames-action/shadowgrounds: new game, ebuilds provided (1.0.1, 9999)2012-02-01 15:26:15
377321EbuildsgamesUNCONFIRMEDgames-action/hammerfight - New package2012-06-06 20:44:34
375237GamesgamesUNCONFIRMEDgames-strategy/netpanzer-0.8.4: version bump request2012-01-24 03:19:29
377139GamesgamesUNCONFIRMEDgames-action/shadowgrounds[-survivor]-bin update2011-07-31 06:07:45
369397GamesgamesUNCONFIRMEDgames-action/descent2-data ebuild update2012-09-21 03:30:51
370045GamesgamesUNCONFIRMEDgames-action/gct (new package) - a GTA 2 clone2012-04-30 19:23:48
372413GamesgamesUNCONFIRMEDImproved ebuild for games-action/transcend, also fixing sound on amd642012-12-14 06:03:39
367263GamesgamesUNCONFIRMEDgames-mud/kildclient-2.11.0 version bump2011-05-14 17:35:04
367787GamesgamesUNCONFIRMEDrevenge-of-the-titans-1.80.12 doesn't support humble bundle installation files.2012-12-27 10:32:12
375183GamesgamesUNCONFIRMEDgames-strategy/freecnc-20041219: version bump request2011-07-14 15:27:59
438900GNOMEfreedesktop-bugsUNCONFIRMEDmedia-libs/libopenraw-0.0.9 - segmentation faults in OpenRaw::IO::MemStream::read (crashes gnome-bas2012-10-19 17:18:13
442052Applicationsfreedesktop-bugsUNCONFIRMEDsys-power/pm-utils-1.4.1-r2 uses deprecated kernel option CONFIG_WIRELESS_EXT_SYSFS2012-11-06 16:06:47
408091Core systemfreedesktop-bugsUNCONFIRMEDsys-power/pm-utils-1.4.1-r2: Add logrotate configuration2012-03-14 04:08:11
385741Applicationsfreedesktop-bugsUNCONFIRMEDsys-power/pm-utils-1.4.1-r2: delay upon starting xsession resulting in harddrive error2011-10-14 00:25:12
431106Forumsforum-modsUNCONFIRMEDForum Comfirmation Email Includes Plaintext Password2012-08-12 17:14:30
407725ApplicationsforensicsUNCONFIRMEDapp-forensics/chkrootkit-0.49 -n option does not recognize nfs4 mounts2012-03-13 10:15:38
442852Applicationsford_prefectUNCONFIRMEDmedia-sound/pulseaudio: keeps dir /var/run/pulse2012-12-30 21:51:58
447694Applicationsford_prefectUNCONFIRMEDmedia-sound/pulseaudio-2.99.3 USE=-system-wide - * Starting D-BUS system messagebus ... Unknown user2013-01-30 07:04:04
455818Applicationsford_prefectUNCONFIRMEDmedia-sound/pulseaudio USE=xen should depend on app-emulation/xen-tools not app-emulation/xen2013-02-06 13:55:31
441624KDEford_prefectUNCONFIRMEDmedia-sound/pulseaudio-2.1-r1: KDE freezes when using pulseaudio.2012-11-16 17:53:45
428116Ebuildsford_prefectUNCONFIRMEDmedia-sound/pulseaudio should RDEPEND on gnome-extra/gnome-media2013-02-02 08:13:37
430056Applicationsford_prefectUNCONFIRMEDmedia-sound/pulseaudio-1.1-r1 USE=lirc does not build lirc module2012-08-05 22:53:00
440508Applicationsford_prefectUNCONFIRMEDmedia-sound/pulseaudio-1.1-r1: some elog messages should only be shown for the first install.2012-12-07 20:08:23
437906Ebuildsford_prefectUNCONFIRMEDmedia-sound/pulseaudio build log not verbose2012-10-11 07:50:34
436506GNOMEford_prefectUNCONFIRMEDmedia-sound/pulseaudio-2.1-r1: does not die after logout2012-09-28 18:42:51
430854GNOMEford_prefectUNCONFIRMEDmedia-sound/pulseaudio-2.1: won't store volume level on gnome 3.2012-08-27 21:33:07
427266Applicationsford_prefectUNCONFIRMEDmedia-sound/pulseaudio - When playing Flash plugin based video in browsers, .xsession-errors fills u2012-12-15 13:05:18
394875Applicationsford_prefectUNCONFIRMEDmedia-sound/pulseaudio - module-tunnel-sink is unreliable2012-12-15 12:50:15
410663Applicationsford_prefectUNCONFIRMEDmedia-sound/pulseaudio - without "flat-volumes = no" in daemon.conf pulseaudio doesn't restore mixer2012-04-04 07:10:48
448926EbuildsfontsUNCONFIRMEDmedia-libs/freetype needs a local description of bindist USE-flag2012-12-27 20:19:55
436158LibraryfontsUNCONFIRMEDmedia-fonts/lohit-fonts-20120607 version bump2012-09-25 05:17:02
431430LibraryfontsUNCONFIRMEDmedia-fonts/libertine-ttf-5.3.0.20120702 version bump2013-01-01 22:02:26
433157LibraryfontsUNCONFIRMEDmedia-libs/freetype-2.4.10-r1 USE=infinality causes segmentation faults running x11-wm/openbox in _f2012-10-17 12:10:36
429922ApplicationsfontsUNCONFIRMEDmedia-gfx/fontforge-20120731 version bump2012-09-22 19:07:17
423001EbuildsfontsUNCONFIRMEDmedia-fonts/ricty-3.2.0 version bump2012-06-23 14:13:21
420901EbuildsfontsUNCONFIRMEDmedia-fonts/vlgothic-20120610 version bump2012-12-27 08:49:43
406891ApplicationsfontsUNCONFIRMEDmedia-libs/freetype-1.4_pre20080316-r2 compile failure: make[2]: execvp: ../libtool: Permission deni2012-03-05 20:19:14
454802DevelopmentflameeyesUNCONFIRMEDdev-utils/google-perftools-2.0-r1 ARMv6 does not imply 'dmb' instruction availability but it is used2013-02-02 00:14:37
453330ApplicationsflameeyesUNCONFIRMEDnet-proxy/squidclamav-6.10: redirection on virus detection does not work2013-01-21 20:20:05
405565Core systemflameeyesUNCONFIRMEDapp-emulation/lxc - init script affects other init scripts2012-10-02 07:38:11
409189EbuildsflameeyesUNCONFIRMEDapp-emulation/lxc-0.8.0_rc2-r1 : add {pre,post}{up,down} capabilities to init script [patch]2012-10-02 07:36:42
414535EbuildsflameeyesUNCONFIRMEDapp-emulation/lxc should support doc use flag2013-01-12 02:20:44
449720Core systemferringbUNCONFIRMEDsys-apps/pkgcore-0.8.6: SyntaxError during compilation of Python modules for Python 3.22013-01-02 10:12:25
420495ApplicationsfauliUNCONFIRMEDapp-portage/g-ctan should provide explicit database update options2012-06-11 11:20:54
453540ApplicationsevermindUNCONFIRMED[pro-audio overlay] media-sound/jack-audio-connection-kit-1.9.9.5: TypeError: 'list' object is not c2013-02-09 17:14:49
368251EbuildsevermindUNCONFIRMED[pro-audio overlay] media-libs/armstrong-9999 ebuild needs updating: distutils.eclass2011-05-23 08:42:25
411367EbuildsevermindUNCONFIRMED[pro-audio overlay] media-sound/glashctl-0.4.[2|3] - lashserverinterface.cpp: In constructor 'LASHSe2012-04-11 01:40:34
438778EbuildsevermindUNCONFIRMED[pro-audio overlay] media-sound/non-things - git structure change causing configure fail and eutils 2012-10-25 13:48:06
427428ApplicationsenlightenmentUNCONFIRMED[enlightenment overlay] x11-wm/enlightenment-9999 now optionally depends on elementary2012-12-22 20:35:54
435752LibraryenlightenmentUNCONFIRMEDmedia-libs/evas-9999 - configure: WARNING: unrecognized options: --enable-software-sdl2012-09-21 16:55:35
458350LibraryemacsUNCONFIRMEDapp-emacs/sml-mode-6.3 version bump2013-02-19 20:27:12
407099Project-specific documentationembeddedUNCONFIRMEDIncorrect mount options and binfmt_misc mask for "Compiling with qemu-user chroot" secion2012-03-06 17:22:43
408505Installation HandbookembeddedUNCONFIRMEDqemu-user chroot information is outdated2012-03-27 08:13:11
448962EbuildselvanorUNCONFIRMEDx11-libs/hippo-canvas description should say "GTK+ 2" not "GTK+-2"2012-12-28 14:40:54
417003ApplicationselvanorUNCONFIRMEDnet-voip/sflphone can be build without pulseaudio2012-11-15 01:07:54
445328DevelopmentdotnetUNCONFIRMEDdev-dotnet/glib-sharp-2.12.10 - libtool: Version mismatch error. This is libtool 2.4.2, but the libt2012-11-30 12:34:52
458494Keywording and StabilizationdotnetUNCONFIRMEDmedia-sound/banshee-2.6.0 stabilization request2013-02-20 21:52:39
381073EbuildselvanorUNCONFIRMEDversion bump net-print/xerox-drivers2012-10-09 13:57:57
406425EbuildselvanorUNCONFIRMEDmedia-gfx/iscan-plugin-gt-f720-0.1.1 version bump2012-08-22 11:59:30
406503EbuildselvanorUNCONFIRMEDapp-office/openerp-server-6.0.3 version bump2012-03-02 17:28:05
443970ApplicationsdotnetUNCONFIRMEDmedia-plugins/banshee-community-extensions-2.4.0 - mirage-extension causes crashes2012-11-24 16:26:22
439618DevelopmentdotnetUNCONFIRMEDdev-lang/mono-3 version bump2013-02-16 23:15:04
372453EbuildsdotnetUNCONFIRMEDapp-portage/eclass-manpages - Documentation for mono.eclass is awfull (one line)2011-06-29 10:17:45
404263EbuildsdotnetUNCONFIRMEDdev-lang/mono-2.10.5: remove MAKEOPTS=-j1 limitation2012-02-19 11:00:47
457748Other documentsdocs-teamUNCONFIRMEDdistcc guide has an invalid distcc-config option2013-02-15 19:40:51
453362[RU]docs-teamUNCONFIRMEDTranslations in Jan 20132013-01-21 15:58:54
454368Otherdocs-teamUNCONFIRMED[fa] handbook/hb-net-functions.xml2013-01-28 03:07:00
455164[RU]docs-teamUNCONFIRMEDHPPA Handbook translation2013-02-02 16:03:46
455874Installation Handbookdocs-teamUNCONFIRMEDminor typo in code listing 2.1 (ru translation)2013-02-06 16:33:17
456020Other documentsdocs-teamUNCONFIRMEDdon't suggest CORRECT_ALL option in zsh guide2013-02-07 14:25:52
456988Other documentsdocs-teamUNCONFIRMEDrsync doc: multiple guides, ambiguity on which version for FAQ2013-02-12 20:03:28
451846Installation Handbookdocs-teamUNCONFIRMEDwireless-tools no longer function with default installation2013-01-20 16:04:16
451040[DE]docs-teamUNCONFIRMEDConflict with english translation "Anacron exits"2013-01-09 12:11:06
445626Installation Handbookdocs-teamUNCONFIRMEDSwap amount in handbook needs a discussion2012-12-02 15:31:04
445186Installation Handbookdocs-teamUNCONFIRMEDA link to the online list of local USE flags is missing in the installation handbook2012-11-29 12:18:57
437542Other documentsdocs-teamUNCONFIRMEDSuggestion for using speaker-test instead of relying on an audio player in the ALSA guide2012-10-29 19:09:04
432824Other documentsdocs-teamUNCONFIRMEDLVM2 Documentation should explain "lvcreate --target RAID1" vs "--mirrors"2012-08-26 11:19:31
385601Other documentsdocs-teamUNCONFIRMEDVirtual Mail Howto: MySQL Script Varies From Instructions2012-07-08 23:24:50
392743Other documentsdocs-teamUNCONFIRMEDImplicit assumptions -> confusion when trying to use printer on a Win7 machine2011-12-29 01:31:50
368399Other documentsdocs-teamUNCONFIRMEDnvidia guide suggestions2011-05-22 22:09:25
377179[FR]docs-teamUNCONFIRMEDUpdate need on the French documentation of Xen2012-07-21 15:05:04
382121Otherdocs-teamUNCONFIRMEDThe Suggestion of the new Korean translation for the related documentation2011-09-07 07:25:44
451996ApplicationsdjcUNCONFIRMEDdev-vcs/hgsubversion-1.4: compilation failure with Python 2.52013-01-15 12:37:58
445083ApplicationsdjcUNCONFIRMEDdev-vcs/mercurial-2.1.1 src_test(): ...: Permission denied2012-12-16 14:33:53
450022ServerdjcUNCONFIRMEDwww-apache/mod_wsgi lacks a way to specify which python version to use2013-01-05 17:09:38
456094Ebuildsdev-zeroUNCONFIRMEDnet-misc/aria2-1.16.3 - version bump request2013-02-07 20:55:51
384941DevmanualdevmanualUNCONFIRMEDdevmanual does not mention that there are recursive versions of the do* install functions2013-01-19 10:18:09
451472DevmanualdevmanualUNCONFIRMEDdevmanual should have a better explanation of keepdir & dodir usage2013-01-15 21:04:19
454900Developmentdev-zeroUNCONFIRMEDdev-php/libvirt-php-0.4.7 version bump and patches2013-02-04 09:50:47
448316Ebuildsdev-zeroUNCONFIRMEDapp-emulation/spice: error BadMatch request X_SetInputFocus2012-12-25 16:38:18
445966Ebuildsdev-zeroUNCONFIRMEDnet-wireless/blueman should unconditionally depend on x11-themes/gnome-icon-theme?2012-12-04 22:59:24
441908Applicationsdev-zeroUNCONFIRMEDapp-emulation/spice-vdagent - add USE=selinux2012-11-05 18:59:35
437624Developmentdev-zeroUNCONFIRMED=dev-php/libvirt-php-0.4.6: too few arguments to function ‘set_error’2012-11-08 01:34:50
448626Developmentdev-toolsUNCONFIRMEDdev-util/findbugs-2.0.2 version bump2012-12-26 03:10:32
449918Documentationdev-portageUNCONFIRMEDcollision message says what *not* to do, but not what *to* do2013-01-03 03:09:45
452172Unclassifieddev-portageUNCONFIRMEDemerge's --jobs does not do full parallelization due to PDEPEND circular dependencies2013-01-15 11:55:26
456270Enhancement/Feature Requestsdev-portageUNCONFIRMEDExpand portage acceptable version specifiers2013-02-18 04:33:36
428474Enhancement/Feature Requestsdev-portageUNCONFIRMEDPrint a warning after merge with wrong permissions on existing file2012-07-28 22:34:46
430132Core - Dependenciesdev-portageUNCONFIRMEDVersioned virtuals cause slot conflict when weak block dependencies could resolve with uninstall2012-08-08 07:44:32
437494Core - Interface (emerge)dev-portageUNCONFIRMEDProvide a parameter for emerge so that 'emerge -pv' can display package description along with other2012-10-08 19:09:40
442056Enhancement/Feature Requestsdev-portageUNCONFIRMEDAdditional checks for sanity of user-supplied *FLAGS variables in make.conf2012-11-06 16:12:29
424870Enhancement/Feature Requestsdev-portageUNCONFIRMEDsys-*/ upgrade notification in Portage2012-09-04 05:42:54
405783Documentationdev-portageUNCONFIRMEDemerge man page inadequate for -n option2012-02-27 00:24:38
407351Core - Dependenciesdev-portageUNCONFIRMEDDependency resolver should automatically pull an older version to resolve circular dependency2012-12-25 21:12:16
416907Core systemdev-portageUNCONFIRMEDOption to remove orphaned dependencies when using emerge -C2012-12-25 21:12:35
417597Repomandev-portageUNCONFIRMEDsys-apps/portage: repoman: Improve description of {P,R}DEPEND.suspect (rename .suspect to .blacklist2012-05-26 11:26:14
402647Enhancement/Feature Requestsdev-portageUNCONFIRMEDsys-apps/portage emerge utility add layman sync functionality2012-02-09 06:29:42
401503Enhancement/Feature Requestsdev-portageUNCONFIRMEDemerge please ad short option to autounmask-write, -w suggested2012-01-30 17:48:55
394419Enhancement/Feature Requestsdev-portageUNCONFIRMEDportage: provide a make.conf option for changing to cgroups (configuring them if needed) on package 2011-12-19 18:43:41
388267Conceptual/Abstract Ideasdev-portageUNCONFIRMEDpropagation of USE flags to virtuals2011-10-26 03:35:36
367479Enhancement/Feature Requestsdev-portageUNCONFIRMEDemerge fetch function should be mirror-selective depending on ebuild location2012-12-07 05:07:03
371447Core - Configurationdev-portageUNCONFIRMEDportage-2.2.0_alpha40 :: emerge ignores wget bind_address option2011-06-16 09:56:45
426360Ebuildsdev-embeddedUNCONFIRMEDdev-embedded/sgpp-lite-arm-eabi-bin-2012.03.56 version bump2012-07-16 17:54:18
443154Ebuildsdesktop-wmUNCONFIRMEDx11-wm/pekwm-0.1.15 - Doesn't create xsession attributes, new revision for the ebuild proposed.2013-01-24 16:59:23
389533Applicationsdesktop-wmUNCONFIRMEDx11-wm/icewm-1.3.7 - src_test(): iceview.cc:480:38: error: no matching function for call to ‘TextVie2012-07-05 11:48:34
406491Applicationsdesktop-wmUNCONFIRMEDx11-wm/oroborus-2.0.20 - menus in Qt applications do not appear2012-03-02 17:24:18
447198Applicationsdesktop-miscUNCONFIRMEDx11-misc/rss-glx - helios does not blank screen2013-02-07 15:52:07
444564Applicationsdesktop-miscUNCONFIRMEDapp-misc/geoclue-0.12.99 should conditionally depend on dev-util/gtk-doc only if USE=doc2012-11-24 15:53:43
442484LibrarycppUNCONFIRMEDdev-libs/boost-1.49.0-r2: Segmentation fault during install phase.2012-11-12 12:00:11
443140EbuildscppUNCONFIRMEDdev-cpp/gccxml-0.9.0_pre20121114 version bump2012-11-14 21:10:19
447782LibrarycppUNCONFIRMEDdev-libs/boost-1.52.0-r5 - .../temp/environment: line 964: 31328 Segmentation fault b2 "$@"2012-12-19 13:37:44
407783Ebuildscorvus-gentooUNCONFIRMEDsys-fs/safecopy version bump to 1.72012-03-18 10:43:13
448468Ebuildscommon-lispUNCONFIRMEDdev-lisp/asdf-2.26 by default builds documentation, requires tex2012-12-25 09:39:37
435740Developmentcommon-lispUNCONFIRMEDdev-lisp/asdf-binary-locations - uninstall should clean up /etc/gentoo-init.lisp2012-09-21 16:42:43
421513Ebuildscommon-lispUNCONFIRMEDdev-lisp/asdf-2.24 version bump request2012-09-08 23:37:14
404423Unspecifiedcommon-lispUNCONFIRMEDdev-lisp/ecls-12.2.1 fails to run tests - An error occurred during initialization: Module error: Don2013-02-02 10:15:50
389783Ebuildscommon-lispUNCONFIRMEDdev-lisp/clozurecl-1.7 fails to build (unquoted SVN_REVISION in generated compiler commands)2011-11-08 19:59:04
455584ServerclusterUNCONFIRMEDsys-cluster/ceph-0.56.3 version bump2013-02-19 16:46:44
453274Core systemclusterUNCONFIRMEDsys-block/lio-utils snapshot request2013-01-21 12:29:12
436218EbuildsclusterUNCONFIRMEDnet-misc/pssh with dev-lang/python-3.2 - pssh --help: ImportError: No module named version2013-01-04 06:31:50
412767Core systemclusterUNCONFIRMEDsys-block/lio-utils-9999 - python_pkg_setup() not called2012-06-18 20:39:15
414793Core systemclusterUNCONFIRMEDsys-cluster/maui-3.3.1-r2 - ERROR: cannot setpgrp, errno: 1 (Operation not permitted)2012-08-06 03:49:46
417501ApplicationsclusterUNCONFIRMEDsys-block/tgt-1.0.24-r1: missing RDEPEND on dev-libs/libaio2012-05-25 17:52:51
405437ServerclusterUNCONFIRMEDsys-cluster/maui-3.3.1-r2 should CONFIG_PROTECT its configuration files2012-05-05 21:12:02
405277ServerclusterUNCONFIRMEDsys-cluster/maui-3.3.1-r2 build time secret key configuration2012-05-05 21:15:46
400771EbuildsclusterUNCONFIRMEDsys-cluster/onesis-2.0.3 version bump2012-01-25 19:13:16
434138ApplicationscjkUNCONFIRMEDapp-i18n/scim-1.4.14 breaks x11-wm/windowmaker's root window mouse actions2012-09-14 15:30:36
448658ApplicationscjkUNCONFIRMEDapp-i18n/nabi-0.99.11 version bump2012-12-26 23:42:29
449166ApplicationscjkUNCONFIRMEDapp-i18n/ibus-table-1.4.99 version bump2013-02-12 09:54:43
458528ApplicationscjkUNCONFIRMEDapp-emacs/navi2ch - DESCRIPTION improvement2013-02-21 03:10:32
416865EbuildschutzpahUNCONFIRMEDmail-filter/spamassassin-fuzzyocr-3.6.0-r2 various patches2013-01-21 18:15:37
442122EbuildschutzpahUNCONFIRMEDwww-plugins/mozplugger-1.14.6 version bump2013-02-21 08:37:18
412165EbuildschutzpahUNCONFIRMEDnet-mail/courier-imap-4.10.0 version bump2012-12-17 18:47:08
389511EbuildschutzpahUNCONFIRMEDnet-mailcourier-imap-4.9.3 version bump2011-12-06 23:34:54
384031ApplicationschutzpahUNCONFIRMEDnet-analyzer/pchar[pcap] fails to build (possibly glibc version related)2012-08-20 03:39:32
458394ApplicationschromiumUNCONFIRMEDwww-client/chromium-26.0.1410.5 audio skipping2013-02-20 03:20:40
384617EbuildschainsawUNCONFIRMEDapp-emulation/dynamips fails to compile (w/ can't find a register in class 'GENERAL_REGS')2011-10-31 10:29:49
426486ApplicationschithanhUNCONFIRMEDopenoffice-bin-3.4.0 automatically installs ~200MB of dictionary data for each user2012-07-14 00:20:34
456846ApplicationscardoeUNCONFIRMEDapp-emulation/libvirt-1.0.2-r1 has broken python bindings2013-02-12 22:17:07
439540ApplicationscardoeUNCONFIRMEDapp-emulation/qemu fails to handle a usb serial port with a specific vendorid - qdev_prop_set: prope2013-02-10 17:43:13
445884ApplicationscardoeUNCONFIRMEDdev-util/android-ndk-8c version bump2013-02-09 06:25:04
451584ApplicationscardoeUNCONFIRMEDapp-emulation/libvirt-1.0.1 - does not start LXC VM2013-02-05 17:25:51
453156ApplicationscardoeUNCONFIRMEDsys-firmware/seabios-1.7.2 version bump2013-01-29 12:28:45
454560LibrarycardoeUNCONFIRMEDx11-drivers/nvidia-drivers-313.18 with kernel 3.7.4 - NVRM: This PCI I/O region assigned to your NVI2013-02-05 19:04:08
454740LibrarycardoeUNCONFIRMEDx11-drivers/nvidia-drivers-304.64 should not include udev rule to unconditionally load nvidia.ko (ev2013-02-02 16:50:24
455636ApplicationscardoeUNCONFIRMEDapp-emulation/libvirt-1.0.2 USE=-libvirtd - node_device/node_device_udev.c:1608:37: error: unknown t2013-02-05 21:55:17
428746ApplicationscardoeUNCONFIRMEDnet-misc/netcf-0.1.9 - drv_initscripts.c:1083:15: error: ‘NETCF_TRANSACTION’ undeclared (first use i2012-08-01 04:17:19
433102Core systemcardoeUNCONFIRMEDx11-drivers/nvidia-drivers - CONFIG_AMD_IOMMU causes kernel module to fail?2012-11-13 09:49:39
425708ApplicationscalchanUNCONFIRMEDdev-lang/R-2.10.1 - R: stack smashing attack in function - terminated2012-10-07 11:57:34
383895Ebuildsc1pherUNCONFIRMEDapp-admin/gentoo-rsync-mirror file permission problem2012-07-04 17:48:16
429920BugzillabugzillaUNCONFIRMEDOptionally allow secure mail for all emails2012-08-04 21:40:41
373653BugzillabugzillaUNCONFIRMEDUnspecified component kills entered bugdescription2011-10-30 23:17:02
458576Applicationsbug-wranglersUNCONFIRMEDapp-emulation/xen-tools should depend on dev-libs/yajl2013-02-21 12:22:28
458578Applicationsbug-wranglersUNCONFIRMEDapp-misc/geneweb-5.02: Fatal error: OCaml and preprocessor have incompatible versions2013-02-21 12:27:58
458544Librarybug-wranglersUNCONFIRMEDdev-tcltk/tcllib-1.15: Detected file collision(s)2013-02-21 08:19:27
442708FreeBSDbsdUNCONFIRMEDsys-fs/fuse4bsd -- version bump request2012-12-09 02:14:11
435648FreeBSDbsdUNCONFIRMEDSegmentation fault always occurs when starting X, using later versions xf86-video-vesa-2.3.0-r12012-09-23 13:02:11
442254EbuildsbluenessUNCONFIRMEDnet-misc/cgminer-2.9.1 version bump2012-12-20 16:37:50
436680ApplicationsbluenessUNCONFIRMEDapp-admin/webapp-config wrong permissions for vhost_perms_defaultowned_dir2012-10-01 00:54:40
431048Core systembluenessUNCONFIRMEDsys-kernel/hardened-sources-3.4.7 panic on UP->SMP transition when putting CPU core online - BUG: un2013-01-18 20:53:51
432908ApplicationsbluenessUNCONFIRMEDapp-admin/webapp-config-1.50.19: Allow precise declaration of server uid/gid in the configuration fi2012-09-30 16:18:23
434894ApplicationsbluenessUNCONFIRMEDapp-admin/webapp-config: Bad permissions for server-owned dirs (umask 022)2012-09-13 14:23:46
447224DevelopmentbinkiUNCONFIRMEDdev-vcs/veracity-2.0.0.10822 version bump2013-02-04 11:38:03
453500ApplicationsbircophUNCONFIRMEDapp-doc/root-docs-5.34.03 - Error: Function Open(filename,"RECREATE") is not defined in current scop2013-02-19 19:12:58
410477ApplicationsbluenessUNCONFIRMEDnet-p2p/bitcoind-0.5* - init.d script's stop action fails to stop daemon2013-01-25 18:58:34
410831libbashbetelgeuseUNCONFIRMEDRead builtin implementation2012-04-05 01:32:10
412699libbashbetelgeuseUNCONFIRMEDSet builtin implementation2012-04-19 21:58:38
447466ApplicationsbazaarUNCONFIRMEDdev-vcs/bzr-gtk-0.103.0: USE="-nautilus" does not remove /usr/share/nautilus-python/extensions/nauti2012-12-27 23:41:30
458204Core systembase-systemUNCONFIRMEDdev-libs/openssl-1.0.1c - DESCRIPTION should mention TLSv1.1 and TLSv1.22013-02-19 15:25:04
456308Core systembase-systemUNCONFIRMEDgrub2 won't launch memtest86 and memtest86+ if / and /boot are separated partitions and grub2 graphi2013-02-13 22:19:39
449830Core systembase-systemUNCONFIRMEDsys-block/open-iscsi-2.0.873 version bump2013-01-03 03:25:35
447530Ebuildsbase-systemUNCONFIRMEDnet-firewall/iptables[netlink] - please add support for loading fingerprint definitions from pf.os f2013-02-16 14:09:37
441970Core systembase-systemUNCONFIRMEDnet-misc/dhcp: Fedora patches should be considered for inclusion2012-11-14 18:55:55
440194Core systembase-systemUNCONFIRMEDsys-apps/microcode-data20120606_p2? (v2) version bump request2012-11-06 11:28:26
437114Core systembase-systemUNCONFIRMEDnet-misc/dhcp does not work on virtual machines that use virtio2012-10-04 03:36:06
435410Applicationsbase-systemUNCONFIRMEDapp-arch/zip-3.0: bzip2 flag broken, unicode flag broken, cross compilation broken2013-02-16 13:20:59
424453Core systembase-systemUNCONFIRMEDsys-devel/automake-1.1[12] cause warning in combination with dev-lang/perl-5.16.02012-07-03 16:25:08
420337Core systembase-systemUNCONFIRMEDsys-libs/db-{5.2.42,5.3.21} version bump2012-06-09 14:09:24
410567Core systembase-systemUNCONFIRMEDsys-block/noflushd-2.8 version bump2012-04-02 15:16:31
409469Core systembase-systemUNCONFIRMEDsys-process/runit - make getty-ttyX symlinks optional2012-03-24 16:18:08
408139Core systembase-systemUNCONFIRMEDsys-fs/mdadm-3.2.1 sends ioctl 1261 (BLKFLSBUF) to partition when displaying array details2012-11-11 22:39:56
401903Core systembase-systemUNCONFIRMEDapp-admin/sysklogd-1.5-r2: improve default syslog.conf to match syslog-ng.conf behavior2012-02-02 17:46:23
402245Core systembase-systemUNCONFIRMEDsys-fs/dosfstools-3.0.12 dosfslabel does not work if long file names are used in partition2013-01-23 19:12:35
405581Core systembase-systemUNCONFIRMEDapp-admin/sudo with net-nds/openldap-1.8.4_p1 - sudo: sudo_ldap_build_pass1 allocation mismatch2012-02-24 16:05:21
386539Core systembase-systemUNCONFIRMEDsys-boot/grub-1.99-r2 doesn't detect framebuffer resolutions if /usr is not mounted2011-11-11 13:32:10
389485Core systembase-systemUNCONFIRMEDsys-libs/libcap-2.22: pam_cap.so unresolved symbol pam_get_item(), breaks authentication2011-12-20 18:53:00
393201Core systembase-systemUNCONFIRMEDsys-boot/grub-0.97-r10 has a typo in the grub-set-default utility and configuration files2011-12-05 12:38:16
367553Core systembase-systemUNCONFIRMEDnet-misc/openssh - sshd sessions don't get killed when system goes down or reboots2013-02-11 16:00:41
365321Eclasses and Profilesbase-systemUNCONFIRMEDeutils.eclass lacks eclass-to-man formatting for documentation of make_desktop_entry function2011-05-02 01:44:57
366923Ebuildsbase-systemUNCONFIRMEDapp-arch/tar-1.26 changes matching behavior2011-05-13 00:18:52
372693Keywording and StabilizationarmUNCONFIRMEDapp-emulation/lxc ~arm keyword request2012-06-18 10:54:01
409641DevelopmentaraujoUNCONFIRMEDdev-lang/io-2009.01.02-r2: Uncomment the IO_USE_SIMD define to turn on SIMD acceleration2012-12-24 08:55:55
386059Libraryarfrever.ftaUNCONFIRMEDnet-libs/neon uses deprecated function gnutls_certificate_verify_peers() of gnutls2012-04-01 12:04:01
409947Unspecifiedapp-backupUNCONFIRMEDapp-backup/rdiff-backup-1.3.3 - "Security Violation" warning then "Fatal Error"2012-03-30 06:29:16
458066ApplicationsangelosUNCONFIRMEDmedia-sound/xnoise-9999 (and possibly other versions) should depend on certain gst-plugins-*-package2013-02-19 20:18:26
457126Libraryamd64UNCONFIRMEDapp-emulation/emul-linux-x86-qtlibs-20121202 should install libQtSvg2013-02-14 07:14:29
454418Unspecifiedamd64UNCONFIRMEDapp-emulation/emul-linux-x86-soundlibs: pulseaudio version mismatch2013-01-28 19:22:58
446682Applicationsamd64UNCONFIRMEDapp-emulation/emul-linux-x86* - new libraries for steam platform2013-02-20 22:44:38
403551OtheraltUNCONFIRMEDCompilation of gcc-4.5.3-r1 fails with "configure: error: Link tests are not allowed after GCC_NO_EX2012-02-14 10:57:13
414549Libraryamd64UNCONFIRMEDapp-emulation/emul-linux-x86-*; support for running PCSX2 32-bit released binary (or own)2012-07-18 15:48:39
417191Ebuildsamd64UNCONFIRMEDapp-emulation/emul-linux-x86-gtklibs-20120520 needs pax marking - gtk-query-immodules-2.0-32: error 2012-12-12 16:42:02
429674Libraryamd64UNCONFIRMEDapp-emulation/emul-linux-x86-medialibs: move media-libs/faac to a separate package due to license "i2012-11-02 18:16:56
456114Applicationsalsa-bugsUNCONFIRMEDmedia-sound/alsa-tools[ALSA_CARDS="indigoio"] - echomixer needs media-fonts/font-misc-misc2013-02-09 16:24:29
438844Applicationsalsa-bugsUNCONFIRMEDmedia-sound/alsa-utils[pulseaudio]: alsasound init.d script generates pulse state files in /2012-12-16 03:05:14
432890Applicationsalsa-bugsUNCONFIRMEDmedia-libs/alsa-lib w/ net-im/skype: snd_pcm_avail_update() returned a value that is exceptionally l2012-09-09 08:42:31
369327Applicationsalsa-bugsUNCONFIRMEDNo sound with Poulsbo HD Audio Controller2011-06-01 14:12:24
439908EbuildsalexxyUNCONFIRMEDsci-chemistry/gamess-20120501.1 version bump2012-10-28 11:49:32
458056ApplicationsaidecoeUNCONFIRMEDapp-admin/hddtemp submission for Samsung 840 Series SSD2013-02-18 13:22:13
428410LibraryalexxyUNCONFIRMEDsys-apps/gptfdisk - make dev-libs/icu dependency optional2012-11-01 19:01:06
413659DevelopmentadaUNCONFIRMEDdev-lang/gnat-gcc 4.6.2 4.7.0 version bumps2012-09-11 19:00:29
402493ApplicationsadaUNCONFIRMEDdev-ada/adasockets-1.8.4.7 - gnatmake: "listener.adb" compilation error2012-02-07 17:45:08
371322Eclasses and ProfilesadaUNCONFIRMEDdev-lang/gnat-gcc-4.3.2 - work/gcc-4.3.2/libgcc/../gcc/unwind-pe.h:136: error: expected declaration 2012-03-19 19:22:36
439844EbuildsaballierUNCONFIRMEDmedia-libs/stk-4.4.4 - In file included from RtAudio.cpp:6750:0: include/soundcard.h:106:28: fatal e2013-01-23 16:33:32
331685Prefix SupportsysadminUNCONFIRMEDnet-analyzer/nrpe, net-analyzer/nagios-plugins: Gentoo Prefix support2012-08-24 13:27:59
456292OthertenUNCONFIRMEDLiveDVD 20121221: Kernel cannot detect BIOS RAID array2013-02-10 06:48:14
333285Toolstools-portageUNCONFIRMEDapp-portage/gentoolkit: revdep-rebuild: add variable to make.conf default emerge options for revdep-2013-01-18 16:29:12
430478Core systema3liUNCONFIRMEDsys-boot/plymouth-0.8.6.1 version bump2013-01-30 10:49:51
398399ApplicationsvimUNCONFIRMEDapp-editors/vim-7.3.393 - if_perl.c:1102:1: error: static declaration of 'XS_VIM_Msg' follows non-st2012-09-29 14:38:20
399739Libraryrobbat2UNCONFIRMEDdev-db/libdbi-drivers-0.8.3 fails to return column information for empty sqlite3 table2012-10-26 16:54:27
343021Ebuildsmaintainer-wantedUNCONFIRMEDAdd ebuild for membase server (community edition)2011-07-04 10:46:11
366051Ebuildsmaintainer-wantedUNCONFIRMEDAdd ebuild for NOC, Operation Support System (OSS) and Enterprise Network Operation Centers.2012-09-01 12:24:51
366875Ebuildsmaintainer-wantedUNCONFIRMED[new package] sys-fs/gdatafs - Gdatafs is a FUSE implemtation that mount picassa web and youtube to 2011-12-08 06:16:16
413613Applicationsmedia-videoUNCONFIRMEDmedia-video/h264enc-9.4.6 version bump2012-04-26 15:16:26
52076Applicationsnet-mailUNCONFIRMEDdefault maildir location configuration variable2012-03-16 14:33:21
255644Ebuildsmaintainer-wantedUNCONFIRMEDapp-emulation/basiliskII-jit: a lot improved ebuild2012-12-14 15:37:41
350685Unspecifiedmaintainer-neededUNCONFIRMEDnet-misc/htpdate-1.0.4 segfaults with -b command line option2012-03-04 09:21:29
369923GamesgamesUNCONFIRMEDgames-action/trine-bin Filesize does not match recorded size2011-06-03 17:20:29
266311Applicationsford_prefectUNCONFIRMEDmedia-sound/pulseaudio is lacking suspend support for sys-power/pm-utils (?)2012-10-19 12:32:55
441862ApplicationsalexxyUNCONFIRMEDsys-apps/gptfdisk-0.8.5 - In function `GPTPart::GetDescription()': gptpart.cc:(.text+0x179): undefin2013-02-12 11:55:19
403965EbuildsaballierUNCONFIRMEDmedia-sound/decibel-audio-player-1.09 version bump2012-02-17 04:54:23
457104KernelsecurityUNCONFIRMEDDriver of cypress corrupts file-system and partition table of external hard drives with M6116 SATA B2013-02-14 15:53:16


back



Support us on Content Nation

New Packages

- as rdf newsfeed
- as rss newsfeed
- as Atom newsfeed
2022-11-30
assistant - 5.15.7
Ebuild name:

dev-qt/assistant-5.15.7

Description

Tool for viewing on-line documentation in Qt help file format

Added to portage

2022-11-30

asttokens - 2.2.0
Ebuild name:

dev-python/asttokens-2.2.0

Description

Annotate Python AST trees with source text and token information

Added to portage

2022-11-30

cbor2 - 5.4.5
Ebuild name:

dev-python/cbor2-5.4.5

Description

Pure Python CBOR (de)serializer with extensive tag support

Added to portage

2022-11-30

clang-python - 15.0.6
Ebuild name:

dev-python/clang-python-15.0.6

Description

Python bindings for sys-devel/clang

Added to portage

2022-11-30

designer - 5.15.7
Ebuild name:

dev-qt/designer-5.15.7

Description

WYSIWYG tool for designing and building graphical user interfaces with QtWid

Added to portage

2022-11-30

ipykernel - 6.18.2
Ebuild name:

dev-python/ipykernel-6.18.2

Description

IPython Kernel for Jupyter

Added to portage

2022-11-30

libclc - 15.0.6
Ebuild name:

dev-libs/libclc-15.0.6

Description

OpenCL C library

Added to portage

2022-11-30

libxml2 - 2.10.3-r1
Ebuild name:

dev-libs/libxml2-2.10.3-r1

Description

XML C parser and toolkit

Added to portage

2022-11-30

linguist - 5.15.7
Ebuild name:

dev-qt/linguist-5.15.7

Description

Graphical tool for translating Qt applications

Added to portage

2022-11-30

linguist-tools - 5.15.7
Ebuild name:

dev-qt/linguist-tools-5.15.7

Description

Tools for working with Qt translation data files

Added to portage

2022-11-30

lit - 15.0.6
Ebuild name:

dev-python/lit-15.0.6

Description

A stand-alone install of the LLVM suite testing tool

Added to portage

2022-11-30

llvm-ocaml - 15.0.6
Ebuild name:

dev-ml/llvm-ocaml-15.0.6

Description

OCaml bindings for LLVM

Added to portage

2022-11-30

nbclient - 0.7.2
Ebuild name:

dev-python/nbclient-0.7.2

Description

A client library for executing Jupyter notebooks

Added to portage

2022-11-30

patiencediff - 0.2.9
Ebuild name:

dev-python/patiencediff-0.2.9

Description

Python implementation of the patiencediff algorithm

Added to portage

2022-11-30

pixeltool - 5.15.7
Ebuild name:

dev-qt/pixeltool-5.15.7

Description

Qt screen magnifier

Added to portage

2022-11-30

pkginfo - 1.9.0
Ebuild name:

dev-python/pkginfo-1.9.0

Description

Provides an API for querying the distutils metadata written in a PKG-INFO

Added to portage

2022-11-30

prometheus - 2.40.4
Ebuild name:

app-metrics/prometheus-2.40.4

Description

Prometheus monitoring system and time series database

Added to portage

2022-11-30

pylint - 2.15.7
Ebuild name:

dev-python/pylint-2.15.7

Description

Python code static checker

Added to portage

2022-11-30

pyphen - 0.13.2
Ebuild name:

dev-python/pyphen-0.13.2

Description

Python module for hyphenation using hunspell dictionaries

Added to portage

2022-11-30

pyupgrade - 3.2.3
Ebuild name:

dev-python/pyupgrade-3.2.3

Description

Tool + pre-commit hook to automatically upgrade syntax for newer Pythons

Added to portage

2022-11-30

qdbus - 5.15.7
Ebuild name:

dev-qt/qdbus-5.15.7

Description

Interface to Qt applications communicating over D-Bus

Added to portage

2022-11-30

qdbusviewer - 5.15.7
Ebuild name:

dev-qt/qdbusviewer-5.15.7

Description

Graphical tool that lets you introspect D-Bus objects and messages

Added to portage

2022-11-30

qdoc - 5.15.7
Ebuild name:

dev-qt/qdoc-5.15.7

Description

Qt documentation generator

Added to portage

2022-11-30

qt3d - 5.15.7
Ebuild name:

dev-qt/qt3d-5.15.7

Description

3D rendering module for the Qt5 framework

Added to portage

2022-11-30

qtbluetooth - 5.15.7
Ebuild name:

dev-qt/qtbluetooth-5.15.7

Description

Bluetooth support library for the Qt5 framework

Added to portage

2022-11-30

qtcharts - 5.15.7
Ebuild name:

dev-qt/qtcharts-5.15.7

Description

Chart component library for the Qt5 framework

Added to portage

2022-11-30

qtconcurrent - 5.15.7
Ebuild name:

dev-qt/qtconcurrent-5.15.7

Description

Multi-threading concurrence support library for the Qt5 framework

Added to portage

2022-11-30

qtcore - 5.15.7
Ebuild name:

dev-qt/qtcore-5.15.7

Description

Cross-platform application development framework

Added to portage

2022-11-30

qtdatavis3d - 5.15.7
Ebuild name:

dev-qt/qtdatavis3d-5.15.7

Description

3D data visualization library for the Qt5 framework

Added to portage

2022-11-30

qtdbus - 5.15.7
Ebuild name:

dev-qt/qtdbus-5.15.7

Description

Qt5 module for inter-process communication over the D-Bus protocol

Added to portage

2022-11-30

qtdeclarative - 5.15.7
Ebuild name:

dev-qt/qtdeclarative-5.15.7

Description

The QML and Quick modules for the Qt5 framework

Added to portage

2022-11-30

qtdiag - 5.15.7
Ebuild name:

dev-qt/qtdiag-5.15.7

Description

Tool for reporting diagnostic information about Qt and its environment

Added to portage

2022-11-30

qtgamepad - 5.15.7
Ebuild name:

dev-qt/qtgamepad-5.15.7

Description

Qt module to support gamepad hardware

Added to portage

2022-11-30

qtgraphicaleffects - 5.15.7
Ebuild name:

dev-qt/qtgraphicaleffects-5.15.7

Description

Set of QML types for adding visual effects to user interfaces

Added to portage

2022-11-30

qtgui - 5.15.7
Ebuild name:

dev-qt/qtgui-5.15.7

Description

The GUI module and platform plugins for the Qt5 framework

Added to portage

2022-11-30

qthelp - 5.15.7
Ebuild name:

dev-qt/qthelp-5.15.7

Description

Qt5 module for integrating online documentation into applications

Added to portage

2022-11-30

qtimageformats - 5.15.7
Ebuild name:

dev-qt/qtimageformats-5.15.7

Description

Additional format plugins for the Qt image I/O system

Added to portage

2022-11-30

qtlocation - 5.15.7
Ebuild name:

dev-qt/qtlocation-5.15.7

Description

Location (places, maps, navigation) library for the Qt5 framework

Added to portage

2022-11-30

qtmultimedia - 5.15.7
Ebuild name:

dev-qt/qtmultimedia-5.15.7

Description

Multimedia (audio, video, radio, camera) library for the Qt5 framework

Added to portage

2022-11-30

qtnetwork - 5.15.7
Ebuild name:

dev-qt/qtnetwork-5.15.7

Description

Network abstraction library for the Qt5 framework

Added to portage

2022-11-30

qtnetworkauth - 5.15.7
Ebuild name:

dev-qt/qtnetworkauth-5.15.7

Description

Network authorization library for the Qt5 framework

Added to portage

2022-11-30

qtopengl - 5.15.7
Ebuild name:

dev-qt/qtopengl-5.15.7

Description

OpenGL support library for the Qt5 framework (deprecated)

Added to portage

2022-11-30

qtpaths - 5.15.7
Ebuild name:

dev-qt/qtpaths-5.15.7

Description

Command line client to QStandardPaths

Added to portage

2022-11-30

qtplugininfo - 5.15.7
Ebuild name:

dev-qt/qtplugininfo-5.15.7

Description

Qt5 plugin metadata dumper

Added to portage

2022-11-30

qtpositioning - 5.15.7
Ebuild name:

dev-qt/qtpositioning-5.15.7

Description

Physical position determination library for the Qt5 framework

Added to portage

2022-11-30

qtprintsupport - 5.15.7
Ebuild name:

dev-qt/qtprintsupport-5.15.7

Description

Printing support library for the Qt5 framework

Added to portage

2022-11-30

qtquickcontrols - 5.15.7
Ebuild name:

dev-qt/qtquickcontrols-5.15.7

Description

Set of Qt Quick controls to create complete user interfaces (deprecat

Added to portage

2022-11-30

qtquickcontrols2 - 5.15.7
Ebuild name:

dev-qt/qtquickcontrols2-5.15.7

Description

Set of next generation Qt Quick controls for the Qt5 framework

Added to portage

2022-11-30

sphobjinv - 2.3.1
Ebuild name:

dev-python/sphobjinv-2.3.1

Description

Sphinx objects.inv Inspection/Manipulation Tool

Added to portage

2022-11-30

traitlets - 5.6.0
Ebuild name:

dev-python/traitlets-5.6.0

Description

A configuration system for Python applications

Added to portage

2022-11-30

2022-11-29
86Box - 3.11
Ebuild name:

app-emulation/86Box-3.11

Description

Emulator of x86-based machines based on PCem

Added to portage

2022-11-29

abseil-cpp - 20220623.1
Ebuild name:

dev-cpp/abseil-cpp-20220623.1

Description

Abseil Common Libraries (C++), LTS Branch

Added to portage

2022-11-29

aspell-vi - 0.01.1.1-r1
Ebuild name:

app-dicts/aspell-vi-0.01.1.1-r1

Description

Added to portage

2022-11-29

aspell-wa - 0.50.0-r1
Ebuild name:

app-dicts/aspell-wa-0.50.0-r1

Description

Added to portage

2022-11-29

aspell-yi - 0.01.1.1-r1
Ebuild name:

app-dicts/aspell-yi-0.01.1.1-r1

Description

Added to portage

2022-11-29

aspell-zu - 0.50.0-r1
Ebuild name:

app-dicts/aspell-zu-0.50.0-r1

Description

Added to portage

2022-11-29

aws-sam-translator - 1.55.0
Ebuild name:

dev-python/aws-sam-translator-1.55.0

Description

A library that transform SAM templates into AWS CloudFormation

Added to portage

2022-11-29

awscli - 1.27.18
Ebuild name:

app-admin/awscli-1.27.18

Description

Universal Command Line Environment for AWS

Added to portage

2022-11-29

boogie - 2.16.0
Ebuild name:

dev-lang/boogie-2.16.0

Description

SMT-based program verifier

Added to portage

2022-11-29

bookview - 3.2.1
Ebuild name:

app-dicts/bookview-3.2.1

Description

NDTP client written in Tcl/Tk

Added to portage

2022-11-29

boto3 - 1.26.18
Ebuild name:

dev-python/boto3-1.26.18

Description

The AWS SDK for Python

Added to portage

2022-11-29

botocore - 1.29.18
Ebuild name:

dev-python/botocore-1.29.18

Description

Low-level, data-driven core of boto 3

Added to portage

2022-11-29

cadabra - 2.4.2.2
Ebuild name:

sci-mathematics/cadabra-2.4.2.2

Description

Field-theory motivated approach to computer algebra

Added to portage

2022-11-29

cbor2 - 5.4.4
Ebuild name:

dev-python/cbor2-5.4.4

Description

Pure Python CBOR (de)serializer with extensive tag support

Added to portage

2022-11-29

clang - 15.0.6.9999
Ebuild name:

sys-devel/clang-15.0.6.9999

Description

C language family frontend for LLVM

Added to portage

2022-11-29

clang-common - 15.0.6.9999
Ebuild name:

sys-devel/clang-common-15.0.6.9999

Description

Common files shared between multiple slots of clang

Added to portage

2022-11-29

clang-python - 15.0.6.9999
Ebuild name:

dev-python/clang-python-15.0.6.9999

Description

Python bindings for sys-devel/clang

Added to portage

2022-11-29

clang-runtime - 15.0.6.9999
Ebuild name:

sys-devel/clang-runtime-15.0.6.9999

Description

Meta-ebuild for clang runtime libraries

Added to portage

2022-11-29

compiler-rt - 15.0.6.9999
Ebuild name:

sys-libs/compiler-rt-15.0.6.9999

Description

Compiler runtime library for clang (built-in part)

Added to portage

2022-11-29

compiler-rt-sanitizers - 15.0.6.9999
Ebuild name:

sys-libs/compiler-rt-sanitizers-15.0.6.9999

Description

Compiler runtime libraries for clang (sanitizers & xray

Added to portage

2022-11-29

dcc - 2.3.168
Ebuild name:

mail-filter/dcc-2.3.168

Description

Distributed Checksum Clearinghouse

Added to portage

2022-11-29

dictd-vera - 1.24-r1
Ebuild name:

app-dicts/dictd-vera-1.24-r1

Description

V.E.R.A. -- Virtual Entity of Relevant Acronyms for dict

Added to portage

2022-11-29

elogv - 0.7.9-r3
Ebuild name:

app-portage/elogv-0.7.9-r3

Description

Curses based utility to parse the contents of elogs created by Portage

Added to portage

2022-11-29

eselect-wine - 2.0.1
Ebuild name:

app-eselect/eselect-wine-2.0.1

Description

Manage active Wine slots and variants

Added to portage

2022-11-29

fetchcommandwrapper - 0.8.4-r3
Ebuild name:

app-portage/fetchcommandwrapper-0.8.4-r3

Description

Wrapper integrating aria2 into portage's FETCHCOMMAND

Added to portage

2022-11-29

firefox - 107.0.1
Ebuild name:

www-client/firefox-107.0.1

Description

Firefox Web Browser

Added to portage

2022-11-29

firefox-bin - 107.0.1
Ebuild name:

www-client/firefox-bin-107.0.1

Description

Firefox Web Browser

Added to portage

2022-11-29

gprof2dot - 2022.07.29-r1
Ebuild name:

dev-util/gprof2dot-2022.07.29-r1

Description

Converts profiling output to dot graphs

Added to portage

2022-11-29

grip - 4.2.4
Ebuild name:

media-sound/grip-4.2.4

Description

GTK+ based Audio CD Player/Ripper

Added to portage

2022-11-29

grpcio - 1.43.0-r1
Ebuild name:

dev-python/grpcio-1.43.0-r1

Description

High-performance RPC framework (python libraries)

Added to portage

2022-11-29

grpcio - 1.51.0
Ebuild name:

dev-python/grpcio-1.51.0

Description

High-performance RPC framework (python libraries)

Added to portage

2022-11-29

grpcio-testing - 1.51.0
Ebuild name:

dev-python/grpcio-testing-1.51.0

Description

Testing utilities for gRPC Python

Added to portage

2022-11-29

grpcio-tools - 1.43.0-r1
Ebuild name:

dev-python/grpcio-tools-1.43.0-r1

Description

Protobuf code generator for gRPC

Added to portage

2022-11-29

grpcio-tools - 1.51.0
Ebuild name:

dev-python/grpcio-tools-1.51.0

Description

Protobuf code generator for gRPC

Added to portage

2022-11-29

grub2-theme-preview - 2.7.0-r1
Ebuild name:

x11-misc/grub2-theme-preview-2.7.0-r1

Description

Preview a GRUB 2.x theme using KVM/QEMU

Added to portage

2022-11-29

httrack - 3.49.2-r3
Ebuild name:

www-client/httrack-3.49.2-r3

Description

HTTrack Website Copier, Open Source Offline Browser

Added to portage

2022-11-29

ipykernel - 6.18.1
Ebuild name:

dev-python/ipykernel-6.18.1

Description

IPython Kernel for Jupyter

Added to portage

2022-11-29

ipython - 8.7.0
Ebuild name:

dev-python/ipython-8.7.0

Description

Advanced interactive shell for Python

Added to portage

2022-11-29

jupyter_core - 4.12.0
Ebuild name:

dev-python/jupyter_core-4.12.0

Description

Core common functionality of Jupyter projects

Added to portage

2022-11-29

jupyter_core - 5.1.0
Ebuild name:

dev-python/jupyter_core-5.1.0

Description

Core common functionality of Jupyter projects

Added to portage

2022-11-29

kube-apiserver - 1.23.14
Ebuild name:

sys-cluster/kube-apiserver-1.23.14

Description

Kubernetes API server

Added to portage

2022-11-29

kube-apiserver - 1.24.8
Ebuild name:

sys-cluster/kube-apiserver-1.24.8

Description

Kubernetes API server

Added to portage

2022-11-29

kube-apiserver - 1.25.4
Ebuild name:

sys-cluster/kube-apiserver-1.25.4

Description

Kubernetes API server

Added to portage

2022-11-29

kube-controller-manager - 1.23.14
Ebuild name:

sys-cluster/kube-controller-manager-1.23.14

Description

Kubernetes Controller Manager

Added to portage

2022-11-29

kube-controller-manager - 1.24.8
Ebuild name:

sys-cluster/kube-controller-manager-1.24.8

Description

Kubernetes Controller Manager

Added to portage

2022-11-29

kube-controller-manager - 1.25.4
Ebuild name:

sys-cluster/kube-controller-manager-1.25.4

Description

Kubernetes Controller Manager

Added to portage

2022-11-29

kube-proxy - 1.23.14
Ebuild name:

sys-cluster/kube-proxy-1.23.14

Description

Kubernetes Proxy service

Added to portage

2022-11-29

kube-proxy - 1.24.8
Ebuild name:

sys-cluster/kube-proxy-1.24.8

Description

Kubernetes Proxy service

Added to portage

2022-11-29

kube-proxy - 1.25.4
Ebuild name:

sys-cluster/kube-proxy-1.25.4

Description

Kubernetes Proxy service

Added to portage

2022-11-29

kube-scheduler - 1.23.14
Ebuild name:

sys-cluster/kube-scheduler-1.23.14

Description

Kubernetes Scheduler

Added to portage

2022-11-29

kube-scheduler - 1.24.8
Ebuild name:

sys-cluster/kube-scheduler-1.24.8

Description

Kubernetes Scheduler

Added to portage

2022-11-29

kube-scheduler - 1.25.4
Ebuild name:

sys-cluster/kube-scheduler-1.25.4

Description

Kubernetes Scheduler

Added to portage

2022-11-29

kubeadm - 1.23.14
Ebuild name:

sys-cluster/kubeadm-1.23.14

Description

CLI to Easily bootstrap a secure Kubernetes cluster

Added to portage

2022-11-29

kubeadm - 1.24.8
Ebuild name:

sys-cluster/kubeadm-1.24.8

Description

CLI to Easily bootstrap a secure Kubernetes cluster

Added to portage

2022-11-29

kubeadm - 1.25.4
Ebuild name:

sys-cluster/kubeadm-1.25.4

Description

CLI to Easily bootstrap a secure Kubernetes cluster

Added to portage

2022-11-29

kubectl - 1.23.14
Ebuild name:

sys-cluster/kubectl-1.23.14

Description

CLI to run commands against Kubernetes clusters

Added to portage

2022-11-29

kubectl - 1.24.8
Ebuild name:

sys-cluster/kubectl-1.24.8

Description

CLI to run commands against Kubernetes clusters

Added to portage

2022-11-29

kubectl - 1.25.4
Ebuild name:

sys-cluster/kubectl-1.25.4

Description

CLI to run commands against Kubernetes clusters

Added to portage

2022-11-29

kubelet - 1.23.14
Ebuild name:

sys-cluster/kubelet-1.23.14

Description

Kubernetes Node Agent

Added to portage

2022-11-29

kubelet - 1.24.8
Ebuild name:

sys-cluster/kubelet-1.24.8

Description

Kubernetes Node Agent

Added to portage

2022-11-29

kubelet - 1.25.4
Ebuild name:

sys-cluster/kubelet-1.25.4

Description

Kubernetes Node Agent

Added to portage

2022-11-29

libclc - 15.0.6.9999
Ebuild name:

dev-libs/libclc-15.0.6.9999

Description

OpenCL C library

Added to portage

2022-11-29

libcxx - 15.0.6.9999
Ebuild name:

sys-libs/libcxx-15.0.6.9999

Description

New implementation of the C++ standard library, targeting C++11

Added to portage

2022-11-29

libcxxabi - 15.0.6.9999
Ebuild name:

sys-libs/libcxxabi-15.0.6.9999

Description

Low level support for a standard C++ library

Added to portage

2022-11-29

libomp - 15.0.6.9999
Ebuild name:

sys-libs/libomp-15.0.6.9999

Description

OpenMP runtime library for LLVM/clang compiler

Added to portage

2022-11-29

libpulse - 16.1-r2
Ebuild name:

media-libs/libpulse-16.1-r2

Description

Libraries for PulseAudio clients

Added to portage

2022-11-29

lit - 15.0.6.9999
Ebuild name:

dev-python/lit-15.0.6.9999

Description

A stand-alone install of the LLVM suite testing tool

Added to portage

2022-11-29

lld - 15.0.6.9999
Ebuild name:

sys-devel/lld-15.0.6.9999

Description

The LLVM linker (link editor)

Added to portage

2022-11-29

lldb - 15.0.6.9999
Ebuild name:

dev-util/lldb-15.0.6.9999

Description

The LLVM debugger

Added to portage

2022-11-29

llvm - 15.0.6.9999
Ebuild name:

sys-devel/llvm-15.0.6.9999

Description

Low Level Virtual Machine

Added to portage

2022-11-29

llvm-common - 15.0.6.9999
Ebuild name:

sys-devel/llvm-common-15.0.6.9999

Description

Common files shared between multiple slots of LLVM

Added to portage

2022-11-29

llvm-libunwind - 15.0.6.9999
Ebuild name:

sys-libs/llvm-libunwind-15.0.6.9999

Description

C++ runtime stack unwinder from LLVM

Added to portage

2022-11-29

llvm-ocaml - 15.0.6.9999
Ebuild name:

dev-ml/llvm-ocaml-15.0.6.9999

Description

OCaml bindings for LLVM

Added to portage

2022-11-29

mdbook - 0.4.22
Ebuild name:

app-text/mdbook-0.4.22

Description

Create a book from markdown files

Added to portage

2022-11-29

metagen - 0.7.3-r2
Ebuild name:

app-portage/metagen-0.7.3-r2

Description

metadata.xml generator for ebuilds

Added to portage

2022-11-29

miniflux - 2.0.40
Ebuild name:

www-apps/miniflux-2.0.40

Description

Minimalist and opinionated feed reader

Added to portage

2022-11-29

mkdocs-minify-plugin - 0.6.2
Ebuild name:

dev-python/mkdocs-minify-plugin-0.6.2

Description

An MkDocs plugin to minify HTML and/or JS files prior to bein

Added to portage

2022-11-29

overlint - 0.5.3-r4
Ebuild name:

app-portage/overlint-0.5.3-r4

Description

Simple tool for static analysis of overlays

Added to portage

2022-11-29

phonenumbers - 8.13.1
Ebuild name:

dev-python/phonenumbers-8.13.1

Description

Python port of Google's libphonenumber

Added to portage

2022-11-29

php - 8.0.26
Ebuild name:

dev-lang/php-8.0.26

Description

The PHP language runtime engine

Added to portage

2022-11-29

php - 8.1.13
Ebuild name:

dev-lang/php-8.1.13

Description

The PHP language runtime engine

Added to portage

2022-11-29

php - 8.2.0_rc7
Ebuild name:

dev-lang/php-8.2.0_rc7

Description

The PHP language runtime engine

Added to portage

2022-11-29

piexif - 1.1.3-r2
Ebuild name:

dev-python/piexif-1.1.3-r2

Description

Exif manipulation with pure Python

Added to portage

2022-11-29

piwigo - 13.3.0
Ebuild name:

www-apps/piwigo-13.3.0

Description

a photo gallery software for the web

Added to portage

2022-11-29

pulseaudio-daemon - 16.1-r1
Ebuild name:

media-sound/pulseaudio-daemon-16.1-r1

Description

Daemon component of PulseAudio (networked sound server)

Added to portage

2022-11-29

pycairo - 1.23.0
Ebuild name:

dev-python/pycairo-1.23.0

Description

Python bindings for the cairo library

Added to portage

2022-11-29

pycxx - 7.1.7
Ebuild name:

dev-python/pycxx-7.1.7

Description

Set of facilities to extend Python with C++

Added to portage

2022-11-29

pysvn - 1.9.18
Ebuild name:

dev-python/pysvn-1.9.18

Description

Object-oriented python bindings for subversion

Added to portage

2022-11-29

python-keyutils - 0.6-r1
Ebuild name:

dev-python/python-keyutils-0.6-r1

Description

A set of python bindings for keyutils

Added to portage

2022-11-29

qbittorrent - 4.5.0
Ebuild name:

net-p2p/qbittorrent-4.5.0

Description

BitTorrent client in C++ and Qt

Added to portage

2022-11-29

remmina - 1.4.27_p20221128
Ebuild name:

net-misc/remmina-1.4.27_p20221128

Description

A GTK+ RDP, SPICE, VNC and SSH client

Added to portage

2022-11-29

resolve-march-native - 2.1.0-r1
Ebuild name:

app-misc/resolve-march-native-2.1.0-r1

Description

Resolve GCC flag -march=native

Added to portage

2022-11-29

servefile - 0.5.3-r1
Ebuild name:

www-servers/servefile-0.5.3-r1

Description

Serve a single file via HTTP

Added to portage

2022-11-29

svn2git - 1.0.18-r1
Ebuild name:

dev-vcs/svn2git-1.0.18-r1

Description

Tool for one-time conversion from svn to git

Added to portage

2022-11-29

svneverever - 1.7.1-r3
Ebuild name:

dev-vcs/svneverever-1.7.1-r3

Description

Tool collecting path entries across SVN history

Added to portage

2022-11-29

telegram-desktop - 4.3.4
Ebuild name:

net-im/telegram-desktop-4.3.4

Description

Official desktop client for Telegram

Added to portage

2022-11-29

virtualenv - 20.17.0
Ebuild name:

dev-python/virtualenv-20.17.0

Description

Virtual Python Environment builder

Added to portage

2022-11-29

vivaldi-snapshot - 5.6.2865.3
Ebuild name:

www-client/vivaldi-snapshot-5.6.2865.3

Description

A browser for our friends

Added to portage

2022-11-29

wiki2beamer - 0.10.0-r2
Ebuild name:

app-text/wiki2beamer-0.10.0-r2

Description

Tool to produce LaTeX Beamer code from wiki-like input

Added to portage

2022-11-29

xalan-c - 1.12-r2
Ebuild name:

dev-libs/xalan-c-1.12-r2

Description

XSLT processor for transforming XML into HTML, text, or other XML types

Added to portage

2022-11-29

ydiff - 1.2-r1
Ebuild name:

dev-util/ydiff-1.2-r1

Description

Colored, side-by-side diff terminal viewer (ex. cdiff)

Added to portage

2022-11-29

zabbix - 5.0.30
Ebuild name:

net-analyzer/zabbix-5.0.30

Description

ZABBIX is software for monitoring of your applications, network and serv

Added to portage

2022-11-29

zabbix - 6.0.11
Ebuild name:

net-analyzer/zabbix-6.0.11

Description

ZABBIX is software for monitoring of your applications, network and serv

Added to portage

2022-11-29

zabbix - 6.2.5
Ebuild name:

net-analyzer/zabbix-6.2.5

Description

ZABBIX is software for monitoring of your applications, network and serve

Added to portage

2022-11-29

zenity - 3.42.1-r1
Ebuild name:

gnome-extra/zenity-3.42.1-r1

Description

Tool to display dialogs from the commandline and shell scripts

Added to portage

2022-11-29

rdf newsfeed | rss newsfeed | Atom newsfeed
- Powered by LeopardCMS - Running on Gentoo -
Copyright 2004-2020 Sascha Nitsch Unternehmensberatung GmbH
Valid XHTML1.1 : Valid CSS : buttonmaker
- Level Triple-A Conformance to Web Content Accessibility Guidelines 1.0 -
- Copyright and legal notices -
Time to create this page: 18.8 ms