from small one page howto to huge articles all in one place

search text in:




Other .linuxhowtos.org sites: www.linuxhowtos.org
toolsntoys.linuxhowtos.org



Last additions:
How to make X listen on port 6000

How to make X listen on port 6000

words:

34

views:

89745

userrating:

average rating: 1.2 (52 votes) (1=very good 6=terrible)


May, 25th 2007:
April, 26th 2007:
Apr, 10th. 2007:
Druckversion . pdf icon
You are here: Portage


Details of net-nds/led:

Description: A general purpose LDAP editor
Homepage:
http://led.sourceforge.net/

available versions:

releasesalphaamd64armhppaia64mipsppcppc64ppc macoss390shsparcx86USE-Flagsdependenciesebuild warnings
led-1.111 -~----~-----~
show
show
Legend:
+ stable
~ testing
- not available
some ebuild warning depend on specific use-flags or architectures, all ebuild-warnings are shown.

Known bugs:
bug IDcomponentassigned tostatusdescriptionlast change
307401ApplicationspachoUNCONFIRMEDmedia-gfx/xsane crashes during startup if xinerama is enabled2012-03-02 11:17:03
339725EbuildsaballierUNCONFIRMEDmedia-sound/lmms fails to build remote_vst_plugin: winebuild: as --32 failed with status 12011-04-19 16:10:52
366779OpenRCopenrcUNCONFIRMEDsys-apps/openrc - "cannot allocate memory" when overcommit is disabled2012-02-27 14:07:23
367375EbuildsnetmonUNCONFIRMEDnet-analyzer/ndoutils-1.4_beta9: "db/" directory from source code is not installed to system2012-02-09 10:57:19
367443Ebuildspolynomial-cUNCONFIRMEDapp-emulation/virtualbox-9999 sets RPATH to /opt/VirtualBox but is installed to /usr/lib/virtualbox2011-05-17 17:41:46
367553Core systembase-systemUNCONFIRMEDnet-misc/openssh - sshd sessions don't get killed when system goes down or reboots2013-02-11 16:00:41
368997Ebuildsarmin76UNCONFIRMEDnet-misc/tightvnc: /etc/ini.d/vnc failes to start when media-fonts/font-misc-misc is installed with 2012-06-23 17:45:55
369207Unspecifiedx11UNCONFIRMEDnum lock LED off after changing from VT to X112011-06-07 15:33:07
369987Ebuildsmedia-tvUNCONFIRMEDapp-misc/lirc-0.9.0 emerge error econf failed2012-07-17 20:43:17
370001EbuildswrobelUNCONFIRMED[kolab overlay] ERROR: net-mail/kolab-resource-handlers-2.1 failed (depend phase): * php-lib.ecla2011-12-31 17:37:47
370703Applicationsmysql-bugsUNCONFIRMEDdev-db/myodbc-5.1.6 - emerge --config fails: odbcinst: SQLWritePrivateProfileString failed with Gene2011-06-10 02:05:40
372049Applicationstools-portageUNCONFIRMEDRequest for app-portage/gentoolkit to show (for a use flag) status of the flag in installed packages2012-12-25 01:55:20
373891EbuildsramerethUNCONFIRMEDnet-misc/stunnel build fails: #error OpenSSL library compiled without thread support2012-12-25 04:27:10
374471LibrarycppUNCONFIRMEDdev-libs/Ice-3.4.1 failed to install2011-07-09 03:07:07
375359ApplicationsschemeUNCONFIRMEDdev-scheme/slib ebuild scripts cannot find installed drscheme2013-02-06 06:05:35
375825Applicationsmaintainer-neededUNCONFIRMEDapp-admin/ulogd-2.0.0_beta4 fails to build with +doc USE flag if latex is not installed2012-09-16 09:14:45
377395Libraryx11UNCONFIRMED[drm:radeon_crtc_page_flip] *ERROR* failed to reserve new rbo buffer before flip2011-08-03 08:59:16
380889Applicationsnet-imUNCONFIRMEDnet-im/sendxmpp-1.20 does not work when dev-perl/XML-Stream-1.22 is installed (1.23 needed)2011-09-01 19:39:25
380957OtheraltUNCONFIRMEDdev-libs/newt: failed to compile on Mac OSX2011-09-13 15:59:04
380959OtheraltUNCONFIRMEDapp-arch/dpkg: failed to compile on Mac OSX2011-10-08 16:59:55
381105Prefix SupportprefixUNCONFIRMEDdev-lang/nasm-2.09.10: failed to compile in prefix/linux-amd642011-08-30 04:04:34
383605Core systemalsa-bugsUNCONFIRMEDmedia-libs/alsa-lib-1.0.23 crash when compiled with sys-devel/gcc-4.4.5 / -O32011-09-20 16:11:19
383867Applicationscron-bugsUNCONFIRMEDsys-process/vixie-cron-4.1-r11 - won't run any scheduled tasks2011-09-21 00:11:06
384401OtheraltUNCONFIRMEDapp-text/texlive-core-2011-r4: failed to compile on prefix/Mac OSX2011-09-25 06:48:07
384581Mac OSXprefixUNCONFIRMEDapp-editors/emacs-23.3-r2: emerge failed with error unexec: my_endbss_static is not in section __bss2011-10-31 03:04:33
385513Developmentmysql-bugsUNCONFIRMEDdev-db/mariadb-5.1.50: failed to compile x86-libs with multilib-overlay enabled2011-10-30 04:20:27
386037DevelopmentqtUNCONFIRMEDapp-crypt/qca-ossl-2.0.0_beta3-r2: fails to build x86-abi with portage-multilib enabled2013-01-12 22:18:36
386565Ebuildsbase-systemUNCONFIRMEDsys-devel/libtool-2.4-r1: failed (emake failed)2011-10-11 05:39:18
387283ApplicationsvoipUNCONFIRMEDFailed to emerge net-voip/linphone-3.3.22012-10-23 16:24:00
388879Servernet-p2pUNCONFIRMEDnet-p2p/mldonkey-3.1.0: Exception setgid failed: Operation not permitted trying to set group_gid2011-11-21 00:31:52
389015Ebuildsmaintainer-wantedUNCONFIRMEDdev-libs/libpki - Provide an easy-to-use PKI library and tools for PKI enabled application developme2011-11-01 15:33:59
389709JavajavaUNCONFIRMEDdev-java/icedtea-7.2.0-r1: failed to emerge due to SIGSEGV in the build process2012-11-02 14:42:48
392727DevelopmentadaUNCONFIRMEDdev-lang/gnat-gcc-4.3.5: fetch failed missing gnatboot-4.3-amd64.tar.bz22012-02-03 18:23:19
393497GNOMEgnomeUNCONFIRMEDgnome-base/gnome-applets-3.2.1 fails to install if sys-apps/linux-misc-apps is installed2012-08-07 17:34:06
395475Core systembase-systemUNCONFIRMEDsys-devel/libtool-2.4.2 fails tests: 8 failed (5 expected failures).2012-05-23 17:17:13
395491Core systemtoolchainUNCONFIRMEDdev-util/dejagnu-1.5 failed (test phase)2013-01-23 05:24:15
395495ApplicationspythonUNCONFIRMEDdev-lang/python-3.2.2 failed (test phase)2011-12-22 08:56:37
397391ApplicationshwoarangUNCONFIRMEDx11-misc/lightdm doesn't work properly with gnome-base/gdm installed.2013-01-22 22:35:59
398089ApplicationstristanUNCONFIRMEDx11-misc/revelation-0.4.11-r2 USE=applet - configure:13842: error: failed to find module gnomeapplet2012-01-10 00:03:01
398295StagesreleaseUNCONFIRMEDstage3-amd64-20120105 has PAGER=/usr/bin/less set but sys-apps/less not installed2013-02-12 19:10:42
401317ApplicationsbluenessUNCONFIRMEDnet-misc/curl-7.24.0: test cases failed: 1007 1009 1049 1093 1094 10992012-03-24 18:04:32
401413Applicationsx11UNCONFIRMEDx11-apps/xdm-1.1.11-r1: elibtoolize called repeatedly2012-01-30 13:03:27
401823Applicationspolynomial-cUNCONFIRMEDseamonkey desktop file lists unhandled mimetype associations2012-02-16 12:48:55
402343Servernet-fsUNCONFIRMEDnet-fs/netatalk /etc/init.d/afpd needs avahi-daemon even if called with -nozeroconf2012-04-08 21:14:32
402681Applicationsmaintainer-neededUNCONFIRMEDapp-editors/cooledit-3.17.17-r1 doesn't honor LINGUAS for locale files2012-02-23 21:38:44
406255Sandboxmaintainer-neededUNCONFIRMEDdev-libs/apr-1.4.6 failed test: testlfs : \/bin/bash: line 2: 3428 Segmentation fault (core d2012-12-29 17:08:08
407681ApplicationspythonUNCONFIRMEDmedia-sound/quodlibet-2.3.92-r1 segfaults when dev-lang/python-2.7.2-r3 is compiled with the hardene2012-10-06 17:14:29
408151LibraryperlUNCONFIRMEDdev-perl/Cairo-1.90.0 with dev-lang/perl-5.14.2 - Failed 1/8 test programs. 6/270 subtests failed.2012-04-03 19:32:36
409295ApplicationsmozillaUNCONFIRMEDmail-client/thunderbird-bin-10.0.2 - HTTP links cannot be opened - Failed to load native module at p2012-03-23 15:08:47
411461OpenRCopenrcUNCONFIRMEDsys-apps/openrc-0.9.8.4: services fail to start at boot because of "stalled" deptree cache2012-04-10 12:21:07
412767Core systemclusterUNCONFIRMEDsys-block/lio-utils-9999 - python_pkg_setup() not called2012-06-18 20:39:15
413167Prefix SupportprefixUNCONFIRMEDsys-fs/fuse-2.9.0: emerge failed at compile phase.2012-04-22 23:17:14
414811PMS/EAPIpms-bugsUNCONFIRMED[Future EAPI] globstar shell option enabled by default2013-02-07 19:03:35
415443Ebuildsmaintainer-wantedUNCONFIRMEDnet-fs/junglediskworkgroup-3.16 - Networked storage/backup using Amazon's S3 service2012-07-28 23:06:49
416047ApplicationsmozillaUNCONFIRMEDdev-libs/nss-3.13.{3,4} - die "Failed to detect whether your arch is 64bits or 32bits, disable distc2012-05-16 02:51:26
416465Prefix SupportprefixUNCONFIRMEDFailed to emerge dev-libs/protobuf-2.4.1 "No suitable threading library available."2012-08-12 20:11:24
416501Prefix SupportprefixUNCONFIRMEDdev-java/jffi-1.0.0 and jffi-1.0.11 failed to build: No rule to make target2012-05-18 14:04:04
417687ApplicationsmozillaUNCONFIRMEDmail-client/thunderbird www-client/seamonkey segfault at startup if nss_ldap/openldap are installed2012-10-22 16:13:48
418115ApplicationsmozillaUNCONFIRMEDwww-client/firefox-12.0-r2 ignores ccache when both ccache and distcc are enabled2012-07-15 05:38:36
418199ApplicationsgrozinUNCONFIRMEDsci-libs/mathgl-1.11.2 install phase - ln: failed to create symbolic link './mathgl-1.11.2/ChangeLog2012-06-04 09:41:36
418287Core systembase-systemUNCONFIRMEDsys-boot/grub-0.97-r11 - Failed Running autoconf ! - configure.ac:59: error: possibly undefined macr2012-10-09 04:21:54
418567Applicationsshell-toolsUNCONFIRMEDapp-misc/byobu-5.18: create session failed: /usr/bin/byobu-shell: Too many open files2013-02-06 16:13:27
419793Prefix SupportprefixUNCONFIRMEDapp-emulation/hercules-3.07: install failed due to chown root2012-08-25 06:35:42
420157Ebuildsnet-p2pUNCONFIRMED${AMULEHOME} do not work for amuled, amuleweb (net-p2p/amule-2.3.1)2013-01-14 23:46:38
420459Enhancement/Feature Requestsdev-portageUNCONFIRMEDemerge --keep-going should leave behind --resume state for skipped/failed builds2012-09-07 04:13:06
420573UnspecifiedhaskellUNCONFIRMEDhaskell-updater wrongly identifies packages as not installed by package manager2012-06-12 18:40:25
421665SandboxsandboxUNCONFIRMEDsys-apps/busybox-1.20.1 fails with sandboxing enabled2012-11-26 17:24:29
421741Developmentrobbat2UNCONFIRMEDdev-vcs/git-1.7.3.4-r1: test t7508-status.sh failed with FEATURES="sandbox -userpriv"2012-06-19 15:11:50
422483ApplicationsjdhoreUNCONFIRMEDdev-lang/pike-7.8.352-r2 multilib-strict check failed!2012-12-21 03:51:15
423031GamesgamesUNCONFIRMEDgames-puzzle/mindless-1.6 crash in generating sealed deck2012-08-27 12:45:23
426306Core systemtoolchainUNCONFIRMEDsys-libs/glibc-2.14.1-r3: tests failed2012-11-10 09:00:26
427572Applicationsapp-backupUNCONFIRMEDapp-backup/boxbackup - man pages are installed in /usr/man2012-07-24 14:08:07
427808EbuildsvoyageurUNCONFIRMEDx11-base/xorg-server-1.12.3 crashing at start-up when compiled with sys-devel/clang2012-12-31 12:32:19
428124Applicationspolynomial-cUNCONFIRMEDapp-emulation/virtualbox-4.1.12: "Failed to create the VirtualBox COM object"2012-09-21 15:25:00
428246Ebuildsmaintainer-wantedUNCONFIRMEDapp-backup/jungledisk-server - offsite managed backup for servers2012-07-28 23:06:49
428650Libraryx11UNCONFIRMEDmedia-libs/mesa-8.1_rc1_pre20120724 - libGL error: failed to authenticate magic 5 // libGL error: fa2012-11-18 08:31:42
428682HardenedhardenedUNCONFIRMEDSystem.map has an incorrect kernel version reported when grsec enabled2012-08-03 15:29:25
430274EbuildspatrickUNCONFIRMEDwww-servers/apache-2.2.22-r1: modules aren't compiled with -fPIC2013-02-16 13:34:26
430318OpenRCopenrcUNCONFIRMEDsys-apps/openrc-0.10.5 fails to remounts reiserfs root file system read only on reboot: failed becau2012-11-07 11:40:40
430348EbuildsradioUNCONFIRMEDnet-wireless/gnuradio-3.6.1-r1 USE="doc" - some documentation is installed outside /usr/share/doc/${2012-08-13 23:02:49
430422ApplicationshannoUNCONFIRMEDapp-emulation/dosemu-1.4.1_pre20091009 : svga USE flag is not handled properly2012-08-08 09:56:45
430498PrintingprintingUNCONFIRMEDnet-print/cups-bjnp-1.0 and net-print/cups-1.6.1: Failed to read side-channel request!2012-08-09 23:40:25
430566DevelopmentembeddedUNCONFIRMEDsys-devel/crossdev installed bashrc doesn't run cross-fix-root when it should2012-08-10 00:43:26
430690EbuildsmattmUNCONFIRMEDnet-libs/wt-3.2.2 - Aborting due to QA concerns: 4 files installed in /tmp/portage/net-libs/wt-3.2.22012-09-17 06:33:36
431986ApplicationsgraphicsUNCONFIRMEDmedia-gfx/luminance-hdr-2.3.0 - crash when loading any hdr file if compiled with -march=core22012-08-20 12:08:47
432224ApplicationsaleUNCONFIRMEDapp-admin/keepass - windows and dialogs have scrambled fonts2013-01-15 16:09:02
432652Applicationsbase-systemUNCONFIRMEDnet-misc/dhcp - dhclient (ipv6) not enabled for ppp devices2012-12-02 10:22:16
432944UnspecifiedperlUNCONFIRMEDperl-gcpan/Math-GSL-0.27 wants to install perl-gcpan/Test-Tester-0.108 which conflics with installed2012-09-17 07:17:25
433708ApplicationsmattmUNCONFIRMEDnet-analyzer/zabbix-2.0.2-r1: Makefiles are erroneously installed in /usr/share/zabbix2012-09-03 17:12:18
433972Prefix SupportprefixUNCONFIRMEDapp-text/tree-1.6.0-r1: failed to compile on Mac OSX Mountain Lion2012-10-10 01:23:24
434222JavajavaUNCONFIRMEDdev-java/ant-ivy-2.0.0 compilation failed2012-09-07 15:04:44
434496Toolstools-portageUNCONFIRMEDapp-portage/gentoolkit-0.3.0.6-r3 - equery crashes on unhandled exception portage.exception.InvalidD2012-09-10 06:45:50
434716DevelopmentpythonUNCONFIRMEDdev-lang/python:2.7 - POSIX_SEMAPHORES_NOT_ENABLED 1 in /usr/include/python2.7/pyconfig.h2012-09-11 15:18:37
434922HardenedhardenedUNCONFIRMEDnet-fs/openafs-1.6.1 doesn't built with sys-kernel/hardened-sources with grsecurity/PaX enabled2013-02-10 14:52:43
435334Applicationsqmail-bugsUNCONFIRMEDmail-mta/netqmail-1.06 - pkg_postinst(): queue-repair failed2012-10-14 19:09:10
435534ApplicationsqemuUNCONFIRMEDapp-emulation/qemu-kvm-1.1.1-r1 - manual pages are not installed2012-11-30 12:14:46
436122Ebuildsnet-dialupUNCONFIRMEDnet-dialup/ppp-2.4.5-r3 - Failed Patch: 80_all_eaptls-mppe-0.991-gentoo.patch !2012-11-09 04:09:40
436290KDEkdeUNCONFIRMEDkde-base/okular-4.9.1 - hpcups[7483]: prnt/hpcups/HPCupsFilter.cpp 536: cupsRasterOpen failed, fd = 2013-01-10 19:35:12
437020Prefix SupportprefixUNCONFIRMEDbootstrap-prefix failed on gcc-4.2.4 in stage 32012-10-03 15:44:28
437258Applicationsmedia-videoUNCONFIRMEDmedia-video/vlc-9999 - Failed Patch: 300_all_pic.patch !2012-10-06 13:33:40
437590Libraryx11UNCONFIRMEDmedia-libs/mesa-9.0_pre20120918: libGL error: failed to load driver: nouveau with a ATI graphic cont2012-10-24 20:57:35
438314Ebuildsvincent.hardy.beUNCONFIRMEDapp-crypt/eid-mw - misspelled metadata2012-10-15 11:09:16
438930Ebuildspolynomial-cUNCONFIRMEDapp-emulation/virtualbox-4.2 USE=vnc - vnc module is built but not installed2012-12-21 18:07:10
439246ApplicationsgnomeUNCONFIRMEDmedia-gfx/gthumb-3.0.0 - segmentation fault in strlen(""), called from g_str_has_prefix at gstrfuncs2012-11-19 23:40:51
439504Core systembase-systemUNCONFIRMEDnet-misc/ethercard-diag - command is called ether-wake but man page is called etherwake2012-10-24 15:15:54
439614GNOMErobbat2UNCONFIRMEDsys-apps/vbetool-1.1: Failed Running automake2013-02-06 22:06:33
440214EbuildsqaUNCONFIRMED[tracker] packages with emerge messages that can be improved by checking the previous installed vers2013-02-14 19:45:48
440218Conceptual/Abstract Ideaspms-bugsUNCONFIRMEDportage should have a ebuild-accessible variable for the USE flags of previously-installed versions2012-10-30 16:30:36
440794ApplicationsdilfridgeUNCONFIRMEDmedia-gfx/digikam 2.9.0 - digikam (core): Failed to detect camera with GPhoto2 from Solid (canon ixu2013-01-27 16:08:36
442092ApplicationsspingUNCONFIRMEDmedia-gfx/gimp-9999 - Portage patch failed to apply (ltmain.sh version 2.4.2)!2012-11-10 00:24:49
442120KDEkdeUNCONFIRMED[kde overlay] please add caledonia kdm-theme2012-11-07 02:08:16
442162ApplicationsdjcUNCONFIRMEDnet-misc/openvpn-2.1.4 - src_install: rmdir: failed to remove ‘/var/tmp/portage/net-misc/openvpn-2.12012-11-07 14:09:59
442616DevelopmentdjcUNCONFIRMEDdev-db/couchdb - /usr/lib/couchdb/bin/couchjs needs pax-mark mr on PaX-enabled systems.2013-01-12 18:34:44
443728EbuildshwoarangUNCONFIRMEDapp-laptop/prey-0.5.4-r1: /etc/init.d/prey-trigger is installed as invalid symlink, first run attemp2013-01-15 19:43:12
443856Applicationsmaintainer-neededUNCONFIRMEDmedia-gfx/splashutils-1.5.4.4-r2 failed to build - asm/posix_types.h: No such file or directory2013-01-27 08:05:31
444218ApplicationspatrickUNCONFIRMEDwww-servers/apache-2.4.3 - init script doesn't handle failed start correctly2013-02-16 13:19:08
444918FreeBSDbsdUNCONFIRMEDapp-arch/libarchive-3.0.4-r1 -- getvfsbyname failed error occurs, doesn't work in x86 chroot on amd62013-01-15 12:22:54
445120LibrarypatrickUNCONFIRMEDsys-libs/tdb-1.2.10 - Compilatin phase failed - [Errno 2] No such file or directory: '/var/tmp/porta2012-12-08 15:46:16
446172Core systempam-bugsUNCONFIRMEDsys-libs/pam-1.1.5 fails to cross-compile because flex is not installed in the target2013-01-09 09:31:35
446850HardenedhardenedUNCONFIRMEDthunderbird-17.0-r2 fails to install with CONFIG_PAX_MPROTECT enabled2012-12-14 17:52:48
447556Mac OSXprefixUNCONFIRMEDdev-python/virtualenv-1.8.4 emerge failed with error virtualenv-3.3 already exists2013-01-19 18:48:58
447904GamesgamesUNCONFIRMEDBuild games-rpg/pcgen from source with fewer bundled libraries2012-12-20 05:10:59
448770GNOMEgnomeUNCONFIRMED[gnome overlay] app-accessibility/at-spi2-atk-9999 fails to build due to failed patch "at-spi2-atk-2012-12-27 05:56:05
448772GNOMEgnomeUNCONFIRMED[gnome overlay] x11-libs/gtk+-9999 fails to build due to failed patch "gtk+-3.3.18-fallback-theme.2012-12-27 05:55:29
448780DevelopmentrubyUNCONFIRMED=dev-ruby/webmock-1.7.4 - Many tests failed.2013-02-20 06:24:05
449232ApplicationssciUNCONFIRMED[science overlay] sci-libs/cholmod-2.0.1: pkg-config fails to find lapack libraries installed from s2013-01-29 19:26:55
449352Gamesrich0UNCONFIRMEDgames-rpg/eternal-lands Assertion `self' failed (runtime error)2013-01-03 00:24:17
451456LibraryqtUNCONFIRMED[qt overlay] Qt5 packages try to link against already installed versions during recompilation2013-02-14 11:59:11
451478Core systemrobbat2UNCONFIRMEDsys-fs/lvm2 - /etc/init.d/lvm should support multiple volume groups - Command failed with status cod2013-01-31 02:20:00
451504ApplicationsmozillaUNCONFIRMEDwww-client/firefox-18.0/www-client/seamonkey-2.15 failed (install phase) [to emerge]; incorrect pag2013-02-07 15:47:44
451622Core systembase-systemUNCONFIRMEDsys-apps/man-db-2.6.3-r1[nls]: Translated manpages will not be installed if app-text/po4a is not ins2013-01-15 12:05:38
452578DevelopmentyamakuzureUNCONFIRMED[seden overlay] dev-util/eclipse-sdk-3.7.1-r9 fails to start when 2013-01-17 09:24:25
452622LibrarysciUNCONFIRMEDdev-python/pytables needs to be recompiled for the exact sci-libs/hdf5 version.2013-01-18 20:03:31
452874Applicationslu_zeroUNCONFIRMEDmedia-video/mplayer-1.1 - mplayer-1.1-libav-9.patch introducing enum AVPixelFormat, should be called2013-02-18 15:15:08
452900DevelopmenttommyUNCONFIRMEDdev-vcs/subversion-1.7.7 when rubygems isn't installed for ruby18 - .../work/subversion-1.7.7/libtoo2013-01-21 11:54:22
454062Applicationsshell-toolsUNCONFIRMEDapp-misc/byobu-5.27 - create window failed: /bin/bash no such file or directory2013-02-06 16:13:05
454508FreeBSDbsdUNCONFIRMEDfreebsd-rescue-9.1: Fail to link in environment that dev-util/pkgconfig-0.28 is installed.2013-01-29 11:31:19
455134Applicationsgnome-officeUNCONFIRMEDapp=office/gnucash with dev-db/libdbi - "The library "libdbi" installed on your system doesn't corre2013-02-12 19:39:30
455226Prefix SupportprefixUNCONFIRMEDprefix has python3_2 enabled but no python:3.2 ebuilds2013-02-03 02:45:11
455238LibraryprintingUNCONFIRMEDmedia-libs/vigra-1.7.1-r1 failed (compile phase): ImportError: No module named nose2013-02-05 01:00:18
455890Core systemlivecdUNCONFIRMEDsys-block/parted - parted binary should be installed in /usr/bin2013-02-07 02:12:12
456024ApplicationsnikoliUNCONFIRMEDmedia-sound/clementine 1.1.1 crashes with 0 size .mood file when moodbar is enabled in the playlist2013-02-07 14:14:11
456172ApplicationstommyUNCONFIRMEDdev-vcs/subversion-(1.7.* ?) needs dev-db/sqlite:3 to be compiled with threadsafe2013-02-11 11:20:24
456784ApplicationslxnayUNCONFIRMED[sabayon overlay] net-wireless/blueman-1.23-r2: Failed Patch: blueman-1.21-fix-segfault-startup.patc2013-02-12 15:10:18
456908Core systempam-bugsUNCONFIRMEDsys-libs/pam-1.1.6-r2: /usr/lib64/portage/bin/isolated-functions.sh: line 215: wait: `Failed Running2013-02-16 21:10:14
456932JavajavaUNCONFIRMEDERROR: dev-java/netbeans-javafx-7.2 failed (compile phase)2013-02-13 20:19:37
456970Applicationshardened-kernelUNCONFIRMEDapp-editors/emacs-24.2 failed to emerge with a segmentation fault on hardened-sources-3.7.4-r12013-02-12 22:17:52
457010ApplicationsfloppymUNCONFIRMEDnet-misc/flexget-1.0.3344: BUG: Unhandled error in plugin --series: Only '='/'!=' operators can be u2013-02-17 18:32:40
457588ApplicationsxboxUNCONFIRMEDmedia-tv/xbmc-11.0 with a PaX kernel - xbmc.bin: LLVM ERROR: Allocation failed when allocating new m2013-02-15 15:39:36
457732KDEkdeUNCONFIRMEDkde-base/kwin - Hyperthreading enabled + Java = Kwin unresponsive2013-02-17 17:49:19
457768Core systembase-systemUNCONFIRMEDeselect-sh should be pulled in by @system or virtual/shell or app-shells/* or (...)2013-02-18 05:52:51
458022Core systemryaoUNCONFIRMEDsys-block/iscsitarget-1.4.20.2 - 1 out of 1 hunk FAILED -- saving rejects to file kernel/conn.c.rej2013-02-17 19:02:08
458148Unclassifieddev-portageUNCONFIRMEDdev-libs/cyrus-sasl-2.1.25-r4: gzip: stdout: Broken pipe - phase-helpers.sh, line 312: Called __as2013-02-20 22:52:41
458262baselayoutrobbat2UNCONFIRMEDsys-fs/lvm2 Failed to find sysfs mount point when starting2013-02-20 16:20:15
458478LibraryyngwinUNCONFIRMEDx11-libs/cairo-9999 failed because cairo-1.10.2-qt-surface.patch outdated2013-02-20 21:19:46
458598Applicationsbug-wranglersUNCONFIRMED[media-gfx/asymptote-2.21] emerge failed with USE="doc latex"2013-02-21 14:49:39


back



Support us on Content Nation

New Packages

- as rdf newsfeed
- as rss newsfeed
- as Atom newsfeed
2026-11-01
86Box - 6.0-r1
Ebuild name:

app-emulation/86Box-6.0-r1

Description

Emulator of x86-based machines based on PCem

Added to portage

2026-11-01

AusweisApp - 2.6.2
Ebuild name:

sys-auth/AusweisApp-2.6.2

Description

Official authentication app for German ID cards and residence permits

Added to portage

2026-11-01

DBD-Pg - 3.21.2
Ebuild name:

dev-perl/DBD-Pg-3.21.2

Description

PostgreSQL database driver for the DBI module

Added to portage

2026-11-01

DBI - 1.655.0
Ebuild name:

dev-perl/DBI-1.655.0

Description

Database independent interface for Perl

Added to portage

2026-11-01

ExtUtils-Typemaps-Default - 1.70.0
Ebuild name:

dev-perl/ExtUtils-Typemaps-Default-1.70.0

Description

Set of useful typemaps

Added to portage

2026-11-01

Net-DNS - 1.570.0
Ebuild name:

dev-perl/Net-DNS-1.570.0

Description

Perl Interface to the Domain Name System

Added to portage

2026-11-01

bedrock-server - 1.26.61.1
Ebuild name:

games-server/bedrock-server-1.26.61.1

Description

The official bedrock (non-java) based server for the sandbox

Added to portage

2026-11-01

boost - 1.90.0-r3
Ebuild name:

dev-libs/boost-1.90.0-r3

Description

Boost Libraries for C++

Added to portage

2026-11-01

boost - 1.91.0-r3
Ebuild name:

dev-libs/boost-1.91.0-r3

Description

Boost Libraries for C++

Added to portage

2026-11-01

boost - 1.92.0-r1
Ebuild name:

dev-libs/boost-1.92.0-r1

Description

Boost Libraries for C++

Added to portage

2026-11-01

corsix-th - 0.70.0-r3
Ebuild name:

games-simulation/corsix-th-0.70.0-r3

Description

Open source clone of Theme Hospital

Added to portage

2026-11-01

corsix-th - 0.70.1-r1
Ebuild name:

games-simulation/corsix-th-0.70.1-r1

Description

Open source clone of Theme Hospital

Added to portage

2026-11-01

cyrus-sasl - 2.1.28-r6
Ebuild name:

dev-libs/cyrus-sasl-2.1.28-r6

Description

The Cyrus SASL (Simple Authentication and Security Layer)

Added to portage

2026-11-01

distrobuilder - 3.4.0
Ebuild name:

app-containers/distrobuilder-3.4.0

Description

System container image builder for LXC and incus

Added to portage

2026-11-01

drgn - 0.3.0
Ebuild name:

dev-debug/drgn-0.3.0

Description

Programmable debugger

Added to portage

2026-11-01

elixir - 1.16.3-r3
Ebuild name:

dev-lang/elixir-1.16.3-r3

Description

Elixir programming language

Added to portage

2026-11-01

elixir - 1.17.3-r3
Ebuild name:

dev-lang/elixir-1.17.3-r3

Description

Elixir programming language

Added to portage

2026-11-01

elixir - 1.18.6
Ebuild name:

dev-lang/elixir-1.18.6

Description

Elixir programming language

Added to portage

2026-11-01

elixir - 1.19.7
Ebuild name:

dev-lang/elixir-1.19.7

Description

Elixir programming language

Added to portage

2026-11-01

elixir - 1.20.5
Ebuild name:

dev-lang/elixir-1.20.5

Description

Elixir programming language

Added to portage

2026-11-01

haml - 7.5.1
Ebuild name:

dev-ruby/haml-7.5.1

Description

A ruby web page templating engine

Added to portage

2026-11-01

hypopg - 1.4.4
Ebuild name:

dev-db/hypopg-1.4.4

Description

Hypothetical Indexes for PostgreSQL

Added to portage

2026-11-01

intel-compute-runtime - 26.40.40196.15
Ebuild name:

dev-libs/intel-compute-runtime-26.40.40196.15

Description

Intel Graphics Compute Runtime for oneAPI Level Zero

Added to portage

2026-11-01

intel-metrics-discovery - 1.16.199
Ebuild name:

dev-libs/intel-metrics-discovery-1.16.199

Description

A user mode library that provides access to GPU performan

Added to portage

2026-11-01

intel-metrics-library - 1.0.248
Ebuild name:

dev-libs/intel-metrics-library-1.0.248

Description

User mode driver helper library that provides access to GPU

Added to portage

2026-11-01

intel-vc-intrinsics - 0.26.0
Ebuild name:

dev-libs/intel-vc-intrinsics-0.26.0

Description

A set of new intrinsics on top of core LLVM IR instructions

Added to portage

2026-11-01

just - 1.59.0
Ebuild name:

dev-build/just-1.59.0

Description

Just a command runner (with syntax inspired by 'make')

Added to portage

2026-11-01

keylookup - 2.2-r1
Ebuild name:

app-crypt/keylookup-2.2-r1

Description

A tool to fetch PGP keys from keyservers

Added to portage

2026-11-01

level-zero - 1.35.0
Ebuild name:

dev-libs/level-zero-1.35.0

Description

oneAPI Level Zero headers, loader and validation layer

Added to portage

2026-11-01

libgsf - 1.14.59
Ebuild name:

gnome-extra/libgsf-1.14.59

Description

The GNOME Structured File Library

Added to portage

2026-11-01

libupnp - 22.1.10
Ebuild name:

net-libs/libupnp-22.1.10

Description

An Portable Open Source UPnP Development Kit

Added to portage

2026-11-01

metalog - 20260902
Ebuild name:

app-admin/metalog-20260902

Description

Highly configurable replacement for syslogd/klogd

Added to portage

2026-11-01

metee - 6.2.6
Ebuild name:

dev-libs/metee-6.2.6

Description

Cross-platform access library for Intel CSME HECI interface

Added to portage

2026-11-01

milkytracker - 1.05.01-r1
Ebuild name:

media-sound/milkytracker-1.05.01-r1

Description

FastTracker 2 inspired music tracker

Added to portage

2026-11-01

mozc - 3.35.6354
Ebuild name:

app-i18n/mozc-3.35.6354

Description

Japanese input method editor

Added to portage

2026-11-01

mutter - 50.6
Ebuild name:

x11-wm/mutter-50.6

Description

GNOME compositing window manager based on Clutter

Added to portage

2026-11-01

mycli - 2.30.2
Ebuild name:

dev-db/mycli-2.30.2

Description

CLI for MySQL Database with auto-completion and syntax highlighting

Added to portage

2026-11-01

mysqltuner - 2.9.3
Ebuild name:

dev-db/mysqltuner-2.9.3

Description

Makes recommendations for increased performance and stability for MySQL

Added to portage

2026-11-01

nautilus - 50.4
Ebuild name:

gnome-base/nautilus-50.4

Description

Default file manager for the GNOME desktop

Added to portage

2026-11-01

ogre - 14.6.2
Ebuild name:

dev-games/ogre-14.6.2

Description

Object-oriented Graphics Rendering Engine

Added to portage

2026-11-01

pytest-bdd - 9.0.1
Ebuild name:

dev-python/pytest-bdd-9.0.1

Description

BDD library for the pytest runner

Added to portage

2026-11-01

python-rtmidi - 1.5.8-r1
Ebuild name:

dev-python/python-rtmidi-1.5.8-r1

Description

Python bindings for media-libs/rtmidi implemented using Cython

Added to portage

2026-11-01

rtmidi - 6.0.0-r1
Ebuild name:

media-libs/rtmidi-6.0.0-r1

Description

A set of C++ classes that provide a common API for realtime MIDI input/o

Added to portage

2026-11-01

rtmidi - 6.1.0
Ebuild name:

media-libs/rtmidi-6.1.0

Description

A set of C++ classes that provide a common API for realtime MIDI input/outp

Added to portage

2026-11-01

spsdeclib - 5.21
Ebuild name:

dev-libs/spsdeclib-5.21

Description

Kryoflux SPS Decoder Library

Added to portage

2026-11-01

strace - 7.3
Ebuild name:

dev-debug/strace-7.3

Description

Useful diagnostic, instructional, and debugging tool

Added to portage

2026-11-01

texstudio - 4.9.9
Ebuild name:

app-office/texstudio-4.9.9

Description

Free cross-platform LaTeX editor (fork from texmakerX)

Added to portage

2026-11-01

unifi - 10.6.109
Ebuild name:

net-wireless/unifi-10.6.109

Description

A Management Controller for Ubiquiti Networks UniFi APs

Added to portage

2026-11-01

unrar - 7.3.2
Ebuild name:

app-arch/unrar-7.3.2

Description

Uncompress rar files

Added to portage

2026-11-01

xmlsec - 1.3.13
Ebuild name:

dev-libs/xmlsec-1.3.13

Description

Command line tool for signing, verifying, encrypting and decrypting XML

Added to portage

2026-11-01

2026-10-31
MIME-tools - 5.522.0
Ebuild name:

dev-perl/MIME-tools-5.522.0

Description

A Perl module for parsing and creating MIME entities

Added to portage

2026-10-31

Text-CSV_XS - 1.650.0
Ebuild name:

dev-perl/Text-CSV_XS-1.650.0

Description

Comma-separated values manipulation routines

Added to portage

2026-10-31

aws-sam-translator - 1.116.0
Ebuild name:

dev-python/aws-sam-translator-1.116.0

Description

A library that transform SAM templates into AWS CloudFormatio

Added to portage

2026-10-31

aws-xray-sdk - 2.16.0
Ebuild name:

dev-python/aws-xray-sdk-2.16.0

Description

AWS X-Ray SDK for Python

Added to portage

2026-10-31

awscli - 2.39.3
Ebuild name:

app-admin/awscli-2.39.3

Description

Universal Command Line Environment for AWS

Added to portage

2026-10-31

boto3 - 1.43.123
Ebuild name:

dev-python/boto3-1.43.123

Description

The AWS SDK for Python

Added to portage

2026-10-31

botocore - 1.43.123
Ebuild name:

dev-python/botocore-1.43.123

Description

Low-level, data-driven core of boto 3

Added to portage

2026-10-31

c-blosc2 - 3.4.1
Ebuild name:

dev-libs/c-blosc2-3.4.1

Description

Blocking, shuffling and lossless compression library

Added to portage

2026-10-31

chrome-binary-plugins - 156.0.8078.79
Ebuild name:

www-plugins/chrome-binary-plugins-156.0.8078.79

Description

Binary plugins from Google Chrome for use in Chromi

Added to portage

2026-10-31

chrome-binary-plugins - 158.0.8127.2_beta
Ebuild name:

www-plugins/chrome-binary-plugins-158.0.8127.2_beta

Description

Binary plugins from Google Chrome for use in Ch

Added to portage

2026-10-31

chrome-binary-plugins - 159.0.8130.0_alpha
Ebuild name:

www-plugins/chrome-binary-plugins-159.0.8130.0_alpha

Description

Binary plugins from Google Chrome for use in C

Added to portage

2026-10-31

chromedriver-bin - 156.0.8078.79
Ebuild name:

www-apps/chromedriver-bin-156.0.8078.79

Description

WebDriver for Chrome

Added to portage

2026-10-31

conky - 1.26.0
Ebuild name:

app-admin/conky-1.26.0

Description

An advanced, highly configurable system monitor for X

Added to portage

2026-10-31

createrepo_c - 1.2.6
Ebuild name:

app-arch/createrepo_c-1.2.6

Description

C implementation of createrepo

Added to portage

2026-10-31

deprecated - 3.0.1
Ebuild name:

dev-python/deprecated-3.0.1

Description

Python @deprecated decorator to deprecate old API

Added to portage

2026-10-31

dist-kernel - 6.1.191
Ebuild name:

virtual/dist-kernel-6.1.191

Description

Virtual to depend on any Distribution Kernel

Added to portage

2026-10-31

dist-kernel - 6.12.115
Ebuild name:

virtual/dist-kernel-6.12.115

Description

Virtual to depend on any Distribution Kernel

Added to portage

2026-10-31

dist-kernel - 6.18.60
Ebuild name:

virtual/dist-kernel-6.18.60

Description

Virtual to depend on any Distribution Kernel

Added to portage

2026-10-31

dist-kernel - 6.6.161
Ebuild name:

virtual/dist-kernel-6.6.161

Description

Virtual to depend on any Distribution Kernel

Added to portage

2026-10-31

dist-kernel - 7.2.14
Ebuild name:

virtual/dist-kernel-7.2.14

Description

Virtual to depend on any Distribution Kernel

Added to portage

2026-10-31

dist-kernel - 7.3.1
Ebuild name:

virtual/dist-kernel-7.3.1

Description

Virtual to depend on any Distribution Kernel

Added to portage

2026-10-31

dominate - 3.1.0
Ebuild name:

dev-python/dominate-3.1.0

Description

Library for creating and manipulating HTML documents using an elegant DOM

Added to portage

2026-10-31

dwl - 0.8
Ebuild name:

gui-wm/dwl-0.8

Description

dwm for Wayland

Added to portage

2026-10-31

dwl - 0.9
Ebuild name:

gui-wm/dwl-0.9

Description

dwm for Wayland

Added to portage

2026-10-31

dzip - 3.2
Ebuild name:

games-util/dzip-3.2

Description

compressor/uncompressor for demo recordings from id's Quake

Added to portage

2026-10-31

efl - 1.29.0
Ebuild name:

dev-libs/efl-1.29.0

Description

Enlightenment Foundation Libraries all-in-one package

Added to portage

2026-10-31

enlightenment - 0.28.0
Ebuild name:

x11-wm/enlightenment-0.28.0

Description

Enlightenment window manager

Added to portage

2026-10-31

ffmpeg-chromium - 155.0.8059.85
Ebuild name:

media-video/ffmpeg-chromium-155.0.8059.85

Description

FFmpeg built specifically for codec support in Chromium-b

Added to portage

2026-10-31

ffmpeg-chromium - 156.0.8078.35
Ebuild name:

media-video/ffmpeg-chromium-156.0.8078.35

Description

FFmpeg built specifically for codec support in Chromium-b

Added to portage

2026-10-31

ffmpeg-chromium - 9999
Ebuild name:

media-video/ffmpeg-chromium-9999

Description

FFmpeg built specifically for codec support in Chromium-based brow

Added to portage

2026-10-31

filelock - 4.2.5
Ebuild name:

dev-python/filelock-4.2.5

Description

A platform independent file lock for Python

Added to portage

2026-10-31

gentoo-kernel - 6.1.191
Ebuild name:

sys-kernel/gentoo-kernel-6.1.191

Description

Linux kernel built with Gentoo patches

Added to portage

2026-10-31

gentoo-kernel - 6.12.115
Ebuild name:

sys-kernel/gentoo-kernel-6.12.115

Description

Linux kernel built with Gentoo patches

Added to portage

2026-10-31

gentoo-kernel - 6.18.60
Ebuild name:

sys-kernel/gentoo-kernel-6.18.60

Description

Linux kernel built with Gentoo patches

Added to portage

2026-10-31

gentoo-kernel - 6.6.161
Ebuild name:

sys-kernel/gentoo-kernel-6.6.161

Description

Linux kernel built with Gentoo patches

Added to portage

2026-10-31

gentoo-kernel - 7.2.14
Ebuild name:

sys-kernel/gentoo-kernel-7.2.14

Description

Linux kernel built with Gentoo patches

Added to portage

2026-10-31

gentoo-kernel - 7.3.1
Ebuild name:

sys-kernel/gentoo-kernel-7.3.1

Description

Linux kernel built with Gentoo patches

Added to portage

2026-10-31

gentoo-kernel-bin - 6.1.191
Ebuild name:

sys-kernel/gentoo-kernel-bin-6.1.191

Description

Pre-built Linux kernel with Gentoo patches

Added to portage

2026-10-31

gentoo-kernel-bin - 6.12.115
Ebuild name:

sys-kernel/gentoo-kernel-bin-6.12.115

Description

Pre-built Linux kernel with Gentoo patches

Added to portage

2026-10-31

gentoo-kernel-bin - 6.18.60
Ebuild name:

sys-kernel/gentoo-kernel-bin-6.18.60

Description

Pre-built Linux kernel with Gentoo patches

Added to portage

2026-10-31

gentoo-kernel-bin - 6.6.161
Ebuild name:

sys-kernel/gentoo-kernel-bin-6.6.161

Description

Pre-built Linux kernel with Gentoo patches

Added to portage

2026-10-31

gentoo-kernel-bin - 7.2.14
Ebuild name:

sys-kernel/gentoo-kernel-bin-7.2.14

Description

Pre-built Linux kernel with Gentoo patches

Added to portage

2026-10-31

gentoo-kernel-bin - 7.3.1
Ebuild name:

sys-kernel/gentoo-kernel-bin-7.3.1

Description

Pre-built Linux kernel with Gentoo patches

Added to portage

2026-10-31

gentoo-kernel-modprep - 6.1.191
Ebuild name:

sys-kernel/gentoo-kernel-modprep-6.1.191

Description

Minimal subset of gentoo-kernel-bin for building modules,

Added to portage

2026-10-31

gentoo-kernel-modprep - 6.12.115
Ebuild name:

sys-kernel/gentoo-kernel-modprep-6.12.115

Description

Minimal subset of gentoo-kernel-bin for building modules,

Added to portage

2026-10-31

gentoo-kernel-modprep - 6.18.60
Ebuild name:

sys-kernel/gentoo-kernel-modprep-6.18.60

Description

Minimal subset of gentoo-kernel-bin for building modules,

Added to portage

2026-10-31

gentoo-kernel-modprep - 6.6.161
Ebuild name:

sys-kernel/gentoo-kernel-modprep-6.6.161

Description

Minimal subset of gentoo-kernel-bin for building modules,

Added to portage

2026-10-31

gentoo-kernel-modprep - 7.2.14
Ebuild name:

sys-kernel/gentoo-kernel-modprep-7.2.14

Description

Minimal subset of gentoo-kernel-bin for building modules, f

Added to portage

2026-10-31

gentoo-kernel-modprep - 7.3.1
Ebuild name:

sys-kernel/gentoo-kernel-modprep-7.3.1

Description

Minimal subset of gentoo-kernel-bin for building modules, fo

Added to portage

2026-10-31

geos - 3.15.0
Ebuild name:

sci-libs/geos-3.15.0

Description

Geometry engine library for Geographic Information Systems

Added to portage

2026-10-31

gnome-shell - 50.6
Ebuild name:

gnome-base/gnome-shell-50.6

Description

Provides core UI functions for the GNOME desktop

Added to portage

2026-10-31

google-chrome - 156.0.8078.79
Ebuild name:

www-client/google-chrome-156.0.8078.79

Description

The web browser from Google

Added to portage

2026-10-31

google-chrome-beta - 158.0.8127.2
Ebuild name:

www-client/google-chrome-beta-158.0.8127.2

Description

The web browser from Google

Added to portage

2026-10-31

google-chrome-unstable - 159.0.8130.0
Ebuild name:

www-client/google-chrome-unstable-159.0.8130.0

Description

The web browser from Google

Added to portage

2026-10-31

grpcio - 1.85.1
Ebuild name:

dev-python/grpcio-1.85.1

Description

HTTP/2-based RPC framework

Added to portage

2026-10-31

grpcio-status - 1.85.1
Ebuild name:

dev-python/grpcio-status-1.85.1

Description

Reference package for GRPC Python status proto mapping

Added to portage

2026-10-31

hypothesis - 6.170.14
Ebuild name:

dev-python/hypothesis-6.170.14

Description

A library for property based testing

Added to portage

2026-10-31

incus - 7.0.2-r1
Ebuild name:

app-containers/incus-7.0.2-r1

Description

Modern, secure and powerful system container and virtual machine mana

Added to portage

2026-10-31

incus - 7.6
Ebuild name:

app-containers/incus-7.6

Description

Modern, secure and powerful system container and virtual machine manager

Added to portage

2026-10-31

iniparse - 0.5.2
Ebuild name:

dev-python/iniparse-0.5.2

Description

Better INI parser for Python

Added to portage

2026-10-31

intellij-idea - 2026.2.4
Ebuild name:

dev-util/intellij-idea-2026.2.4

Description

A complete toolset for web, mobile and enterprise development

Added to portage

2026-10-31

keylookup - 2.2-r1
Ebuild name:

app-crypt/keylookup-2.2-r1

Description

A tool to fetch PGP keys from keyservers

Added to portage

2026-10-31

labwc - 0.20.3
Ebuild name:

gui-wm/labwc-0.20.3

Description

Openbox alternative for wayland

Added to portage

2026-10-31

labwc-menu-generator - 0.2.0
Ebuild name:

gui-apps/labwc-menu-generator-0.2.0

Description

Simple, lightweight, Labwc/Openbox XML-menu generator

Added to portage

2026-10-31

labwc-menu-generator - 9999
Ebuild name:

gui-apps/labwc-menu-generator-9999

Description

Simple, lightweight, Labwc/Openbox XML-menu generator

Added to portage

2026-10-31

libarchive - 3.8.11
Ebuild name:

app-arch/libarchive-3.8.11

Description

Multi-format archive and compression library

Added to portage

2026-10-31

libhx - 5.5
Ebuild name:

sys-libs/libhx-5.5

Description

Platform independent library providing basic system functions

Added to portage

2026-10-31

libzia - 4.75
Ebuild name:

dev-libs/libzia-4.75

Description

Platform abstraction code for tucnak package

Added to portage

2026-10-31

linode-cli - 5.70.0
Ebuild name:

app-admin/linode-cli-5.70.0

Description

Official command-line interface for interacting with the Linode API

Added to portage

2026-10-31

linode-metadata - 0.4.0-r1
Ebuild name:

dev-python/linode-metadata-0.4.0-r1

Description

Python bindings for the Linode Metadata Service

Added to portage

2026-10-31

loop-aes - 3.8j
Ebuild name:

sys-fs/loop-aes-3.8j

Description

Linux kernel module to encrypt disk partitions with AES cipher

Added to portage

2026-10-31

m17n-db - 1.8.16
Ebuild name:

dev-db/m17n-db-1.8.16

Description

Database for the m17n library

Added to portage

2026-10-31

mac - 13.45
Ebuild name:

media-sound/mac-13.45

Description

Monkey's Audio Codecs

Added to portage

2026-10-31

makemkv - 1.18.4
Ebuild name:

media-video/makemkv-1.18.4

Description

Tool for ripping and streaming Blu-ray, HD-DVD and DVD discs

Added to portage

2026-10-31

microsoft-edge - 156.0.4314.58
Ebuild name:

www-client/microsoft-edge-156.0.4314.58

Description

The web browser from Microsoft

Added to portage

2026-10-31

microsoft-edge-beta - 157.0.4341.16
Ebuild name:

www-client/microsoft-edge-beta-157.0.4341.16

Description

The web browser from Microsoft

Added to portage

2026-10-31

microsoft-edge-beta - 157.0.4341.24
Ebuild name:

www-client/microsoft-edge-beta-157.0.4341.24

Description

The web browser from Microsoft

Added to portage

2026-10-31

microsoft-edge-beta - 157.0.4341.30
Ebuild name:

www-client/microsoft-edge-beta-157.0.4341.30

Description

The web browser from Microsoft

Added to portage

2026-10-31

microsoft-edge-dev - 158.0.4357.0
Ebuild name:

www-client/microsoft-edge-dev-158.0.4357.0

Description

The web browser from Microsoft

Added to portage

2026-10-31

neon - 0.37.1
Ebuild name:

net-libs/neon-0.37.1

Description

HTTP and WebDAV client library

Added to portage

2026-10-31

nicotine+ - 3.3.11
Ebuild name:

net-p2p/nicotine+-3.3.11

Description

Graphical client for the Soulseek peer to peer network written in Python

Added to portage

2026-10-31

notebook - 7.6.4
Ebuild name:

dev-python/notebook-7.6.4

Description

Jupyter Interactive Notebook

Added to portage

2026-10-31

onlyoffice-bin - 10.0.0
Ebuild name:

app-office/onlyoffice-bin-10.0.0

Description

A free and open source office and productivity suite (binary versi

Added to portage

2026-10-31

opera - 139.0.6053.22
Ebuild name:

www-client/opera-139.0.6053.22

Description

A fast and secure web browser

Added to portage

2026-10-31

opera-developer - 140.0.6066.0
Ebuild name:

www-client/opera-developer-140.0.6066.0

Description

A fast and secure web browser

Added to portage

2026-10-31

opera-gx - 137.0.6036.65
Ebuild name:

www-client/opera-gx-137.0.6036.65

Description

Opera, but for 'gamers'

Added to portage

2026-10-31

opera-gx - 138.0.6044.45
Ebuild name:

www-client/opera-gx-138.0.6044.45

Description

Opera, but for 'gamers'

Added to portage

2026-10-31

opera-gx - 138.0.6044.65
Ebuild name:

www-client/opera-gx-138.0.6044.65

Description

Opera, but for 'gamers'

Added to portage

2026-10-31

pam_mount - 2.23
Ebuild name:

sys-auth/pam_mount-2.23

Description

A PAM module that can mount volumes for a user session

Added to portage

2026-10-31

patchelf - 0.19.3
Ebuild name:

dev-util/patchelf-0.19.3

Description

Small utility to modify the dynamic linker and RPATH of ELF executables

Added to portage

2026-10-31

pipewire - 1.6.11
Ebuild name:

media-video/pipewire-1.6.11

Description

Multimedia processing graphs

Added to portage

2026-10-31

postgis - 3.7.0
Ebuild name:

dev-db/postgis-3.7.0

Description

Geographic Objects for PostgreSQL

Added to portage

2026-10-31

ppp - 2.5.5
Ebuild name:

net-dialup/ppp-2.5.5

Description

Point-to-Point Protocol (PPP)

Added to portage

2026-10-31

pyamg - 5.4.1
Ebuild name:

dev-python/pyamg-5.4.1

Description

Algebraic multigrid solvers in Python

Added to portage

2026-10-31

python-discovery - 1.9.0
Ebuild name:

dev-python/python-discovery-1.9.0

Description

Python interpreter discovery

Added to portage

2026-10-31

radicale - 3.9.0
Ebuild name:

www-apps/radicale-3.9.0

Description

A simple CalDAV calendar server

Added to portage

2026-10-31

raspberrypi-utils - 0_p20261026
Ebuild name:

dev-embedded/raspberrypi-utils-0_p20261026

Description

Raspberry Pi userspace utilities

Added to portage

2026-10-31

rutorrent - 5.3.20
Ebuild name:

www-apps/rutorrent-5.3.20

Description

ruTorrent is a front-end for the popular Bittorrent client rTorrent

Added to portage

2026-10-31

sabctools - 9.7.3
Ebuild name:

dev-python/sabctools-9.7.3

Description

Module providing raw yEnc encoding/decoding for SABnzbd

Added to portage

2026-10-31

sqlglot - 30.27.0
Ebuild name:

dev-python/sqlglot-30.27.0

Description

An easily customizable SQL parser and transpiler

Added to portage

2026-10-31

sslscan - 2.2.3
Ebuild name:

net-analyzer/sslscan-2.2.3

Description

Fast SSL configuration scanner

Added to portage

2026-10-31

teamviewer - 15.83.3
Ebuild name:

net-misc/teamviewer-15.83.3

Description

All-In-One Solution for Remote Access and Support over the Internet

Added to portage

2026-10-31

tor - 0.4.9.15
Ebuild name:

net-vpn/tor-0.4.9.15

Description

Anonymizing overlay network for TCP

Added to portage

2026-10-31

torchvision - 0.29.1-r2
Ebuild name:

sci-ml/torchvision-0.29.1-r2

Description

Datasets, transforms and models to specific to computer vision

Added to portage

2026-10-31

tt-rss - 20261025
Ebuild name:

www-apps/tt-rss-20261025

Description

Tiny Tiny RSS - A web-based news feed (RSS/Atom) aggregator using AJAX

Added to portage

2026-10-31

tucnak - 4.75
Ebuild name:

media-radio/tucnak-4.75

Description

Amateur Radio VHF Contest Logbook

Added to portage

2026-10-31

types-docutils - 0.23.0.20261030
Ebuild name:

dev-python/types-docutils-0.23.0.20261030

Description

Typing stubs for docutils

Added to portage

2026-10-31

unicode-cldr - 49.0
Ebuild name:

app-i18n/unicode-cldr-49.0

Description

Unicode Common Locale Data Repository

Added to portage

2026-10-31

unicode-segmentation-rs - 1.0.1
Ebuild name:

dev-python/unicode-segmentation-rs-1.0.1

Description

Unicode segmentation and width for Python using Rust

Added to portage

2026-10-31

uriparser - 1.0.3
Ebuild name:

dev-libs/uriparser-1.0.3

Description

Strictly RFC 3986 compliant URI parsing library in C

Added to portage

2026-10-31

vanilla-kernel - 6.1.191
Ebuild name:

sys-kernel/vanilla-kernel-6.1.191

Description

Linux kernel built from vanilla upstream sources

Added to portage

2026-10-31

vanilla-kernel - 6.12.115
Ebuild name:

sys-kernel/vanilla-kernel-6.12.115

Description

Linux kernel built from vanilla upstream sources

Added to portage

2026-10-31

vanilla-kernel - 6.18.60
Ebuild name:

sys-kernel/vanilla-kernel-6.18.60

Description

Linux kernel built from vanilla upstream sources

Added to portage

2026-10-31

vanilla-kernel - 6.6.161
Ebuild name:

sys-kernel/vanilla-kernel-6.6.161

Description

Linux kernel built from vanilla upstream sources

Added to portage

2026-10-31

vanilla-kernel - 7.2.14
Ebuild name:

sys-kernel/vanilla-kernel-7.2.14

Description

Linux kernel built from vanilla upstream sources

Added to portage

2026-10-31

vanilla-kernel - 7.3.1
Ebuild name:

sys-kernel/vanilla-kernel-7.3.1

Description

Linux kernel built from vanilla upstream sources

Added to portage

2026-10-31

virtualenv - 21.15.2
Ebuild name:

dev-python/virtualenv-21.15.2

Description

Virtual Python Environment builder

Added to portage

2026-10-31

vivaldi - 8.2.4133.89
Ebuild name:

www-client/vivaldi-8.2.4133.89

Description

A browser for our friends

Added to portage

2026-10-31

vivaldi - 8.2.4133.91
Ebuild name:

www-client/vivaldi-8.2.4133.91

Description

A browser for our friends

Added to portage

2026-10-31

vivaldi-snapshot - 8.3.4190.36
Ebuild name:

www-client/vivaldi-snapshot-8.3.4190.36

Description

A browser for our friends

Added to portage

2026-10-31

vivaldi-snapshot - 8.3.4191.1
Ebuild name:

www-client/vivaldi-snapshot-8.3.4191.1

Description

A browser for our friends

Added to portage

2026-10-31

websockets - 17.4
Ebuild name:

dev-python/websockets-17.4

Description

Library for building WebSocket servers and clients in Python

Added to portage

2026-10-31

weston - 16.0.2
Ebuild name:

dev-libs/weston-16.0.2

Description

Wayland reference compositor

Added to portage

2026-10-31

wine-staging - 11.21
Ebuild name:

app-emulation/wine-staging-11.21

Description

Free implementation of Windows(tm) on Unix, with Wine-Staging patc

Added to portage

2026-10-31

wine-vanilla - 11.21
Ebuild name:

app-emulation/wine-vanilla-11.21

Description

Free implementation of Windows(tm) on Unix, without external patch

Added to portage

2026-10-31

wireplumber - 0.5.19
Ebuild name:

media-video/wireplumber-0.5.19

Description

Replacement for pipewire-media-session

Added to portage

2026-10-31

zchunk - 1.5.5
Ebuild name:

app-arch/zchunk-1.5.5

Description

File format designed for highly efficient deltas with good compression

Added to portage

2026-10-31

zeal - 0.9.2
Ebuild name:

app-text/zeal-0.9.2

Description

Offline documentation browser inspired by Dash

Added to portage

2026-10-31

rdf newsfeed | rss newsfeed | Atom newsfeed
Copyright 2004-2025 Sascha Nitsch Unternehmensberatung GmbH
- Copyright and legal notices -
Time to create this page: 32.2 ms