from small one page howto to huge articles all in one place

search text in:




Other .linuxhowtos.org sites: www.linuxhowtos.org
toolsntoys.linuxhowtos.org



Last additions:
How to make X listen on port 6000

How to make X listen on port 6000

words:

34

views:

88728

userrating:

average rating: 1.2 (52 votes) (1=very good 6=terrible)


May, 25th 2007:
April, 26th 2007:
Apr, 10th. 2007:
Druckversion . pdf icon
You are here: Portage


Details of dev-util/ty:

Description: An extremely fast Python type checker and language server, written in Rust
Homepage:
https://docs.astral.sh/ty/ https://github.com/astral-sh/ty

available versions:

releasesalphaamd64armhppaia64mipsppcppc64ppc macoss390shsparcx86USE-Flagsdependenciesebuild warnings
ty-0.0.7 -~-----------none
show
show
Legend:
+ stable
~ testing
- not available
some ebuild warning depend on specific use-flags or architectures, all ebuild-warnings are shown.

Known bugs:
bug IDcomponentassigned tostatusdescriptionlast change
146951Core systemalphaUNCONFIRMEDsys-fs/quota - value too large for defined data type on Alpha systems2011-12-02 19:03:44
343021Ebuildsmaintainer-wantedUNCONFIRMEDAdd ebuild for membase server (community edition)2011-07-04 10:46:11
368955ApplicationsvadimkUNCONFIRMEDapp-emulation/open-vm-tools default scripts break network connectivity on pause/resume2011-12-03 05:48:53
369855Ebuildsmaintainer-wantedUNCONFIRMED[media-video(?)/]freeseer - a video capture utility capable of capturing and streaming video2012-03-16 04:22:13
370631Ebuildsmaintainer-wantedUNCONFIRMEDdev-php/php-smarty-framework-plugin ebuild request2013-02-04 12:40:03
371947CVS/SVN/Gitinfra-bugsUNCONFIRMEDDo not allow commits of packages with no ebuilds (eg. empty directories.)2011-09-25 06:48:23
373635Ebuildsnet-dialupUNCONFIRMEDnet-dialup/ppp: add postinst message for break compatibility with dependent packages2011-07-01 01:38:55
374789Ebuildsmaintainer-wantedUNCONFIRMEDebuild request: chiliproject - a community fork of redmine2013-02-13 20:47:13
374943ApplicationsmattmUNCONFIRMEDmedia-gfx/cutycapt-0_p20110502-r2 unable to ignore invalid ssl certificate2012-04-16 01:32:13
374949BugzillabugzillaUNCONFIRMEDSubmitting bugs with attachments without method to determine content type causes error but still cre2011-10-30 23:16:37
377925DevelopmentpythonUNCONFIRMEDdev-python/docutils-0.[78]: TypeError: can't use a bytes pattern on a string-like object2011-10-07 21:22:24
378683Applicationsbase-systemUNCONFIRMEDapp-admin/sysklogd-1.4.2 - klogd uses incorrect facility2011-08-13 14:33:29
379211Ebuildsmaintainer-wantedUNCONFIRMED[ebuild] net-misc/kyototycoon-0.9.55 (New Package)2012-05-20 14:31:21
379429Ebuildsmaintainer-wantedUNCONFIRMEDnew ebuild for CProwl, a command-line utility to generate Prowl notifications2011-08-21 15:21:44
379967Applicationspolynomial-cUNCONFIRMEDapp-emulation/virtualbox-modules-4.0.12 doesn't check kernel config on compatibility2011-08-22 12:36:13
380235ApplicationswilliamhUNCONFIRMEDapp-accessibility/brltty: missing dependency on sys-libs/ncurses2011-08-25 13:06:41
380459PMS/EAPIpms-bugsUNCONFIRMEDMERGE_TYPE phases aren't defined2011-08-24 17:51:29
381711ApplicationsperlUNCONFIRMEDdev-perl/IO-Tty-1.100.0 fails tests on amd642011-09-04 07:54:02
381809EbuildspythonUNCONFIRMEDgames-simulation/singularity-0.30c fails to run with Python32012-12-29 15:00:48
382283Ebuildsmysql-bugsUNCONFIRMEDMySQL C API missing handle_options and get_tty_password functions2012-08-15 14:25:50
382321Applicationssci-biologyUNCONFIRMEDsci-biology/emboss-6.3 runtime functionality missing2011-09-09 23:18:48
382827Coredev-portageUNCONFIRMEDsys-apps/portage-2.1.10.11 crashes with confusing error when out of memory: TypeError: an integer is2011-09-14 13:56:03
383013JavajavaUNCONFIRMEDOnline bank security apple refuses to work unless I create a '/etc/.java' folder2011-09-15 18:53:28
383883Ebuildsmaintainer-wantedUNCONFIRMEDapp-backup/duply - duply (grown out of ftplicity) is a shell frontend for duplicity2011-09-26 02:08:12
385087GCC PortingtoolchainUNCONFIRMEDsys-devel/gcc-4.4.5: gcj seem to not install needed ca-certificates (/usr/lib/security/cacerts)2012-09-24 06:08:56
386843DevelopmentvoyageurUNCONFIRMEDsys-devel/clang-2.9-r1 fails test PCH/cxx-typeid.cpp2011-10-16 03:36:44
386947Librarymedia-videoUNCONFIRMEDmedia-libs/libdv-1.0.0-r2 - enc_input.c:1021:26: error: array type has incomplete element type2011-11-12 17:03:32
389359Ebuildsmaintainer-wantedUNCONFIRMEDenhancement request for trinity desktop2012-05-12 16:21:06
389491ApplicationssoundUNCONFIRMEDmedia-sound/timidity++ - timidity crashes when connected to rosegarden2011-11-08 15:37:25
390261EbuildschutzpahUNCONFIRMEDwww-plugins/nspluginwrapper-1.4.4-r1 - /usr/include/dirent.h:42:19: error: conflicting types for 'in2012-08-11 07:17:55
391041ServerpatrickUNCONFIRMEDwww-servers/apache 2.2 - suexec and django non-ASCII file upload incompatibility as apache cut out L2013-02-16 14:04:07
391317Enhancement/Feature Requestsdev-portageUNCONFIRMEDsys-apps/portage: Multiple, consistent verbosity levels for emerge2011-11-22 13:28:07
391783Applicationssci-geosciencesUNCONFIRMEDsci-geosciences/mapserver-6.0.1 conflicting types for 'msWFSGetCapabilities11'2011-11-26 23:14:21
393201Core systembase-systemUNCONFIRMEDsys-boot/grub-0.97-r10 has a typo in the grub-set-default utility and configuration files2011-12-05 12:38:16
394295Gamesmaintainer-wantedUNCONFIRMEDgames-misc/timeseal - a chess timekeeping utility2011-12-11 12:22:41
394849GamesgamesUNCONFIRMEDgames-action/shank - A side scrolling beat 'em up with a comic book art style2012-09-23 17:44:45
396151Ebuildsmaintainer-wantedUNCONFIRMEDx11-misc/xinequery-0.3 - utility to view information regarding active Xinerama screens2012-01-06 21:16:00
397403ApplicationspatrickUNCONFIRMEDwww-apps/otrs - add app-admin/webapp-config compatibility / webapp.eclass support2012-08-24 13:09:08
397885ApplicationssciUNCONFIRMEDsci-misc/boinc-6.12.42: boincmgr process keeps running and an empty space is left in the taskbar aft2012-04-18 12:43:50
397901Applicationsx11UNCONFIRMED[x11 overlay] media-libs/glmark2-2011.08 - ../src/texture.cpp:81:48: ??????: expected type-specifier2012-01-10 16:33:32
399739Libraryrobbat2UNCONFIRMEDdev-db/libdbi-drivers-0.8.3 fails to return column information for empty sqlite3 table2012-10-26 16:54:27
400601ApplicationsgraphicsUNCONFIRMEDmedia-gfx/enblend-4.0 USE=doc - ./auxmac.tex:1: I can't find file `thumbpdf.sty'.2012-01-25 13:59:04
400951HardenedhardenedUNCONFIRMEDJava does not run properly on non-root with Grsecurity Hardened Gentoo [workstation] level2012-01-26 19:28:36
401823Applicationspolynomial-cUNCONFIRMEDseamonkey desktop file lists unhandled mimetype associations2012-02-16 12:48:55
402647Enhancement/Feature Requestsdev-portageUNCONFIRMEDsys-apps/portage emerge utility add layman sync functionality2012-02-09 06:29:42
403459Applicationsnet-mailUNCONFIRMEDnet-mail/perdition-1.18 - options.h:42:14: error: conflicting types for ‘gdbm_version’2012-12-04 18:16:40
403479Ebuildsqmail-bugsUNCONFIRMEDmail-mta/netqmail-1.06 - typo in /etc/tcprules.d/Makefile.qmail2012-02-14 18:31:39
403697Coredev-portageUNCONFIRMEDsys-apps/portage-2.1.10.46: TypeError: an integer is required2012-02-18 05:35:08
403863ApplicationswiredUNCONFIRMEDapp-misc/mc-4.8.1-r1: typo in /etc/mc/mc.menu2013-01-16 23:21:14
406891ApplicationsfontsUNCONFIRMEDmedia-libs/freetype-1.4_pre20080316-r2 compile failure: make[2]: execvp: ../libtool: Permission deni2012-03-05 20:19:14
407571Core systemhardened-kernelUNCONFIRMEDsys-apps/util-linux-2.20.1-r1 - authpriv.err: Mar 9 20:20:43 agetty[26171]: /dev/tty1: cannot get c2012-10-11 16:08:47
407669Applicationsmaintainer-wantedUNCONFIRMEDapp-misc/imgur-2.0 - A simple Imgur Bash screenshot utility2012-03-13 09:55:22
408089Keywording and Stabilizationrobbat2UNCONFIRMEDsys-power/pmtools-20110323: stabilize any version providing turbostat utility2012-10-07 09:45:03
408275Applicationsqmail-bugsUNCONFIRMEDmail-mta/netqmail-1.06 - SMTPRCPTTO is empty2012-12-10 15:51:17
408419Ebuildsmaintainer-wantedUNCONFIRMEDdev-ml/typerex-1.0.1 - An OCaml development environment for emacs (new package)2012-03-16 19:24:58
408611Applicationspolynomial-cUNCONFIRMEDx11-drivers/xf86-video-virtualbox-4.1.10 - work/VirtualBox-4.1.10/include/iprt/types.h:112:30: fatal2013-01-31 09:32:22
409469Core systembase-systemUNCONFIRMEDsys-process/runit - make getty-ttyX symlinks optional2012-03-24 16:18:08
409861Ebuildsmaintainer-wantedUNCONFIRMEDx11-themes/humanity-icon-theme-0.5.3.11 - Nice and well polished icon themes for the GNOME desktop2012-03-27 17:13:16
409915Ebuildsmaintainer-wantedUNCONFIRMEDx11-themes/dmz-cursor-theme-0.4.3 - Style neutral, scalable cursor theme2012-03-28 00:20:23
409947Unspecifiedapp-backupUNCONFIRMEDapp-backup/rdiff-backup-1.3.3 - "Security Violation" warning then "Fatal Error"2012-03-30 06:29:16
410679Ebuildsdev-embeddedUNCONFIRMEDdev-embedded/libftdi-9999.1.0: add ability to install ftdi_eeprom utility2013-02-06 04:19:56
410713Ebuildsmaintainer-wantedUNCONFIRMEDdev-db/cppdb - an SQL connectivity library for platform and database independent connectivity2012-06-28 17:50:44
410981ToolsdolsenUNCONFIRMEDapp-portage/etc-proposals with dev-lang/python-2.7[-berkdb] - raise error, "db type could not be det2012-04-09 20:36:29
411619Ebuildsmaintainer-wantedUNCONFIRMEDmedia-sound/rockbox-utility - Graphical utility for automating Rockbox firmware installation and man2012-11-07 20:02:26
411805DevelopmentrubyUNCONFIRMEDdev-lang/ruby-1.9.3_p125 - openssl_missing.h:71:6: error: conflicting types for ‘HMAC_CTX_copy’2012-04-14 21:28:46
412273Developmentdev-embeddedUNCONFIRMEDdev-embedded/avr-libc-1.8.0 probable preprocessor mistake in inttypes.h2012-04-17 15:26:21
414697EbuildshannoUNCONFIRMEDnet-analyzer/greenbone-security-assistant-3.0.3 version bump2012-10-10 19:39:05
415989Librarymaintainer-wantedUNCONFIRMEDdev-python/prettytable-python-0.6 - Python interface to print pretty tabular data2012-12-12 10:10:18
416757Core systemtoolchainUNCONFIRMEDcross-arm-elf/gcc-4.5.3-r2 - checking machine/endian.h usability... // .../work/gcc-4.5.3/libiberty/2012-06-17 17:06:03
417239ApplicationslxdeUNCONFIRMEDIf LXDE session is running the kbd input on tty1 is broken (need to press keys twice)2012-06-14 13:17:06
418343ApplicationsmarioUNCONFIRMEDapp-cdr/xfburn-0.4.3-r3 - /usr/share/applications/xfburn.desktop: file contains key "MimeType" in gr2012-05-31 14:59:11
420033DevelopmentperlUNCONFIRMEDdev-perl/MooseX-Types-DateTimeX fails tests with MooseX-Types-DateTime-ButMaintained-0.140.02012-06-07 09:09:11
420687Enhancement/Feature Requestsdev-portageUNCONFIRMEDemerge --info should include CC, CXX variables and ld type2012-06-11 12:58:34
422459Applicationsphp-bugsUNCONFIRMEDdev-php/smarty-2.6.26 version bump request2013-01-21 18:16:37
423001EbuildsfontsUNCONFIRMEDmedia-fonts/ricty-3.2.0 version bump2012-06-23 14:13:21
424529ApplicationsljakabUNCONFIRMEDvpnc init script does not wait for network connectivity (NetworkManager)2012-11-23 08:13:55
425634Applicationsnet-ircUNCONFIRMEDnet-irc/bitchx 1.2 - QA/security issues2013-01-29 13:33:05
426398Applicationsnet-dialupUNCONFIRMEDnet-dialup/pptpclient - stability fixes2012-07-18 00:06:56
427004Applicationsmedia-videoUNCONFIRMEDmedia-video/ffmpeg-0.10.3 ABI=x32 - libavfilter/libmpcodecs/vf_ilpack.c:116: Error: operand type mis2012-09-25 03:49:30
427734Ebuildsmaintainer-wantedUNCONFIRMEDNew: dev-python/django-sekizai-0.4.2 - Django Template Blocks with extra functionality2012-12-12 11:51:41
428282LibrarypachoUNCONFIRMEDnet-wireless/bluez-4.99 expected specifier-qualifier-list before ‘typeof’ in bluetooth.h2013-02-12 21:43:00
428656EbuildsjdhoreUNCONFIRMEDapp-accessibility/gnome-mag-0.16.3: fails to build2012-11-25 14:44:01
429626CatalystcatalystUNCONFIRMEDdev-util/catalyst-2.0.10.1: get_libdir() return an empty value when cross compiling2012-08-13 13:01:10
429646GamesreavertmUNCONFIRMEDdev-games/openscenegraph-3.0.1 with sys-devel/clang-3.1 - error: cannot initialize a parameter of ty2012-08-04 00:29:11
430406DocumentationneddyseagoonUNCONFIRMEDTypo on Foundation_news.xml2012-08-08 06:43:21
431028Ebuildsmaintainer-wantedUNCONFIRMEDapp-misc/command-not-found - In case a command could not be found this utility searches for packages2012-08-13 17:53:51
431082BugzillabugzillaUNCONFIRMEDIt is not possible to set attachment type/patch flag in expert mode enter_bug2012-08-12 13:58:16
431364Ebuildsmaintainer-wantedUNCONFIRMEDdev-util/lttngtop - lttng top like utility2012-08-14 12:55:50
431638SandboxsandboxUNCONFIRMEDsys-apps/sandbox-2.6 sometimes sends QA warnings to tty2012-08-16 19:44:12
432980Applicationscommon-lispUNCONFIRMEDdev-lisp/sbcl-1.0.55-r1 fails to compile with "The value 18446744073 is not of type (UNSIGNED-BYTE 32012-08-29 09:14:51
433070KDEkdeUNCONFIRMEDapp-editors/kile-2.1.2-r1 - index.docbook:124: parser error : Entity 'ged.vertaald' not defined2013-02-17 22:53:14
433157LibraryfontsUNCONFIRMEDmedia-libs/freetype-2.4.10-r1 USE=infinality causes segmentation faults running x11-wm/openbox in _f2012-10-17 12:10:36
433942Applicationsnet-p2pUNCONFIRMEDnet-p2p/amule - amule fails to start when an empty ~/.aMule/statistics.dat file is present2012-09-04 15:33:37
433998DevelopmenthaskellUNCONFIRMEDincompatibility between =dev-lang/ghc-7.4.1-r1 and =x11-wm/xmonad-0.102012-12-16 13:42:38
434020OpenRCopenrcUNCONFIRMEDnet.example in docs dir suggest a faulty bond0-configuration.2012-09-05 11:55:57
434236DevelopmentrafaelmartinsUNCONFIRMEDdev-lua/luafilesystem-1.5.0 with dev-lang/lua-5.2.1: src/lfs.c:779:30: error: array type has incompl2013-02-03 13:08:19
434744Ebuildsmaintainer-wantedUNCONFIRMEDdev-db/mysql-cluster-7.2.8 - a high availability and high performance alternative to regular mysql2012-10-14 09:35:05
434922HardenedhardenedUNCONFIRMEDnet-fs/openafs-1.6.1 doesn't built with sys-kernel/hardened-sources with grsecurity/PaX enabled2013-02-10 14:52:43
435162New Servermirror-adminUNCONFIRMED[full+rsync] New mirror: University of Nebraska at Omaha, College of IS&T (US)2012-09-15 20:30:25
435256JavajavaUNCONFIRMEDdev-java/xml-security-1.5.2 (aka apache santuario) version bump2012-09-16 20:18:33
435390Applicationsphp-bugsUNCONFIRMEDdev-lang/php-5.4.7 - .../work/sapis-build/cli/ext/dba/dba_cdb.c:59:2: error: unknown type name 'uint2012-09-18 13:59:57
435516Applicationsgnome-accessibilityUNCONFIRMEDapp-accessibility/accerciser-3.4.1 - /usr/lib/python2.7/site-packages/accerciser/plugin/base_plugin.2012-09-21 19:29:04
435656EbuildshannoUNCONFIRMEDnet-analyzer/greenbone-security-assistant-2.0.1 - ld: CMakeFiles/gsad.dir/gsad.c.o: undefined refere2012-09-24 10:44:47
436102EbuildshannoUNCONFIRMEDnet-analyzer/greenbone-security-desktop-1.2.2: version bump2012-09-24 22:50:20
436226JavajavaUNCONFIRMEDdev-util/checkstyle should install an ant task2012-09-26 10:14:51
436500LibraryprintingUNCONFIRMEDapp-text/ghostscript-gpl with media-libs/freetype-2.4.10-r1 USE=infinality - ghostscript based appli2013-02-16 21:14:40
437056LibraryyngwinUNCONFIRMEDapp-admin/eselect-infinality - after setting to nyx, 43-repl-terminus.conf cannot be load2012-10-17 12:12:28
437446ApplicationsgraphicsUNCONFIRMEDmedia-gfx/nip2-7.26.4 - parser.h:57:12: error: conflicting types for ‘yyleng’ lex.c:275:11: note: pr2013-02-16 13:23:10
437484DevelopmentperlUNCONFIRMEDdev-lang/perl-5.16.1 - Pod::Perldoc (perldoc) failures caused by typo2012-10-08 11:15:54
438188Developmentcommon-lispUNCONFIRMEDdev-lisp/clisp-2.48-r1 - fails to compile with ENOMEM, although there is plenty left2013-01-01 04:00:02
438708ApplicationsroxUNCONFIRMED2012-10-17 14:29:58
438996EbuildstoolchainUNCONFIRMEDsys-devel/binutils-2.23.51.0.x: gold/powerpc.cc:3255:1: error: prototype for 'typename elfcpp::Elf_t2012-12-29 21:25:21
439982ApplicationshwoarangUNCONFIRMEDgnome-extra/nautilus-dropbox-1.4.0 - /usr/bin/rst2man.py dropbox.txt > dropbox.1 /// TypeError: 'str2012-11-04 10:56:31
440142LibraryperlUNCONFIRMEDdev-perl/XML-LibXML - Segmentation fault when removing child nodes with entity or namespace subnodes2012-10-29 19:19:42
440590ApplicationsfontsUNCONFIRMEDmedia-libs/freetype-2.4.9-r1: some elog messages should only be shown when upgrading from an old eno2012-10-31 16:28:45
441778DevelopmentvoyageurUNCONFIRMEDsys-devel/clang-3.1 ICE's when a type with multiple copy-ctors is in a union2012-11-04 23:13:59
442056Enhancement/Feature Requestsdev-portageUNCONFIRMEDAdditional checks for sanity of user-supplied *FLAGS variables in make.conf2012-11-06 16:12:29
442106Core systemxmwUNCONFIRMEDsys-power/suspend-1.0 USE=fbsplash - ld: cannot find -lmng -ljpeg -llcms -lpng15 -lz -lfreetype2012-11-06 21:44:41
442826EbuildsxmwUNCONFIRMEDsys-power/suspend-1.0 - /usr/lib64/libfreetype.a(ftbzip2.o): In function `ft_bzip2_stream_close': (.2012-11-30 01:23:17
443856Applicationsmaintainer-neededUNCONFIRMEDmedia-gfx/splashutils-1.5.4.4-r2 failed to build - asm/posix_types.h: No such file or directory2013-01-27 08:05:31
443890Applicationsnet-imUNCONFIRMEDnet-im/ejabberd - typo in /etc/init.d/ejabberd : EJABBERDCTL_OPT instead of EJABBERDCTL_OPTS2012-11-20 19:41:35
443970ApplicationsdotnetUNCONFIRMEDmedia-plugins/banshee-community-extensions-2.4.0 - mirage-extension causes crashes2012-11-24 16:26:22
444502ApplicationspatrickUNCONFIRMEDapp-benchmarks/phoronix-test-suite-4.0.1 - No matter what, it complains that PHP_TARGETS is empty2012-12-25 22:09:37
445081ApplicationspythonUNCONFIRMEDnet-zope/zope-interface-3.8.0 - src_test(): TypeError: metaclass conflict: the metaclass of a derive2013-02-02 10:01:54
445544Applicationsmedia-videoUNCONFIRMEDmedia-video/dvdstyler-2.3.4 - Fails to generate iso, consider to hard-mask this version.2012-12-03 05:50:21
446498Core - Configurationdev-portageUNCONFIRMEDsys-apps/portage should handle typos in make.conf like those at the command line2012-12-08 17:10:05
447064ApplicationssgmlUNCONFIRMEDapp-text/build-docbook-catalog - file:///etc/xml/docbook:1: parser error : Document is empty2012-12-13 16:31:25
447224DevelopmentbinkiUNCONFIRMEDdev-vcs/veracity-2.0.0.10822 version bump2013-02-04 11:38:03
448016Ebuildsmaintainer-wantedUNCONFIRMEDapp-misc/hardening-wrapper - New package. - Compiler wrapper to enable security hardening flags2012-12-26 21:51:22
448062ApplicationswilliamhUNCONFIRMEDapp-accessibility/speech-dispatcher-0.7.1-r1 src_compile(): mv: cannot stat '.deps/spd_audio.Tpo': N2013-01-01 12:02:28
448770GNOMEgnomeUNCONFIRMED[gnome overlay] app-accessibility/at-spi2-atk-9999 fails to build due to failed patch "at-spi2-atk-2012-12-27 05:56:05
448926EbuildsfontsUNCONFIRMEDmedia-libs/freetype needs a local description of bindist USE-flag2012-12-27 20:19:55
449116EbuildsdanielpiUNCONFIRMEDapp-accessibility/julius::sunrise and sci-libs/fplll::sage-on-gentoo both install /usr/bin/generate2012-12-29 11:48:00
449296KDEkdeUNCONFIRMEDnet-im/ktp-call-ui-0.5.1: gsttaglist.h:152:28: error: conflicting declaration ‘typedef struct _GstTa2013-01-18 10:50:15
449474Librarymaintainer-wantedUNCONFIRMEDdev-tex/fontpro - LaTeX support for Adobe's Pro opentype fonts2013-01-11 22:14:05
450220ApplicationsprintingUNCONFIRMED=net-print/cups-1.5.2-r4 - German localization file has empty strings.2013-01-05 18:07:19
451290LibraryhaskellUNCONFIRMEDdev-haskell/pandoc-types-1.9.1.1 - setup: At least the following dependencies are missing: syb -any2013-01-11 18:00:06
451394Applicationsrobbat2UNCONFIRMEDsci-mathematics/nusmv-2.5.2 USE=minisat - SolverTypes.h:126:56: error: cast from 'void*' to 'int' lo2013-01-12 16:25:09
452558DevelopmentmlUNCONFIRMEDdev-lang/mlton-20100608 fails to build, unknown type name '__gmp_const'2013-01-25 08:43:11
452572Ebuildsmaintainer-wantedUNCONFIRMEDdev-php/PHP_Invoker - Utility class for invoking callables with a timeout.2013-01-22 16:32:38
452850Ebuildsmaintainer-wantedUNCONFIRMEDwww-apps/snorby - Ruby on Rails application for network security monitoring2013-01-18 17:12:00
453540ApplicationsevermindUNCONFIRMED[pro-audio overlay] media-sound/jack-audio-connection-kit-1.9.9.5: TypeError: 'list' object is not c2013-02-09 17:14:49
453918ApplicationsxmwUNCONFIRMED=app-admin/conkyforecast-2.24 with conky-1.9.0-r1 - `conkyForecastWU --datatype=WI` - conkyForecastW2013-02-10 16:49:05
454802DevelopmentflameeyesUNCONFIRMEDdev-utils/google-perftools-2.0-r1 ARMv6 does not imply 'dmb' instruction availability but it is used2013-02-02 00:14:37
455282LibrarytitanofoldUNCONFIRMEDdev-libs/libpqxx-4.0.1 with python 3.x - TypeError: 'str' does not support the buffer interface2013-02-19 08:19:43
455318LibraryfontsUNCONFIRMEDmedia-libs/freetype[X,-utils] needlessly depends on X libraries2013-02-05 11:37:35
455576DevelopmenthaskellUNCONFIRMEDdev-haskell/vty with sys-libs/ncurses[tinfo] - /usr/lib64/terminfo-0.3.2.5/ghc-7.6.2/libHSterminfo-02013-02-14 14:13:53
455874Installation Handbookdocs-teamUNCONFIRMEDminor typo in code listing 2.1 (ru translation)2013-02-06 16:33:17
455926Prefix SupportprefixUNCONFIRMEDperl-5.16.2 will install empty if prefix lives in /usr/local2013-02-06 22:57:05
456388KDEkdeUNCONFIRMEDkde-misc/krename-4.0.9: fatal error: freetype/config/ftheader.h: No such file or directory2013-02-19 06:44:46
456832ApplicationsjerUNCONFIRMEDnet-misc/putty and net-misc/pssh - File collision: /usr/bin/pscp2013-02-11 19:20:34
456988Other documentsdocs-teamUNCONFIRMEDrsync doc: multiple guides, ambiguity on which version for FAQ2013-02-12 20:03:28
457080EbuildsgraphicsUNCONFIRMEDmedia-gfx/cellwriter-1.3.5 - version bump request and please move it to app-accessibility/2013-02-13 18:34:41
457562ApplicationsneurogeekUNCONFIRMEDapp-accessibility/speech-tools-2.1-r2 fails with ncurses[tinfo]2013-02-14 18:21:15
457628ApplicationsprometheanfireUNCONFIRMEDsys-cluster/swift-1.7.6 has typo in "newinitd"2013-02-15 18:36:35
457678Enhancement/Feature RequestssecurityUNCONFIRMEDAdd security information to the portage tree2013-02-15 16:57:18
458018ServerswegenerUNCONFIRMEDnet-dns/pdns need more strict permissions for pdns.conf (security threat)2013-02-17 18:26:06
458024Applicationsnet-fsUNCONFIRMEDnet-nds/rpcbind with sys-libs/uclibc - security.c:23:26: fatal error: rpcsvc/mount.h: No such file o2013-02-20 11:38:41
458068GNOMEgnomeUNCONFIRMEDx11-themes/gnome-themes-standard: narrow scrollbars might violate accessibility regulation2013-02-19 06:38:31
458342Ebuildsmaintainer-wantedUNCONFIRMEDdev-db/libcutl - a C++ utility library (dependency of dev-db/odb)2013-02-19 22:11:50
458508EbuildspachoUNCONFIRMEDsys-power/bbswitch kernel 3.8 compatibility hack2013-02-20 22:50:36


back



Support us on Content Nation

New Packages

- as rdf newsfeed
- as rss newsfeed
- as Atom newsfeed
2026-09-27
atuin - 18.23.0
Ebuild name:

app-shells/atuin-18.23.0

Description

Shell history manager supporting encrypted synchronisation

Added to portage

2026-09-27

avrdude - 8.3
Ebuild name:

dev-embedded/avrdude-8.3

Description

AVR Downloader/UploaDEr

Added to portage

2026-09-27

baikal - 0.12.1
Ebuild name:

www-apps/baikal-0.12.1

Description

Lightweight CalDAV+CardDAV server

Added to portage

2026-09-27

cattrs - 26.2.1
Ebuild name:

dev-python/cattrs-26.2.1

Description

Composable complex class support for attrs and dataclasses

Added to portage

2026-09-27

clinfo - 3.1.26.09.26
Ebuild name:

dev-util/clinfo-3.1.26.09.26

Description

A tool to display info about the system's OpenCL capabilities

Added to portage

2026-09-27

deprecated - 3.0.0
Ebuild name:

dev-python/deprecated-3.0.0

Description

Python @deprecated decorator to deprecate old API

Added to portage

2026-09-27

filelock - 4.0.4
Ebuild name:

dev-python/filelock-4.0.4

Description

A platform independent file lock for Python

Added to portage

2026-09-27

identify - 2.6.20
Ebuild name:

dev-python/identify-2.6.20

Description

File identification library for Python

Added to portage

2026-09-27

intel-microcode - 20260925_p20260925
Ebuild name:

sys-firmware/intel-microcode-20260925_p20260925

Description

Intel IA32/IA64 microcode update data

Added to portage

2026-09-27

knowit - 0.7.1
Ebuild name:

dev-python/knowit-0.7.1

Description

Know better your media files

Added to portage

2026-09-27

libvmaf - 3.2.1
Ebuild name:

media-libs/libvmaf-3.2.1

Description

C libary for Netflix's Perceptual video quality assessment

Added to portage

2026-09-27

meson-python - 0.22.0
Ebuild name:

dev-python/meson-python-0.22.0

Description

Meson PEP 517 Python build backend

Added to portage

2026-09-27

multidict - 7.0.0
Ebuild name:

dev-python/multidict-7.0.0

Description

multidict implementation

Added to portage

2026-09-27

netcdf - 4.10.1-r1
Ebuild name:

sci-libs/netcdf-4.10.1-r1

Description

Scientific library and interface for array oriented data access

Added to portage

2026-09-27

netcdf - 4.9.3-r3
Ebuild name:

sci-libs/netcdf-4.9.3-r3

Description

Scientific library and interface for array oriented data access

Added to portage

2026-09-27

nodeenv - 1.11.0
Ebuild name:

dev-python/nodeenv-1.11.0

Description

Node.js virtual environment builder

Added to portage

2026-09-27

owasp-java-encoder - 1.4.1
Ebuild name:

dev-java/owasp-java-encoder-1.4.1

Description

OWASP Java Encoder

Added to portage

2026-09-27

pikepdf - 10.14.0
Ebuild name:

dev-python/pikepdf-10.14.0

Description

Python library to work with pdf files based on qpdf

Added to portage

2026-09-27

pkgcheck - 0.10.45
Ebuild name:

dev-util/pkgcheck-0.10.45

Description

pkgcore-based QA utility for ebuild repos

Added to portage

2026-09-27

pkgcore - 0.12.44
Ebuild name:

sys-apps/pkgcore-0.12.44

Description

a framework for package management

Added to portage

2026-09-27

platformdirs - 4.12.0
Ebuild name:

dev-python/platformdirs-4.12.0

Description

A small Python module for determining appropriate platform-specific

Added to portage

2026-09-27

qpdf - 12.4.2
Ebuild name:

app-text/qpdf-12.4.2

Description

Command-line tool for structural, content-preserving transformation of PDF fil

Added to portage

2026-09-27

rope - 1.15.0
Ebuild name:

dev-python/rope-1.15.0

Description

Python refactoring library

Added to portage

2026-09-27

virtualenv - 21.13.0
Ebuild name:

dev-python/virtualenv-21.13.0

Description

Virtual Python Environment builder

Added to portage

2026-09-27

2026-09-26
aqbanking - 6.9.2
Ebuild name:

net-libs/aqbanking-6.9.2

Description

Generic Online Banking Interface

Added to portage

2026-09-26

astroid - 4.3.2
Ebuild name:

dev-python/astroid-4.3.2

Description

Abstract Syntax Tree for logilab packages

Added to portage

2026-09-26

awscli - 2.37.4
Ebuild name:

app-admin/awscli-2.37.4

Description

Universal Command Line Environment for AWS

Added to portage

2026-09-26

ax25-tools - 0.0.10_rc5-r2
Ebuild name:

media-radio/ax25-tools-0.0.10_rc5-r2

Description

Basic AX.25 (Amateur Radio) administrative tools and daemons

Added to portage

2026-09-26

bitwarden-desktop-bin - 2026.9.0
Ebuild name:

app-admin/bitwarden-desktop-bin-2026.9.0

Description

Bitwarden password manager desktop client

Added to portage

2026-09-26

borgmatic - 2.1.9
Ebuild name:

app-backup/borgmatic-2.1.9

Description

Automatically create, prune and verify backups with borgbackup

Added to portage

2026-09-26

boto3 - 1.43.103
Ebuild name:

dev-python/boto3-1.43.103

Description

The AWS SDK for Python

Added to portage

2026-09-26

botocore - 1.43.103
Ebuild name:

dev-python/botocore-1.43.103

Description

Low-level, data-driven core of boto 3

Added to portage

2026-09-26

bubblewrap - 0.13.0
Ebuild name:

sys-apps/bubblewrap-0.13.0

Description

Unprivileged sandboxing tool, namespaces-powered chroot-like solution

Added to portage

2026-09-26

chemex - 2026.9.2
Ebuild name:

sci-chemistry/chemex-2026.9.2

Description

Program to fit chemical exchange induced shift and relaxation data

Added to portage

2026-09-26

command-not-found - 0.0.8
Ebuild name:

app-portage/command-not-found-0.0.8

Description

Command-not-found handler for Gentoo

Added to portage

2026-09-26

coreutils - 9.12
Ebuild name:

sys-apps/coreutils-9.12

Description

Standard GNU utilities (chmod, cp, dd, ls, sort, tr, head, wc, who,...)

Added to portage

2026-09-26

crash - 9.0.3
Ebuild name:

dev-util/crash-9.0.3

Description

Red Hat crash utility; used for analyzing kernel core dumps

Added to portage

2026-09-26

dbeaver-bin - 26.2.1
Ebuild name:

dev-db/dbeaver-bin-26.2.1

Description

Free universal database tool (community edition)

Added to portage

2026-09-26

dist-kernel - 6.18.54
Ebuild name:

virtual/dist-kernel-6.18.54

Description

Virtual to depend on any Distribution Kernel

Added to portage

2026-09-26

dist-kernel - 7.2.8
Ebuild name:

virtual/dist-kernel-7.2.8

Description

Virtual to depend on any Distribution Kernel

Added to portage

2026-09-26

ebuild-mode - 1.86
Ebuild name:

app-xemacs/ebuild-mode-1.86

Description

Emacs modes for editing ebuilds and other Gentoo specific files

Added to portage

2026-09-26

fastfetch - 2.69.0
Ebuild name:

app-misc/fastfetch-2.69.0

Description

Fast neofetch-like system information tool

Added to portage

2026-09-26

fcitx - 5.1.23
Ebuild name:

app-i18n/fcitx-5.1.23

Description

Fcitx 5 is a generic input method framework

Added to portage

2026-09-26

fcitx-chinese-addons - 5.1.15
Ebuild name:

app-i18n/fcitx-chinese-addons-5.1.15

Description

Addons related to Chinese, including IME previous bundled insi

Added to portage

2026-09-26

fcitx-configtool - 5.1.16
Ebuild name:

app-i18n/fcitx-configtool-5.1.16

Description

Configuration module for Fcitx

Added to portage

2026-09-26

fcitx-qt - 5.1.16
Ebuild name:

app-i18n/fcitx-qt-5.1.16

Description

Qt library and IM module for fcitx5

Added to portage

2026-09-26

fedora-backgrounds - 45.0.3
Ebuild name:

x11-themes/fedora-backgrounds-45.0.3

Description

A set of default and supplemental wallpapers for Fedora

Added to portage

2026-09-26

feh - 3.13.1
Ebuild name:

media-gfx/feh-3.13.1

Description

A fast, lightweight imageviewer using imlib2

Added to portage

2026-09-26

gdb - 18.1
Ebuild name:

dev-debug/gdb-18.1

Description

GNU debugger

Added to portage

2026-09-26

gdm - 50.3-r2
Ebuild name:

gnome-base/gdm-50.3-r2

Description

GNOME Display Manager for managing graphical display servers and user logins

Added to portage

2026-09-26

gentoo-kernel - 6.18.54
Ebuild name:

sys-kernel/gentoo-kernel-6.18.54

Description

Linux kernel built with Gentoo patches

Added to portage

2026-09-26

gentoo-kernel - 7.2.8
Ebuild name:

sys-kernel/gentoo-kernel-7.2.8

Description

Linux kernel built with Gentoo patches

Added to portage

2026-09-26

gentoo-kernel-bin - 6.18.54
Ebuild name:

sys-kernel/gentoo-kernel-bin-6.18.54

Description

Pre-built Linux kernel with Gentoo patches

Added to portage

2026-09-26

gentoo-kernel-bin - 7.2.8
Ebuild name:

sys-kernel/gentoo-kernel-bin-7.2.8

Description

Pre-built Linux kernel with Gentoo patches

Added to portage

2026-09-26

gentoo-kernel-modprep - 6.18.54
Ebuild name:

sys-kernel/gentoo-kernel-modprep-6.18.54

Description

Minimal subset of gentoo-kernel-bin for building modules,

Added to portage

2026-09-26

gentoo-kernel-modprep - 7.2.8
Ebuild name:

sys-kernel/gentoo-kernel-modprep-7.2.8

Description

Minimal subset of gentoo-kernel-bin for building modules, fo

Added to portage

2026-09-26

gmsynth-lv2 - 0.6.4
Ebuild name:

media-plugins/gmsynth-lv2-0.6.4

Description

General MIDI Sample Player Plugin

Added to portage

2026-09-26

gnome-mahjongg - 51.1
Ebuild name:

games-board/gnome-mahjongg-51.1

Description

Disassemble a pile of tiles by removing matching pairs

Added to portage

2026-09-26

gnome-shell-extension-appindicator - 66
Ebuild name:

gnome-extra/gnome-shell-extension-appindicator-66

Description

Support legacy, AppIndicators and KStatusNotifier

Added to portage

2026-09-26

gnome-shell-extension-gsconnect - 73
Ebuild name:

gnome-extra/gnome-shell-extension-gsconnect-73

Description

KDE Connect implementation for GNOME

Added to portage

2026-09-26

gpgme - 2.1.0
Ebuild name:

app-crypt/gpgme-2.1.0

Description

GnuPG Made Easy is a library for making GnuPG easier to use

Added to portage

2026-09-26

gpgme - 2.1.1
Ebuild name:

app-crypt/gpgme-2.1.1

Description

GnuPG Made Easy is a library for making GnuPG easier to use

Added to portage

2026-09-26

gpgme - 2.1.2
Ebuild name:

app-crypt/gpgme-2.1.2

Description

GnuPG Made Easy is a library for making GnuPG easier to use

Added to portage

2026-09-26

gpgme - 2.2.0
Ebuild name:

app-crypt/gpgme-2.2.0

Description

GnuPG Made Easy is a library for making GnuPG easier to use

Added to portage

2026-09-26

gpgstats - 0.5-r2
Ebuild name:

app-crypt/gpgstats-0.5-r2

Description

GPGstats calculates statistics on the keys in your key-ring

Added to portage

2026-09-26

gspell - 1.14.5
Ebuild name:

app-text/gspell-1.14.5

Description

Spell check library for GTK+ applications

Added to portage

2026-09-26

gtranslator - 51.0
Ebuild name:

app-text/gtranslator-51.0

Description

GNOME Translation Editor

Added to portage

2026-09-26

hashalot - 0.3-r3
Ebuild name:

app-crypt/hashalot-0.3-r3

Description

Reads a passphrase and prints a hash

Added to portage

2026-09-26

hashcat - 6.2.6-r1
Ebuild name:

app-crypt/hashcat-6.2.6-r1

Description

World's fastest and most advanced password recovery utility

Added to portage

2026-09-26

hashcat - 7.1.2
Ebuild name:

app-crypt/hashcat-7.1.2

Description

World's fastest and most advanced password recovery utility

Added to portage

2026-09-26

haskell-mode - 17.4
Ebuild name:

app-emacs/haskell-mode-17.4

Description

Mode for editing (and running) Haskell programs in Emacs

Added to portage

2026-09-26

haskell-mode - 17.5_p20260206
Ebuild name:

app-emacs/haskell-mode-17.5_p20260206

Description

Mode for editing (and running) Haskell programs in Emacs

Added to portage

2026-09-26

haskell-mode - 9999
Ebuild name:

app-emacs/haskell-mode-9999

Description

Mode for editing (and running) Haskell programs in Emacs

Added to portage

2026-09-26

libcbor - 0.14.0
Ebuild name:

dev-libs/libcbor-0.14.0

Description

CBOR protocol implementation for C and others

Added to portage

2026-09-26

libcdio - 2.4.0
Ebuild name:

dev-libs/libcdio-2.4.0

Description

A library to encapsulate CD-ROM reading and control

Added to portage

2026-09-26

libime - 1.1.17
Ebuild name:

app-i18n/libime-1.1.17

Description

Fcitx5 Next generation of fcitx

Added to portage

2026-09-26

libnfs - 8.0.0
Ebuild name:

net-fs/libnfs-8.0.0

Description

Client library for accessing NFS shares over a network

Added to portage

2026-09-26

libtorrent - 0.16.24
Ebuild name:

net-libs/libtorrent-0.16.24

Description

BitTorrent library written in C++ for *nix

Added to portage

2026-09-26

lilypond - 2.26.0
Ebuild name:

media-sound/lilypond-2.26.0

Description

GNU Music Typesetter

Added to portage

2026-09-26

localsearch - 3.12.0
Ebuild name:

app-misc/localsearch-3.12.0

Description

Indexer and search engine that powers desktop search for core GNOME com

Added to portage

2026-09-26

lttng-tools - 2.14.3
Ebuild name:

dev-util/lttng-tools-2.14.3

Description

Linux Trace Toolkit - next generation

Added to portage

2026-09-26

lttng-ust - 2.14.3
Ebuild name:

dev-util/lttng-ust-2.14.3

Description

Linux Trace Toolkit - UST library

Added to portage

2026-09-26

markdown - 3.11
Ebuild name:

dev-python/markdown-3.11

Description

Python implementation of the markdown markup language

Added to portage

2026-09-26

mkvtoolnix - 102.0
Ebuild name:

media-video/mkvtoolnix-102.0

Description

Tools to create, alter, and inspect Matroska files

Added to portage

2026-09-26

multipart - 2.0.1
Ebuild name:

dev-python/multipart-2.0.1

Description

Parser for multipart/form-data

Added to portage

2026-09-26

mycli - 2.25.3
Ebuild name:

dev-db/mycli-2.25.3

Description

CLI for MySQL Database with auto-completion and syntax highlighting

Added to portage

2026-09-26

nautilus-python - 4.2.0
Ebuild name:

dev-python/nautilus-python-4.2.0

Description

Python bindings for the Nautilus file manager

Added to portage

2026-09-26

nodejs - 26.10.0-r1
Ebuild name:

net-libs/nodejs-26.10.0-r1

Description

A JavaScript runtime built on Chrome's V8 JavaScript engine

Added to portage

2026-09-26

noto-emoji - 20260924
Ebuild name:

media-fonts/noto-emoji-20260924

Description

Google Noto Emoji fonts

Added to portage

2026-09-26

openbabel - 3.2.1
Ebuild name:

sci-chemistry/openbabel-3.2.1

Description

Interconverts file formats used in molecular modeling

Added to portage

2026-09-26

opentelemetry-api - 1.45.0
Ebuild name:

dev-python/opentelemetry-api-1.45.0

Description

OpenTelemetry Python API

Added to portage

2026-09-26

opentelemetry-sdk - 1.45.0
Ebuild name:

dev-python/opentelemetry-sdk-1.45.0

Description

OpenTelemetry Python SDK

Added to portage

2026-09-26

opentelemetry-semantic-conventions - 1.45.0
Ebuild name:

dev-python/opentelemetry-semantic-conventions-1.45.0

Description

OpenTelemetry Semantic Conventions

Added to portage

2026-09-26

osinfo-db - 20260812
Ebuild name:

sys-apps/osinfo-db-20260812

Description

Osinfo database for virtualization provisioning tools

Added to portage

2026-09-26

patool - 4.1.0
Ebuild name:

app-arch/patool-4.1.0

Description

Portable archive file manager

Added to portage

2026-09-26

platformdirs - 4.11.15
Ebuild name:

dev-python/platformdirs-4.11.15

Description

A small Python module for determining appropriate platform-specific

Added to portage

2026-09-26

platformio - 6.2.0
Ebuild name:

dev-embedded/platformio-6.2.0

Description

An open source ecosystem for IoT development

Added to portage

2026-09-26

pydata-sphinx-theme - 0.22.0
Ebuild name:

dev-python/pydata-sphinx-theme-0.22.0

Description

Bootstrap-based Sphinx theme from the PyData community

Added to portage

2026-09-26

pykwalify - 1.8.0-r4
Ebuild name:

dev-python/pykwalify-1.8.0-r4

Description

Python lib/cli for JSON/YAML schema validation

Added to portage

2026-09-26

pypy - 3.12.8.0.0
Ebuild name:

dev-lang/pypy-3.12.8.0.0

Description

A fast, compliant alternative implementation of the Python () language

Added to portage

2026-09-26

pypy3-exe - 3.12.8.0.0
Ebuild name:

dev-lang/pypy3-exe-3.12.8.0.0

Description

PyPy3.12 executable (build from source)

Added to portage

2026-09-26

pypy3-exe-bin - 3.12.8.0.0
Ebuild name:

dev-lang/pypy3-exe-bin-3.12.8.0.0

Description

PyPy executable (pre-built version)

Added to portage

2026-09-26

qbittorrent - 5.1.4-r1
Ebuild name:

net-p2p/qbittorrent-5.1.4-r1

Description

BitTorrent client in C++ and Qt

Added to portage

2026-09-26

qbittorrent - 5.2.0-r1
Ebuild name:

net-p2p/qbittorrent-5.2.0-r1

Description

BitTorrent client in C++ and Qt

Added to portage

2026-09-26

qbittorrent - 5.2.3
Ebuild name:

net-p2p/qbittorrent-5.2.3

Description

BitTorrent client in C++ and Qt

Added to portage

2026-09-26

qtractor - 1.6.4
Ebuild name:

media-sound/qtractor-1.6.4

Description

Audio/MIDI multi-track sequencer written in C++ with the Qt framework

Added to portage

2026-09-26

quimup - 2.1.2-r1
Ebuild name:

media-sound/quimup-2.1.2-r1

Description

Qt client for the music player daemon (MPD)

Added to portage

2026-09-26

r8168 - 8.057.00
Ebuild name:

net-misc/r8168-8.057.00

Description

r8168 driver for Realtek 8111/8168 PCI-E NICs

Added to portage

2026-09-26

raspberrypi-firmware - 1.20260915
Ebuild name:

sys-boot/raspberrypi-firmware-1.20260915

Description

Raspberry Pi (all versions) bootloader and GPU firmware

Added to portage

2026-09-26

raspberrypi-image - 6.18.50_p20260915
Ebuild name:

sys-kernel/raspberrypi-image-6.18.50_p20260915

Description

Raspberry Pi (all versions) kernel and modules

Added to portage

2026-09-26

raspberrypi-sources - 6.18.50_p20260915
Ebuild name:

sys-kernel/raspberrypi-sources-6.18.50_p20260915

Description

Raspberry Pi kernel sources

Added to portage

2026-09-26

rest - 0.10.2-r1
Ebuild name:

net-libs/rest-0.10.2-r1

Description

Helper library for RESTful services

Added to portage

2026-09-26

rime-data - 1.0.20260922
Ebuild name:

app-i18n/rime-data-1.0.20260922

Description

Added to portage

2026-09-26

rosegarden - 26.06
Ebuild name:

media-sound/rosegarden-26.06

Description

MIDI and audio sequencer and notation editor

Added to portage

2026-09-26

rpi-eeprom - 28.32
Ebuild name:

dev-embedded/rpi-eeprom-28.32

Description

Updater for Raspberry Pi 4/5 bootloader and the VL805 USB controller

Added to portage

2026-09-26

rtorrent - 0.16.24
Ebuild name:

net-p2p/rtorrent-0.16.24

Description

BitTorrent Client using libtorrent

Added to portage

2026-09-26

scikit-build-core - 1.1.0
Ebuild name:

dev-python/scikit-build-core-1.1.0

Description

Build backend for CMake based projects

Added to portage

2026-09-26

sof-firmware - 2026.09.1
Ebuild name:

sys-firmware/sof-firmware-2026.09.1

Description

Sound Open Firmware (SOF) binary files

Added to portage

2026-09-26

sqlalchemy - 2.1.1
Ebuild name:

dev-python/sqlalchemy-2.1.1

Description

Python SQL toolkit and Object Relational Mapper

Added to portage

2026-09-26

stripe-mock - 0.205.0
Ebuild name:

dev-util/stripe-mock-0.205.0

Description

Mock HTTP server that responds like the real Stripe API

Added to portage

2026-09-26

tavern - 3.7.0
Ebuild name:

dev-python/tavern-3.7.0

Description

A tool, library, and Pytest plugin for testing RESTful APIs

Added to portage

2026-09-26

tinysparql - 3.12.0
Ebuild name:

app-misc/tinysparql-3.12.0

Description

Low-footprint RDF triple store with SPARQL 1.1 interface

Added to portage

2026-09-26

tox - 4.64.3
Ebuild name:

dev-python/tox-4.64.3

Description

virtualenv-based automation of test activities

Added to portage

2026-09-26

uvicorn - 0.54.0
Ebuild name:

dev-python/uvicorn-0.54.0

Description

Lightning-fast ASGI server implementation

Added to portage

2026-09-26

vanilla-kernel - 6.18.54
Ebuild name:

sys-kernel/vanilla-kernel-6.18.54

Description

Linux kernel built from vanilla upstream sources

Added to portage

2026-09-26

vanilla-kernel - 7.2.8
Ebuild name:

sys-kernel/vanilla-kernel-7.2.8

Description

Linux kernel built from vanilla upstream sources

Added to portage

2026-09-26

wireshark - 4.6.9
Ebuild name:

net-analyzer/wireshark-4.6.9

Description

Network protocol analyzer (sniffer)

Added to portage

2026-09-26

xdelta - 1.2.0
Ebuild name:

dev-util/xdelta-1.2.0

Description

Computes changes between binary or text files and creates deltas

Added to portage

2026-09-26

rdf newsfeed | rss newsfeed | Atom newsfeed
Copyright 2004-2025 Sascha Nitsch Unternehmensberatung GmbH
- Copyright and legal notices -
Time to create this page: 28.6 ms