from small one page howto to huge articles all in one place

search text in:




Other .linuxhowtos.org sites: www.linuxhowtos.org
toolsntoys.linuxhowtos.org



Last additions:
How to make X listen on port 6000

How to make X listen on port 6000

words:

34

views:

88564

userrating:

average rating: 1.2 (52 votes) (1=very good 6=terrible)


May, 25th 2007:
April, 26th 2007:
Apr, 10th. 2007:
Druckversion . pdf icon
You are here: Portage


Details of dev-python/test:

Description: Virtual to install 'test' package from stdlib
Homepage:
https://docs.python.org/3/library/test.html

available versions:

releasesalphaamd64armhppaia64mipsppcppc64ppc macoss390shsparcx86USE-Flagsdependenciesebuild warnings
test-0 ~++~-~++-~-~+none
show
show
Legend:
+ stable
~ testing
- not available
some ebuild warning depend on specific use-flags or architectures, all ebuild-warnings are shown.

Known bugs:
bug IDcomponentassigned tostatusdescriptionlast change
366395Keywording and StabilizationrafaelmartinsUNCONFIRMED>=dev-lang/luajit-2.0.0_beta7 needs arm and ppc testing2012-05-31 17:47:27
366809Serveridl0rUNCONFIRMEDwww-apache/mod_perl-2.0.5 fails tests2011-05-12 23:01:20
371911Otherinfra-bugsUNCONFIRMEDrequesting an A record for contest.gentoo.org2012-05-05 18:33:49
373561UnspecifiedjavaUNCONFIRMED[java-overlay] dev-java/testng-5.2 fails to download testng-5.2.zip2012-07-10 09:51:53
373795Applicationsrobbat2UNCONFIRMEDapp-text/convmv-1.10 fails tests2012-11-07 11:19:40
374925ApplicationsperlUNCONFIRMEDmail-filter/spamassassin-3.3.2-r1 fails test spamd_ssl_v2.t2012-04-27 08:36:13
376123Ebuildsmaintainer-wantedUNCONFIRMEDCppUTest-2.3.ebuild (New Package)2011-07-25 09:15:02
381711ApplicationsperlUNCONFIRMEDdev-perl/IO-Tty-1.100.0 fails tests on amd642011-09-04 07:54:02
383455Ebuildsmaintainer-wantedUNCONFIRMEDapp-misc/openplacos/openplacos-0.3.0.ebuild New ebuild, latest stable releases on x86 and amd642012-10-11 17:25:44
383985Librarybase-systemUNCONFIRMEDdev-libs/libpcre-8.13-r1 fails test RunTest2012-12-02 15:46:18
383995ApplicationsgstreamerUNCONFIRMEDmedia-plugins/gst-plugins-ffmpeg-0.10.12 fails test2012-09-06 23:05:53
384137EbuildsperlUNCONFIRMEDdev-perl/Inline-0.480.0: fails tests with parallel make2011-09-27 16:26:48
384731Core systembase-systemUNCONFIRMEDsys-devel/libtool-2.4-r3 fails tests 42, 84, 112 on hardened2011-11-21 22:32:49
386843DevelopmentvoyageurUNCONFIRMEDsys-devel/clang-2.9-r1 fails test PCH/cxx-typeid.cpp2011-10-16 03:36:44
388931ApplicationspatrickUNCONFIRMEDapp-benchmarks/phoronix-test-suite-3.2.1: lspci command not found on first run2012-01-08 15:46:15
389533Applicationsdesktop-wmUNCONFIRMEDx11-wm/icewm-1.3.7 - src_test(): iceview.cc:480:38: error: no matching function for call to ‘TextVie2012-07-05 11:48:34
390245Core systembase-systemUNCONFIRMEDsys-fs/mtools-4.0.15 - mcd fails to mount SD memory card (with all available (tested) card readers)2011-11-20 07:19:18
391185UnspecifiedpythonUNCONFIRMED=dev-python/utidylib-0.2-r1 - src_test(): Segmentation fault in trial2012-02-18 20:19:49
391793Core systemtoolchainUNCONFIRMEDsys-devel/binutils-2.22 fails tests2013-01-15 14:18:56
393159Core systemtoolchainUNCONFIRMEDsys-libs/glibc-2.13-r4: fails tests2012-08-14 16:22:49
394957UnspecifiedtexUNCONFIRMED=dev-tex/chktex-1.6.4 fails tests2012-07-07 13:07:17
395475Core systembase-systemUNCONFIRMEDsys-devel/libtool-2.4.2 fails tests: 8 failed (5 expected failures).2012-05-23 17:17:13
395481Core systemtoolchainUNCONFIRMEDsys-libs/glibc-2.14.1-r1: stdlib/tst-putenv.out test failure2012-08-14 16:23:11
395491Core systemtoolchainUNCONFIRMEDdev-util/dejagnu-1.5 failed (test phase)2013-01-23 05:24:15
395495ApplicationspythonUNCONFIRMEDdev-lang/python-3.2.2 failed (test phase)2011-12-22 08:56:37
395817ApplicationssoundUNCONFIRMEDmedia-libs/libsndfile-1.0.25: fails tests with python-32012-01-18 16:03:11
398731Ebuildsmaintainer-wantedUNCONFIRMEDnet-analyzer/slowhttptest-1.3.ebuild Application Layer DoS attack simulator2012-01-13 14:35:35
399087ApplicationstexUNCONFIRMEDdev-tex/pgf-2.10: Undefined control sequence "\pgf@test"2012-01-17 04:11:17
399491Core systembase-systemUNCONFIRMEDsys-devel/automake-1.11.2-r1 - fails py-compile-basic.test py-compile-basic2.test py-compile-basedir2012-02-06 11:51:29
399867GamesgamesUNCONFIRMEDnew ebuilds: games-action/minetest games-action/minetest_game2013-02-20 16:12:41
400997Ebuildsmaintainer-wantedUNCONFIRMEDnet-analyzer/httest - Http Test Tool2012-10-25 13:52:31
401317ApplicationsbluenessUNCONFIRMEDnet-misc/curl-7.24.0: test cases failed: 1007 1009 1049 1093 1094 10992012-03-24 18:04:32
402027EbuildspythonUNCONFIRMEDdev-python/django-1.3.1 with dev-python/psycopg-2.4.2 fails app/project tests2012-04-28 20:35:29
403249Core systembase-systemUNCONFIRMEDsys-apps/coreutils-8.14: Fails test-parse-datetime (exit: 134)2012-03-29 07:20:53
403279Core systembase-systemUNCONFIRMED=sys-apps/coreutils-8.15 fails FEATURES=test2012-02-18 16:37:27
403301Applicationsx11UNCONFIRMEDx11-apps/intel-gpu-tools-1.1 - work/intel-gpu-tools-1.1/tests/testdisplay.c:760:38: error: storage s2012-02-14 18:04:33
403551OtheraltUNCONFIRMEDCompilation of gcc-4.5.3-r1 fails with "configure: error: Link tests are not allowed after GCC_NO_EX2012-02-14 10:57:13
404389Core systembase-systemUNCONFIRMED=sys-process/procps-3.3.3 fails tests2013-01-12 11:43:39
404423Unspecifiedcommon-lispUNCONFIRMEDdev-lisp/ecls-12.2.1 fails to run tests - An error occurred during initialization: Module error: Don2013-02-02 10:15:50
404427HardenedhardenedUNCONFIRMEDdev-python/cvxopt-1.1.4-r1 test suite triggers ssp2012-02-18 17:56:36
405195ApplicationsbazaarUNCONFIRMEDdev-vcs/bzr-2.4.2 fails tests (test_btree_index)2012-09-18 11:45:46
405325Core systemtoolchainUNCONFIRMEDsys-devel/autogen-5.11.2: src_test left an orphan process running in the background2012-03-22 14:50:16
406255Sandboxmaintainer-neededUNCONFIRMEDdev-libs/apr-1.4.6 failed test: testlfs : \/bin/bash: line 2: 3428 Segmentation fault (core d2012-12-29 17:08:08
406723Core systembase-systemUNCONFIRMEDsys-devel/autoconf-2.13: Fails test AC_FUNC_GETLOADAVG2013-01-16 01:39:00
406937Ebuildsmaintainer-wantedUNCONFIRMEDdev-libs/rapidxml-1.13 - an attempt to create the fastest XML parser possible2012-03-05 20:41:21
407077Core systemtoolchainUNCONFIRMEDsys-devel/autogen-5.12: Fails cond.test.2012-03-06 17:01:37
407589Ebuildsmaintainer-wantedUNCONFIRMEDdev-python/factory_boy : A versatile test fixtures replacement2012-03-12 12:07:45
408047Core systembase-systemUNCONFIRMEDsys-fs/cryptsetup-1.4.1 fails 4 tests : password-hash-test loopaes-test compat-test api-test2013-01-20 10:26:44
408151LibraryperlUNCONFIRMEDdev-perl/Cairo-1.90.0 with dev-lang/perl-5.14.2 - Failed 1/8 test programs. 6/270 subtests failed.2012-04-03 19:32:36
410595Ebuildsmaintainer-wantedUNCONFIRMEDsys-apps/fwts Firmware Test Suite2013-02-09 20:17:55
413621Core systembase-systemUNCONFIRMEDsys-apps/coreutils-8.15 - src_test(): errors setting up rm/deep-2 and du/long-from-unreadable2012-11-20 03:30:47
415789ApplicationsjlecUNCONFIRMEDapp-arch/p7zip-9.20.1-r1 fails tests2012-05-30 19:15:06
415799Core systembase-systemUNCONFIRMEDsys-devel/autoconf-2.69 fails test Go2012-05-15 14:45:53
415801GNOMEgnomeUNCONFIRMEDwww-client/epiphany-3.4.1 fails test test-ephy-embed-single2012-09-16 08:52:40
416903ApplicationslivecdUNCONFIRMEDsys-block/parted-3.1 fails tests [t8001-loop-blkpg.sh t2100-zerolen.sh]2012-05-21 14:59:50
418161Hardenedx11UNCONFIRMEDmedia-libs/mesa-8.0.3 test causes buffer overflow2012-06-02 19:02:24
419529Applicationsbase-systemUNCONFIRMEDsys-libs/db-4.8.30 fails tests with no space left on device2012-06-04 10:55:39
419787PrintingprintingUNCONFIRMEDnet-print/foo2zjs-99999999 with app-text/ghostscript-gpl-9.05-r1 fails tests2012-10-09 09:27:44
419955Applicationsmedia-videoUNCONFIRMEDmedia-video/vlc-2.0.1 - src_test(): srtp-test-aes / srtp-test-recv: Libgcrypt warning: missing initi2012-09-19 13:11:08
420033DevelopmentperlUNCONFIRMEDdev-perl/MooseX-Types-DateTimeX fails tests with MooseX-Types-DateTime-ButMaintained-0.140.02012-06-07 09:09:11
420271ApplicationspythonUNCONFIRMED=dev-python/twisted-11.0.0: fails test wrt twisted.test.test_udp.Server2012-06-11 10:59:36
421741Developmentrobbat2UNCONFIRMEDdev-vcs/git-1.7.3.4-r1: test t7508-status.sh failed with FEATURES="sandbox -userpriv"2012-06-19 15:11:50
422877Core systembase-systemUNCONFIRMEDnet-firewall/iptables: ip6tables "state" test fails; will not jump to ACCEPT on ESTABLISHED,RELATED 2013-02-16 13:31:38
423399EbuildssciUNCONFIRMEDsci-libs/parmetis-3.2.0: fails tests2012-09-25 10:57:08
425106Core systembase-systemUNCONFIRMEDsys-libs/db-4.8.30 FEATURES="test" - tests are not run : You must have USE=tcl to run the sys-libs/d2012-07-10 14:09:54
426306Core systemtoolchainUNCONFIRMEDsys-libs/glibc-2.14.1-r3: tests failed2012-11-10 09:00:26
426898Applicationspolynomial-cUNCONFIRMED=app-emulation/virtualbox-modules-4.1.12 with sys-kernel/vanilla-sources-3.4.5 - src_test(): .../wor2012-11-13 17:18:09
427304ApplicationsvoyageurUNCONFIRMED=dev-libs/mpfr-3.1.1 fails tests with clang-3.1-r42012-10-08 15:16:38
427310ApplicationsvoyageurUNCONFIRMED=dev-libs/ppl-0.12.1 fails tests with clang-3.1-r42012-07-25 14:12:12
427314Core systemvoyageurUNCONFIRMEDsys-apps/sed fails test with clang-3.1-r42012-07-21 14:07:01
427316Core systemvoyageurUNCONFIRMED=sys-apps/findutils-4.5.10-r1 fails tests with clang-3.1-r42012-07-21 14:07:00
427318ApplicationsvoyageurUNCONFIRMEDdev-libs/popt fails tests with clang-3.1-r42012-10-09 15:26:37
427348ApplicationsvoyageurUNCONFIRMED=dev-db/sqlite-3.7.13 fails test with clang-3.1-r42012-07-21 14:07:01
427350ApplicationsvoyageurUNCONFIRMED=dev-lang/perl-5.16.0 fails tests with clang-3.1-r42012-07-21 14:07:00
427430FreeBSDbsdUNCONFIRMEDWhen using latest clang-3.1-r5, sys-freebsd/boot0-9.0/9.1_beta1 will fail to compile2012-11-25 11:39:35
427616Prefix SupportprefixUNCONFIRMEDdev-lisp/sbcl-1.0.55-r1 fails to install on OS X (with FEATURES=test)2012-10-22 18:12:45
430010ApplicationsbluenessUNCONFIRMEDapp-admin/webapp-config-1.50.19 fails test: WebappConfig.content.Contents2012-08-05 14:22:59
430894Core systemmattmUNCONFIRMEDsys-power/apcupsd-3.14.10-r1[snmp] fails to build with latest net-snmp2013-02-02 23:16:04
431036ApplicationspchristUNCONFIRMEDdev-lisp/sbcl fails to compile (when the build system is testing "sb-posix")2012-08-30 18:50:48
431928Ebuildsmaintainer-wantedUNCONFIRMEDapp-benchmarks/mmtests - a configurable test suite that runs a number of common workloads of interes2012-08-20 02:07:01
432296Developmentmaintainer-neededUNCONFIRMEDdev-libs/apr-1.4.5 fails to crosscompile: configure: error: cannot run test program while cross comp2013-01-03 18:43:02
432944UnspecifiedperlUNCONFIRMEDperl-gcpan/Math-GSL-0.27 wants to install perl-gcpan/Test-Tester-0.108 which conflics with installed2012-09-17 07:17:25
435144Ebuildsmaintainer-wantedUNCONFIRMEDsci-electronics/bitscope-dso - a suite of high performance mixed signal virtual test, measurement an2012-09-16 16:13:50
435488GNOMEgnomeUNCONFIRMEDmedia-libs/cogl-1.10.4 fails all tests2013-01-13 16:14:42
435982ApplicationsnetmonUNCONFIRMEDnet-analyzer/tcpdump-4.3.0 fails tests: esp4, esp5, isakmp4, ikev2pI22012-10-12 10:51:32
436594Core systembase-systemUNCONFIRMED>=sys-apps/memtest86+-2.00 should make use of/document "console="2012-09-29 15:40:51
437416LibrarybluenessUNCONFIRMEDnet-libs/libmicrohttpd-0.9.21 fails tests with USE="ssl"2012-12-26 13:26:06
437542Other documentsdocs-teamUNCONFIRMEDSuggestion for using speaker-test instead of relying on an audio player in the ALSA guide2012-10-29 19:09:04
438620GNOMEgnomeUNCONFIRMEDdev-libs/glib-2.32.4-r1 - src_test(): FAIL: run-assert-msg-test.sh2012-10-17 17:36:06
439136OpenRCopenrcUNCONFIRMEDsys-apps/openrc beta testing2012-11-06 21:25:24
439344GNOMEgnomeUNCONFIRMEDdev-libs/glib USE=-utils should not install gtester-report man page2012-10-23 10:09:12
439372Core systemjdhoreUNCONFIRMEDsys-apps/paludis[ruby-bindings] installs unslotted to latest ruby (actually 1.9) disregarding eselec2013-02-07 08:07:43
440576ApplicationspatrickUNCONFIRMEDapp-benchmarks/phoronix-test-suite-4.0.1: some elog messages should only be shown when upgrading fro2012-10-31 16:26:55
442838EbuildssciUNCONFIRMEDsci-libs/netcdf-cxx-4.2: fails tests2012-11-13 06:16:03
443600ApplicationssoundUNCONFIRMEDmedia-libs/libsndfile-1.0.25 - Fails test with SyntaxError: invalid syntax in binheader_writef_check2012-11-17 18:45:12
444380ApplicationsvoipUNCONFIRMEDnet-voip/ekiga-3.2.7 - Fails src_test for LINGUAS=en_GB - Document ./en_GB/ekiga.xml does not valida2012-11-22 22:49:37
444502ApplicationspatrickUNCONFIRMEDapp-benchmarks/phoronix-test-suite-4.0.1 - No matter what, it complains that PHP_TARGETS is empty2012-12-25 22:09:37
445081ApplicationspythonUNCONFIRMEDnet-zope/zope-interface-3.8.0 - src_test(): TypeError: metaclass conflict: the metaclass of a derive2013-02-02 10:01:54
445083ApplicationsdjcUNCONFIRMEDdev-vcs/mercurial-2.1.1 src_test(): ...: Permission denied2012-12-16 14:33:53
445548Ebuildsmaintainer-wantedUNCONFIRMEDnet-analyzer/tespeed - New package. - Terminal network speed test that uses servers from Speedtest.n2012-12-04 09:31:07
445594Core systembluenessUNCONFIRMEDsys-apps/coreutils - FAIL: tests/cp/fiemap-FMR.sh - Fails src_test with -march=native : valgrind "un2013-02-12 03:34:41
445636Librarybase-systemUNCONFIRMEDdev-libs/libpcre-8.32 - stack size should be increased for the test case2012-12-04 15:29:58
446386Core systembase-systemUNCONFIRMEDsys-devel/automake-1.12.5 fails tests related to yacc2012-12-08 05:53:22
446628EbuildsgraphicsUNCONFIRMEDmedia-gfx/gtkimageview-1.6.4 should not restrict userpriv when not running tests2012-12-09 23:41:57
446828Applicationsrobbat2UNCONFIRMEDnet-analyzer/sslsniff-0.8-r1 - conftest.cpp:21:26: fatal error: boost/asio.hpp: No such file or dire2012-12-11 22:11:50
447474Core systembase-systemUNCONFIRMEDsys-devel/make-3.82-r4 - fails 1 test in features/parallelism2012-12-17 16:10:34
447502LibrarysciUNCONFIRMEDdev-python/numpy-1.6.2 - FAIL: test_pareto (test_random.TestRandomDist)2013-01-05 08:15:18
447970Core systemsandboxUNCONFIRMEDsys-apps/sandbox makes autoconf's getcwd long path test take hours2013-01-31 14:19:12
448104DevelopmentperlUNCONFIRMEDdev-perl/PortageXS-0.02.10-r2 - test-suite fails - Cannot open file /etc/portage/make.conf at lib//P2012-12-24 09:37:14
448110DevelopmentsciUNCONFIRMEDdev-python/rpy-2.2.6-r1 fails test testInterruptR - AssertionError: True is not false2013-01-23 17:03:53
448112ApplicationsspingUNCONFIRMEDmedia-gfx/gimp-2.8.2-r1 has several test failures.2012-12-24 00:28:37
448780DevelopmentrubyUNCONFIRMED=dev-ruby/webmock-1.7.4 - Many tests failed.2013-02-20 06:24:05
449320LibrarysciUNCONFIRMEDsci-libs/cholmod-2.0.1 - configure: .../temp/ccKrajc0.o: In function `main': conftest.c:(.text+0x7):2013-01-05 00:28:07
450776HardenedhardenedUNCONFIRMEDapp-emulation/wine-1.5.21 - configure: checking for -lGL... ./conftest: error while loading shared l2013-02-11 21:23:57
451054LibrarycjkUNCONFIRMEDdev-libs/oniguruma-5.9.2-r1 - autotools-utils_src_prepare: Cannot find the latest automake! Tried 1.2013-01-09 14:27:12
451922Core systemtoolchainUNCONFIRMEDsys-libs/glibc-2.15-r3 installs despite test failures2013-01-16 02:40:16
452546LibrarychutzpahUNCONFIRMEDdev-python/cov-core should not RDEPEND on dev-python/pytest2013-01-16 16:14:02
452898DevmanualdevmanualUNCONFIRMEDPortage only does dependency checking on the latest slot2013-01-21 15:46:28
453098Core systembase-systemUNCONFIRMEDsys-devel/patch-2.7.1-r1: fails tests crlf-handling and need-filename2013-01-21 11:54:50
454384BugzillabugzillaUNCONFIRMEDExtend "My Bugs" list with RESOLVED NEEDINFO and RESOLVED TEST-REQUEST states2013-01-28 15:27:34
454744Ebuildsmaintainer-wantedUNCONFIRMEDnet-dns/validns should depend on new package dev-perl/Test-Command-Simple for src_test()2013-01-31 16:22:52
454808LibrarygnomeUNCONFIRMEDnet-libs/webkit-gtk-1.10.2-r300 - File "./Tools/Scripts/run-gtk-tests", line 168: Could not start ac2013-02-08 00:08:40
454956GNOMEgnomeUNCONFIRMEDgnome-base/orbit-2.14.19-r1 with sys-devel/automake-1.13.1 - test/everything/Makefile.am:81: error: 2013-02-01 06:41:21
455104DevelopmentpythonUNCONFIRMEDdev-python/nose-1.2.1_p2012 fails tests (fails to parse coverage output)2013-02-06 10:00:25
455276DevelopmentvapierUNCONFIRMEDdev-cpp/gmock-1.6.9 with python3 fails to execute test suite2013-02-05 11:28:28
455516Core systemclusterUNCONFIRMEDsys-fs/gfs2-utils with sys-kernel/hardened-sources-3.7.3 - In file included from conftest.c:84: /usr2013-02-08 16:35:19
456264LibraryfontsUNCONFIRMEDmedia-fonts/droid-113-r2 with multiple values in 2013-02-15 20:47:53
456308Core systembase-systemUNCONFIRMEDgrub2 won't launch memtest86 and memtest86+ if / and /boot are separated partitions and grub2 graphi2013-02-13 22:19:39
456928Applicationsphp-bugsUNCONFIRMEDdev-lang/php-5.4.8[imap] - ./conftest: symbol lookup error: /usr/lib64/libc-client.so.1: undefined s2013-02-13 19:05:07


back



Support us on Content Nation

New Packages

- as rdf newsfeed
- as rss newsfeed
- as Atom newsfeed
2026-09-21
git-sources - 7.3_rc4
Ebuild name:

sys-kernel/git-sources-7.3_rc4

Description

The very latest -git version of the Linux kernel

Added to portage

2026-09-21

ollama - 0.34.2
Ebuild name:

sci-ml/ollama-0.34.2

Description

Get up and running with Llama 3, Mistral, Gemma, and other language models

Added to portage

2026-09-21

pahole - 1.32
Ebuild name:

dev-util/pahole-1.32

Description

pahole (Poke-a-Hole) and other DWARF utilities

Added to portage

2026-09-21

pypy - 3.11.8.0.0
Ebuild name:

dev-lang/pypy-3.11.8.0.0

Description

A fast, compliant alternative implementation of the Python () language

Added to portage

2026-09-21

pypy3-exe - 3.11.8.0.0
Ebuild name:

dev-lang/pypy3-exe-3.11.8.0.0

Description

PyPy3.11 executable (build from source)

Added to portage

2026-09-21

pypy3-exe-bin - 3.11.8.0.0
Ebuild name:

dev-lang/pypy3-exe-bin-3.11.8.0.0

Description

PyPy3.11 executable (pre-built version)

Added to portage

2026-09-21

uutils-coreutils - 0.12.0
Ebuild name:

sys-apps/uutils-coreutils-0.12.0

Description

GNU coreutils rewritten in Rust

Added to portage

2026-09-21

2026-09-20
adwaita-icon-theme - 50.0
Ebuild name:

x11-themes/adwaita-icon-theme-50.0

Description

GNOME default icon theme

Added to portage

2026-09-20

amqp - 5.4.0
Ebuild name:

dev-python/amqp-5.4.0

Description

Low-level AMQP client for Python (fork of amqplib)

Added to portage

2026-09-20

at-spi2-core - 2.60.7
Ebuild name:

app-accessibility/at-spi2-core-2.60.7

Description

D-Bus accessibility specifications and registration daemon

Added to portage

2026-09-20

automake - 1.19
Ebuild name:

dev-build/automake-1.19

Description

Used to generate Makefile.in from Makefile.am

Added to portage

2026-09-20

automake-vanilla - 1.19
Ebuild name:

dev-build/automake-vanilla-1.19

Description

Used to generate Makefile.in from Makefile.am

Added to portage

2026-09-20

automake-wrapper - 20260920
Ebuild name:

dev-build/automake-wrapper-20260920

Description

Wrapper for automake to manage multiple automake versions

Added to portage

2026-09-20

cairomm - 1.18.1
Ebuild name:

dev-cpp/cairomm-1.18.1

Description

C++ bindings for the Cairo vector graphics library

Added to portage

2026-09-20

cups-filters - 9999
Ebuild name:

net-print/cups-filters-9999

Description

Cups filters

Added to portage

2026-09-20

e16 - 1.0.32-r1
Ebuild name:

x11-wm/e16-1.0.32-r1

Description

Enlightenment Window Manager (E16)

Added to portage

2026-09-20

editor - 0-r8
Ebuild name:

virtual/editor-0-r8

Description

Virtual for editor

Added to portage

2026-09-20

eigen - 3.4.1-r1
Ebuild name:

dev-cpp/eigen-3.4.1-r1

Description

C++ template library for linear algebra

Added to portage

2026-09-20

feh - 3.13
Ebuild name:

media-gfx/feh-3.13

Description

A fast, lightweight imageviewer using imlib2

Added to portage

2026-09-20

gcc - 15.3.1_p20260918
Ebuild name:

sys-devel/gcc-15.3.1_p20260918

Description

The GNU Compiler Collection

Added to portage

2026-09-20

gcr - 4.4.1
Ebuild name:

app-crypt/gcr-4.4.1

Description

Libraries for cryptographic UIs and accessing PKCS11 modules

Added to portage

2026-09-20

gdm - 50.3
Ebuild name:

gnome-base/gdm-50.3

Description

GNOME Display Manager for managing graphical display servers and user logins

Added to portage

2026-09-20

gdm - 50.3-r1
Ebuild name:

gnome-base/gdm-50.3-r1

Description

GNOME Display Manager for managing graphical display servers and user logins

Added to portage

2026-09-20

gnome-calendar - 50.0
Ebuild name:

gnome-extra/gnome-calendar-50.0

Description

Manage your calendars with simple and modern interface

Added to portage

2026-09-20

gnome-control-center - 50.4
Ebuild name:

gnome-base/gnome-control-center-50.4

Description

GNOME's main interface to configure various aspects of the des

Added to portage

2026-09-20

gnome-session - 50.1
Ebuild name:

gnome-base/gnome-session-50.1

Description

Gnome session manager

Added to portage

2026-09-20

gnome-session-openrc - 50.0
Ebuild name:

gnome-base/gnome-session-openrc-50.0

Description

Gnome session leader for OpenRC

Added to portage

2026-09-20

gnome-settings-daemon - 50.1
Ebuild name:

gnome-base/gnome-settings-daemon-50.1

Description

Gnome Settings Daemon

Added to portage

2026-09-20

gnome-shell - 50.5
Ebuild name:

gnome-base/gnome-shell-50.5

Description

Provides core UI functions for the GNOME desktop

Added to portage

2026-09-20

gnome-shell-extension-applications-overview-tooltip - 24-r1
Ebuild name:

gnome-extra/gnome-shell-extension-applications-overview-tooltip-24-r1

Description

Show tooltip with full name a

Added to portage

2026-09-20

gnome-shell-extension-dash-to-panel - 74
Ebuild name:

gnome-extra/gnome-shell-extension-dash-to-panel-74

Description

An icon taskbar for the Gnome Shell

Added to portage

2026-09-20

gnome-shell-extension-desktop-icons-ng - 51.0.8
Ebuild name:

gnome-extra/gnome-shell-extension-desktop-icons-ng-51.0.8

Description

Desktop icon support for GNOME Shell

Added to portage

2026-09-20

gnome-shell-extensions - 50.4
Ebuild name:

gnome-extra/gnome-shell-extensions-50.4

Description

JavaScript extensions for GNOME Shell

Added to portage

2026-09-20

gnome-shell-frippery - 50.0
Ebuild name:

gnome-extra/gnome-shell-frippery-50.0

Description

Unofficial extension pack providing GNOME 2-like features

Added to portage

2026-09-20

gsettings-desktop-schemas - 50.1
Ebuild name:

gnome-base/gsettings-desktop-schemas-50.1

Description

Collection of GSettings schemas for GNOME desktop

Added to portage

2026-09-20

gtkmm - 4.22.0
Ebuild name:

dev-cpp/gtkmm-4.22.0

Description

C++ interface for GTK+

Added to portage

2026-09-20

howm - 1.5.0
Ebuild name:

app-emacs/howm-1.5.0

Description

Note-taking tool on Emacs

Added to portage

2026-09-20

ht - 2.3
Ebuild name:

app-emacs/ht-2.3

Description

The missing hash table library for Emacs

Added to portage

2026-09-20

htmlize - 1.59
Ebuild name:

app-emacs/htmlize-1.59

Description

HTML-ize font-lock buffers in Emacs

Added to portage

2026-09-20

httpd - 1.1-r1
Ebuild name:

app-emacs/httpd-1.1-r1

Description

A HTTP server embedded in the Emacs

Added to portage

2026-09-20

hydra - 0.15.0
Ebuild name:

app-emacs/hydra-0.15.0

Description

Make Emacs bindings that stick around

Added to portage

2026-09-20

icicles - 2018.02.13.23733
Ebuild name:

app-emacs/icicles-2018.02.13.23733

Description

Minibuffer input completion and cycling

Added to portage

2026-09-20

jc - 1.26.0
Ebuild name:

dev-python/jc-1.26.0

Description

Converts the output of popular command-line tools and file-types to JSON

Added to portage

2026-09-20

libadwaita - 1.9.4
Ebuild name:

gui-libs/libadwaita-1.9.4

Description

Building blocks for modern GNOME applications

Added to portage

2026-09-20

libcec - 8.1.7
Ebuild name:

dev-libs/libcec-8.1.7

Description

Library for communicating with the Pulse-Eight USB HDMI-CEC Adaptor

Added to portage

2026-09-20

libcupsfilters - 9999
Ebuild name:

net-print/libcupsfilters-9999

Description

library for developing printing features, split out of cups-filters

Added to portage

2026-09-20

libdvdread - 7.1.1
Ebuild name:

media-libs/libdvdread-7.1.1

Description

Library for DVD navigation tools

Added to portage

2026-09-20

libltdl - 2.6.2
Ebuild name:

dev-libs/libltdl-2.6.2

Description

A shared library tool for developers

Added to portage

2026-09-20

libtimidity - 0.2.8
Ebuild name:

media-libs/libtimidity-0.2.8

Description

MIDI to WAVE converter library

Added to portage

2026-09-20

libtool - 2.6.2
Ebuild name:

dev-build/libtool-2.6.2

Description

A shared library tool for developers

Added to portage

2026-09-20

libwmf - 0.2.16
Ebuild name:

media-libs/libwmf-0.2.16

Description

Library for reading vector images in Microsoft's Windows Metafile Format (

Added to portage

2026-09-20

man-pages-ja - 20260915
Ebuild name:

app-i18n/man-pages-ja-20260915

Description

Collection of manual pages translated into Japanese

Added to portage

2026-09-20

minicoredumper - 2.1.0
Ebuild name:

sys-process/minicoredumper-2.1.0

Description

Core dump file processor

Added to portage

2026-09-20

mutter - 50.5
Ebuild name:

x11-wm/mutter-50.5

Description

GNOME compositing window manager based on Clutter

Added to portage

2026-09-20

nautilus - 50.3.1
Ebuild name:

gnome-base/nautilus-50.3.1

Description

Default file manager for the GNOME desktop

Added to portage

2026-09-20

networkmanager-libreswan - 1.2.31
Ebuild name:

net-vpn/networkmanager-libreswan-1.2.31

Description

NetworkManager libreswan plugin

Added to portage

2026-09-20

openpgp-keys-ddevault - 20250219
Ebuild name:

sec-keys/openpgp-keys-ddevault-20250219

Description

Drew DeVault's PGP signing key

Added to portage

2026-09-20

openpgp-keys-kamilaszewczyk - 20260920
Ebuild name:

sec-keys/openpgp-keys-kamilaszewczyk-20260920

Description

OpenPGP keys used by Kamila Szewczyk

Added to portage

2026-09-20

openpgp-keys-libtool - 20260920
Ebuild name:

sec-keys/openpgp-keys-libtool-20260920

Description

OpenPGP keys used by GNU libtool

Added to portage

2026-09-20

openpgp-keys-paulhardy - 20220319
Ebuild name:

sec-keys/openpgp-keys-paulhardy-20220319

Description

OpenPGP keys used by Paul Hardy

Added to portage

2026-09-20

pch-session - 50.0
Ebuild name:

gnome-extra/pch-session-50.0

Description

Unofficial gnome based session with different default settings and ext

Added to portage

2026-09-20

poetry - 2.5.0
Ebuild name:

dev-python/poetry-2.5.0

Description

A frontend for poetry - a python dependency management and packaging tool

Added to portage

2026-09-20

poetry-core - 2.5.0
Ebuild name:

dev-python/poetry-core-2.5.0

Description

Poetry PEP 517 Build Backend

Added to portage

2026-09-20

poetry-plugin-export - 1.10.1
Ebuild name:

dev-python/poetry-plugin-export-1.10.1

Description

A plugin that allows the export of locked packages to variou

Added to portage

2026-09-20

portalocker - 4.4.0
Ebuild name:

dev-python/portalocker-4.4.0

Description

A library for Python file locking

Added to portage

2026-09-20

pypy - 2.7.8.0.0
Ebuild name:

dev-lang/pypy-2.7.8.0.0

Description

A fast, compliant alternative implementation of the Python () language

Added to portage

2026-09-20

pypy-exe - 8.0.0
Ebuild name:

dev-python/pypy-exe-8.0.0

Description

PyPy executable (build from source)

Added to portage

2026-09-20

pypy-exe-bin - 8.0.0
Ebuild name:

dev-python/pypy-exe-bin-8.0.0

Description

PyPy executable (pre-built version)

Added to portage

2026-09-20

sddm - 0.21.0_p20260819
Ebuild name:

x11-misc/sddm-0.21.0_p20260819

Description

Simple Desktop Display Manager

Added to portage

2026-09-20

shotwell - 33.0
Ebuild name:

media-gfx/shotwell-33.0

Description

Open source photo manager for GNOME

Added to portage

2026-09-20

tox - 4.63.0
Ebuild name:

dev-python/tox-4.63.0

Description

virtualenv-based automation of test activities

Added to portage

2026-09-20

unicode-data - 18.0.0
Ebuild name:

app-i18n/unicode-data-18.0.0

Description

Unicode data from unicode.org

Added to portage

2026-09-20

unicode-emoji - 18.0.0
Ebuild name:

app-i18n/unicode-emoji-18.0.0

Description

UTS 51 Unicode Emoji

Added to portage

2026-09-20

unifont - 18.0.01
Ebuild name:

media-fonts/unifont-18.0.01

Description

Unicode bitmap font with full Basic Multilingual Plane coverage

Added to portage

2026-09-20

uzdoom - 5.0.1
Ebuild name:

games-engines/uzdoom-5.0.1

Description

Modder-friendly hardware-accelerated source port of the DOOM engine

Added to portage

2026-09-20

virtualenv - 21.7.16
Ebuild name:

dev-python/virtualenv-21.7.16

Description

Virtual Python Environment builder

Added to portage

2026-09-20

virtualenv - 21.9.0
Ebuild name:

dev-python/virtualenv-21.9.0

Description

Virtual Python Environment builder

Added to portage

2026-09-20

xdg-desktop-portal-gnome - 50.0
Ebuild name:

sys-apps/xdg-desktop-portal-gnome-50.0

Description

Backend implementation for xdg-desktop-portal using GNOME

Added to portage

2026-09-20

rdf newsfeed | rss newsfeed | Atom newsfeed
Copyright 2004-2025 Sascha Nitsch Unternehmensberatung GmbH
- Copyright and legal notices -
Time to create this page: 29.1 ms