from small one page howto to huge articles all in one place
 

search text in:




Other .linuxhowtos.org sites: www.linuxhowtos.org
toolsntoys.linuxhowtos.org



Last additions:
How to make X listen on port 6000

How to make X listen on port 6000

words:

34

views:

62121

userrating:

average rating: 1.5 (4 votes) (1=very good 6=terrible)


May, 25th 2007:
April, 26th 2007:
Apr, 10th. 2007:
Druckversion . pdf icon
You are here: Portage


Details of dev-lang/j:

available versions:

releasesalphaamd64armhppaia64mipsppcppc64ppc macoss390shsparcx86USE-Flagsdependenciesebuild warnings
Legend:
+ stable
~ testing
- not available
some ebuild warning depend on specific use-flags or architectures, all ebuild-warnings are shown.

Known bugs:
bug IDcomponentassigned tostatusdescriptionlast change
419573JavajavaUNCONFIRMEDdev-util/visualvm needs dev-java/icedtea, but dev-java/icedtea-bin works2012-10-12 09:41:16
428588Applicationsc1pherUNCONFIRMEDnet-dns/djbdns: replace setup scripts with documentation2012-07-31 00:05:08
455122EbuildszerochaosUNCONFIRMEDnet-analyzer/wireshark-1.8.5{,-r1} emerge fails - Can't locate object method "recurse" via package 2013-02-16 13:32:31
452578DevelopmentyamakuzureUNCONFIRMED[seden overlay] dev-util/eclipse-sdk-3.7.1-r9 fails to start when 2013-01-17 09:24:25
452618DevelopmentyamakuzureUNCONFIRMED[seden overlay] dev-util/eclipse-sdk-3.7.1-r10 - Bug fixes regarding incorrectly slotted virtual/jdk2013-01-17 17:45:18
450254ApplicationsyamakuzureUNCONFIRMED[seden overlay] dev-util/eclipse-sdk-3.7.1-r7: slot conflicts with dev-java/swt-3.7.2:3.72013-01-09 07:27:10
446312ApplicationsxmwUNCONFIRMEDapp-shells/autojump-21.1.0 causes startDM.sh to segfault during system start2013-01-25 08:51:42
442106Core systemxmwUNCONFIRMEDsys-power/suspend-1.0 USE=fbsplash - ld: cannot find -lmng -ljpeg -llcms -lpng15 -lz -lfreetype2012-11-06 21:44:41
453788Core systemvoyageurUNCONFIRMEDsys-devel/llvm & sys-devel/clang: dependency trouble for build subprojects of llvm2013-02-02 21:37:08
449822Third-Party Toolstools-portageUNCONFIRMEDapp-portage/genlop - genlop -itc shows two emerge jobs when it is only one2013-01-03 00:07:55
436636JavatoolchainUNCONFIRMEDsys-devel/gcc-{4.5,4.6,4.7?}: gcj fails to compile java source code on ia64 (hardened) - Exception i2012-12-14 08:15:05
450964Core systemtoolchainUNCONFIRMEDsys-devel/gcc-4.6.3 - make[3]: *** [jc1] Error 12013-02-10 23:17:24
444762Core systemtoolchainUNCONFIRMEDsys-devel/gcc-4.6.3: multilib libjava wants 32bit jack (app-emulation/emul-linux-x86-soundlibs)2013-01-02 01:03:40
434452EbuildstoolchainUNCONFIRMED[4.5/ICE] www-client/firefox-15.0.1 - .../work/mozilla-release/js/src/vm/ObjectImpl.cpp:485:1: inter2012-12-07 08:28:56
385087GCC PortingtoolchainUNCONFIRMEDsys-devel/gcc-4.4.5: gcj seem to not install needed ca-certificates (/usr/lib/security/cacerts)2012-09-24 06:08:56
395491Core systemtoolchainUNCONFIRMEDdev-util/dejagnu-1.5 failed (test phase)2013-01-23 05:24:15
449784EbuildstexUNCONFIRMEDdjview-4.9.ebuild requires dbus as hard dependency2013-02-16 14:02:36
457032Keywording and StabilizationtexUNCONFIRMEDStabilize app-text/djview-4.92013-02-16 13:35:05
433457Core systemsystemdUNCONFIRMEDsys-apps/systemd should not store coredumps in its journal yet2012-10-27 21:52:30
452910Core systemsystemdUNCONFIRMEDsys-apps/systemd-196[python] needs dev-python/pygobject:3 - ImportError: No module named gi.reposito2013-01-20 17:07:04
455162DevelopmentssuominenUNCONFIRMEDdev-util/catfish-0.4.0.2 needs dev-python/pygobject:3 in RDEPEND - Error: The required module gi.rep2013-02-04 02:33:15
418065EbuildssoundUNCONFIRMEDmedialibs/libclthreads-2.4.0 doesn't create major version symlink to libclthreads.so.2.4.02012-10-04 15:44:15
418063EbuildssoundUNCONFIRMEDmedia-libs/libclxclient-3.6.1 doesn't create major version symlink to libclxclient.so.3.6.12013-01-26 17:59:37
417429ApplicationssoundUNCONFIRMEDmedia-sound/jack-3.1.1 - src_install(): SyntaxError: ('invalid syntax', ('/usr/lib64/python2.7/site-2013-01-27 12:28:16
418281Applicationssci-mathematicsUNCONFIRMED[sci-overlay] sci-mathematics/scilab-5.3.3-r1 - .../work/scilab-5.3.3/modules/renderer/src/java/org/2012-12-25 13:20:36
402869Unspecifiedsci-mathematicsUNCONFIRMEDmedia-fonts/jsmath-extra-dark-1.0 is missing jsMath-cmmib102012-02-29 21:13:02
401943Applicationssci-biologyUNCONFIRMEDsci-biology/transfac-3.2 - tfextract segmentation fault in 0x00007f5df6cc4487 in ajStrDel (Pstr=0x72012-02-04 17:26:44
454512ApplicationssciUNCONFIRMED[science overlay] sci-mathematics/scilab-5.4.0[gui] depends on dev-java/jogl:2 which is not found2013-02-03 15:20:24
451624ApplicationssciUNCONFIRMED[science overlay] sci-mathematics/scilab-5.4.0 should depend on >=dev-java/flexdock-1.2 sci-libs/arp2013-01-19 17:38:22
449320LibrarysciUNCONFIRMEDsci-libs/cholmod-2.0.1 - configure: .../temp/ccKrajc0.o: In function `main': conftest.c:(.text+0x7):2013-01-05 00:28:07
449472DevelopmentsciUNCONFIRMED[science overlay] dev-lang/julia-9999 - ld: cannot find -lunwind-generic2013-01-06 15:57:08
396437JavasciUNCONFIRMED[science overlay] dev-java/hdf-java-2.7 fetch of hdf-java-2.7-src.tar fails2012-04-11 01:14:55
396657ApplicationssciUNCONFIRMED[science-overlay] dev-perl/Bio-BigFile-1.06 fails to emerge due to missing jkweb.a2012-02-11 16:02:44
392243JavasciUNCONFIRMED[science overlay] dev-java/jlatexmath-0.9.4 fails to emerge because of ACCESS VIOLATION at /root/.ja2011-12-04 02:58:03
458022Core systemryaoUNCONFIRMEDsys-block/iscsitarget-1.4.20.2 - 1 out of 1 hunk FAILED -- saving rejects to file kernel/conn.c.rej2013-02-17 19:02:08
438708ApplicationsroxUNCONFIRMED2012-10-17 14:29:58
377339EbuildsroxUNCONFIRMEDNew Version rox-base/zeroinstall-injector-1.22011-08-02 10:52:56
395839Applicationsrobbat2UNCONFIRMEDnet-misc/adjtimex-1.29 is not compatible with baselayout-22011-12-26 10:07:56
392953Ebuildsrobbat2UNCONFIRMEDdev-java/lucene-3.6.1 Version Bump2012-11-19 09:35:47
450330StagesreleaseUNCONFIRMEDno service can provide "net" on arm stage3-armv6j_hardfp (last known good build Nov 15 2012)2013-01-05 05:01:43
373473UnspecifiedrafaelmartinsUNCONFIRMEDg-octave/optiminterp-0.3.2 fails to emerge if MAKEOPTS is not "-j1"2011-07-08 21:19:20
366395Keywording and StabilizationrafaelmartinsUNCONFIRMED>=dev-lang/luajit-2.0.0_beta7 needs arm and ppc testing2012-05-31 17:47:27
448178LibraryqtUNCONFIRMED[qt overlay] x11-libs/qt-webkit-5.0.0: Project ERROR: Unknown module(s) in QT: opengl2013-01-09 08:46:26
449092LibraryqtUNCONFIRMED[qt overlay] x11-libs/qt-webkit-5.0.0 fails to build: undefined reference to `JSC::JSCell::classInfo2013-02-16 10:09:49
405899Applicationsqmail-bugsUNCONFIRMEDnet-mail/queue-repair - /usr/bin/queue-repair.py: AttributeError: 'dict_keys' object has no attribut2012-02-27 01:35:46
431388ApplicationspythonUNCONFIRMEDdev-python/ipython-0.13 -AttributeError: 'StoreMagics' object has no attribute 'db'2012-08-14 15:08:54
433175ApplicationspythonUNCONFIRMEDdev-lang/python-2.7.3-r2: Exception AttributeError: AttributeError("'_DummyThread' object has no att2012-09-03 18:23:18
402027EbuildspythonUNCONFIRMEDdev-python/django-1.3.1 with dev-python/psycopg-2.4.2 fails app/project tests2012-04-28 20:35:29
377925DevelopmentpythonUNCONFIRMEDdev-python/docutils-0.[78]: TypeError: can't use a bytes pattern on a string-like object2011-10-07 21:22:24
399417ServerpythonUNCONFIRMED2013-02-07 19:28:02
372525ApplicationsproaudioUNCONFIRMEDmedia-sound/jack-audio-connection-kit-0.120.2 crashes with buffer overflow detected in jack_alsa.so2011-10-10 00:02:33
456314PrintingprintingUNCONFIRMEDnet-print/foo2zjs uses hotplug scripts to upload firmware to printers2013-02-12 14:34:00
440886PrintingprintingUNCONFIRMEDnet-print/cups-bjnp-1.1 - In file included from bjnp-io.c:22:0: bjnp-protocol.h:100:5: error: redefi2013-02-11 11:01:36
435188PrintingprintingUNCONFIRMEDnet-print/foo2zjs: Wrong path to the CUPS usb backend2012-09-16 15:56:26
435442ApplicationsprintingUNCONFIRMEDapp-text/pdftk-1.44 - /usr/libexec/gcc/x86_64-pc-linux-gnu/4.7.1/ecj1: symbol lookup error: /usr/lib2012-09-18 19:33:09
430498PrintingprintingUNCONFIRMEDnet-print/cups-bjnp-1.0 and net-print/cups-1.6.1: Failed to read side-channel request!2012-08-09 23:40:25
419787PrintingprintingUNCONFIRMEDnet-print/foo2zjs-99999999 with app-text/ghostscript-gpl-9.05-r1 fails tests2012-10-09 09:27:44
420623PrintingprintingUNCONFIRMEDnet-print/foo2zjs-99999999 fails emerge with permission denied, access attempt outside the sandbox2013-01-27 23:07:16
375397PrintingprintingUNCONFIRMEDnet-print/foo2zjs-99999999: firmware not loaded into printers2012-02-19 22:07:51
389665PrintingprintingUNCONFIRMEDnet-print/foo2zjs-99999999 fails to build osx-hplj-hotplug2012-06-13 20:01:41
458042Prefix SupportprefixUNCONFIRMEDfix_libtool_files.sh --justfixit doesn't look for fixlafiles.awk in EPREFIX2013-02-18 00:28:40
435528Prefix SupportprefixUNCONFIRMEDant-apache-bsf USE=javascript ~x64-macos prefix support2013-01-01 10:21:40
437362Prefix SupportprefixUNCONFIRMEDdev-libs/jemalloc-3.0.0 fails to build because of double prefix2012-10-06 16:47:56
416501Prefix SupportprefixUNCONFIRMEDdev-java/jffi-1.0.0 and jffi-1.0.11 failed to build: No rule to make target2012-05-18 14:04:04
448294Applicationspolynomial-cUNCONFIRMEDapp-emulation/virtualbox-4.2.6: cannot open shared object libstdc++.so.62012-12-24 10:19:17
428124Applicationspolynomial-cUNCONFIRMEDapp-emulation/virtualbox-4.1.12: "Failed to create the VirtualBox COM object"2012-09-21 15:25:00
383669Applicationspolynomial-cUNCONFIRMEDapp-emulation/virtualbox-4.1.2: fails to compile due to Java name clash2011-12-21 14:52:14
453412Developmentphp-bugsUNCONFIRMEDdev-php/PHPUnit_MockObject-1.2.3 - Version Bump2013-02-19 17:42:20
434968Applicationsphp-bugsUNCONFIRMEDdev-php/pecl-memcached add USE=json2013-01-08 18:40:16
432804Project-specific documentationphp-bugsUNCONFIRMEDhttp://www.gentoo.org/proj/en/php/php-upgrading.xml multiple small issues2012-08-27 10:29:56
458380LibraryphosphanUNCONFIRMEDmedia-libs/jasper: ebuild patch for multilib support2013-02-20 21:19:41
452608ApplicationspdaUNCONFIRMEDapp-pda/gtkpod-2.1.3-r1 with dev-util/anjuta-3.4.3 - In function ‘on_layout_lock_toggle’: anjuta-act2013-02-01 22:49:13
391041ServerpatrickUNCONFIRMEDwww-servers/apache 2.2 - suexec and django non-ASCII file upload incompatibility as apache cut out L2013-02-16 14:04:07
415577ApplicationsopenofficeUNCONFIRMEDapp-office/libreoffice-3.5.3.2 QA Notice: make jobserver unavailable2012-05-16 02:57:58
430224ApplicationsopenofficeUNCONFIRMEDapp-office/libreoffice-bin-3.5.4.2 - printing to CUPS fails before the job has been submitted2012-08-08 18:24:36
435448EbuildsopenofficeUNCONFIRMEDapp-office/libreoffice 3.6.1.2 - .../work/libreoffice-core-3.6.1.2/workdir/unxlngx6.pro/CxxObject/co2012-09-20 18:39:47
451700ApplicationsopenofficeUNCONFIRMEDapp-office/libreoffice-4.0.0.1 - .../work/libreoffice-4.0.0.1/workdir/unxlngx6.pro/CxxObject/writerf2013-01-15 17:25:30
436558Ebuildsoli.huberUNCONFIRMEDwww-apps/joomla-3.0.0 version bump2012-11-26 22:52:16
448818DevelopmentnirbheekUNCONFIRMEDdev-python/pypy USE=jit does no pax-marking2012-12-27 14:29:36
401559Ebuildsoli.huberUNCONFIRMEDwww-apps/joomla-2.5.0 version bump2012-04-23 21:29:49
365501Applicationsnet-p2pUNCONFIRMEDnet-p2p/frostwire-4.20.9 should RDEPEND on dev-java/junit2011-07-31 12:15:23
430042Ebuildsnet-imUNCONFIRMEDx11-plugins/purple-plugin_pack-2.7.0 should depend on dev-libs/json-glib2012-08-07 03:36:54
443890Applicationsnet-imUNCONFIRMEDnet-im/ejabberd - typo in /etc/init.d/ejabberd : EJABBERDCTL_OPT instead of EJABBERDCTL_OPTS2012-11-20 19:41:35
381279Servernet-imUNCONFIRMEDnet-im/jabberd2-2.2.4: error: XML parse error (not well-formed (invalid token)) in c2s log for some 2012-10-20 06:45:03
409425Applicationsnet-imUNCONFIRMED>=net-im/ejabberd-2.1.0: add USE=mod_admin_extra2012-03-23 15:19:46
410017Ebuildsnet-imUNCONFIRMEDnet-im/ejabberd - add patch for remote roster2013-01-24 10:41:29
456904ApplicationsmozillaUNCONFIRMED[mozilla overlay] dev-lang/spidermonkey-1.8.8 - ./dist/include/js/HashTable.h:898:9: error: size of 2013-02-12 16:50:39
445988LibrarymozillaUNCONFIRMEDdev-libs/jemalloc-3.2.0 does hardcoded AR calls2012-12-19 17:53:39
446866UnspecifiedmozillaUNCONFIRMEDdev-libs/nspr-4.9.2 - checking whether the C compiler (gcc -Os -pipe -march=armv6j -mfpu=vfp -mfloat2013-01-05 13:03:54
439244UnspecifiedmozillaUNCONFIRMEDwww-client/firefox-16.0.1 - .../work/mozilla-release/memory/jemalloc/src/src/jemalloc.c:1736:1: erro2013-01-14 08:53:52
442818DevelopmentmlUNCONFIRMEDdev-lang/smlnj-110.75 - bin/sml: Fatal error -- bogus fault not in ML: sig = 11, code = 0x5356c35d, 2012-11-12 22:21:25
428582ApplicationsmichaelUNCONFIRMEDnet-dns/djbdns-1.05-r26: djbdns-setup should source /etc/init.d/functions.sh2013-01-06 09:35:05
455058Applicationsmedia-videoUNCONFIRMEDmedia-video/gxine with dev-lang/spidermonkey-1.8.8 - build fails to find mozjs2013-02-05 11:27:23
451888Applicationsmedia-videoUNCONFIRMEDmedia-libs/mlt-0.8.2 - consumer_jack.o: In function `consumer_thread': consumer_jack.c:(.text+0x139e2013-01-15 12:21:47
411443Applicationsmedia-videoUNCONFIRMEDmedia-libs/libcaca-0.99_beta18 - java-pkg_newjar java/libjava.jar fails2012-12-30 03:36:17
458282Servermarko.durkovicUNCONFIRMEDnet-im/jabberd2-2.2.14 - dodoc: tools/migrate.pl does not exist2013-02-20 16:17:20
458152Ebuildsmaintainer-wantedUNCONFIRMEDdev-db/odb-2.2.0 - C++ Object-Relational Mapping (ORM) implemented as a gcc plugin2013-02-19 22:42:42
454626Ebuildsmaintainer-wantedUNCONFIRMEDebuild for epson-inkjet-printer binary driver (epson-inkjet-printer-workforce-635-nx625-series)2013-01-30 14:57:44
454724Ebuildsmaintainer-wantedUNCONFIRMEDnet-analyzer/tallow - Block hosts that attempt to bruteforce SSH using the journald API2013-01-30 19:39:56
453658Ebuildsmaintainer-wantedUNCONFIRMEDdev-util/jenkins - application that monitors executions of repeated jobs, such as building a softwar2013-01-30 11:30:11
452800Ebuildsmaintainer-wantedUNCONFIRMEDapp-office/gnuaccounting - a Free Java cross-platform accounting and bookkeeping application2013-01-19 16:41:10
443714Ebuildsmaintainer-wantedUNCONFIRMEDdev-java/jllvm-3.1.2 - bindings for LLVM, providing an object-oriented interface as similar as possi2012-11-19 09:24:34
436372Ebuildsmaintainer-wantedUNCONFIRMEDdev-ruby/jruby-pageant - Gem for communicating with Pageant agent from JRuby2012-09-27 07:21:29
436958Ebuildsmaintainer-wantedUNCONFIRMEDapp-office/projectlibre - the open source replacement of Microsoft Project2013-01-18 18:28:23
433864Ebuildsmaintainer-wantedUNCONFIRMEDapp-misc/format-junkie - a program that can convert your media files (audio files, videos and pictur2012-09-10 17:00:15
431802Ebuildsmaintainer-wantedUNCONFIRMEDwww-apps/gitlab Project management and code hosting application written in ruby2013-01-23 04:07:24
431706Applicationsmaintainer-wantedUNCONFIRMEDdev-lang/jwasm - masm compatible crossplatform assembler2012-10-20 19:27:43
427744Ebuildsmaintainer-wantedUNCONFIRMEDdev-python/django-dajaxice-0.2 - Easy to use AJAX library for django2012-12-12 12:09:22
427746Ebuildsmaintainer-wantedUNCONFIRMEDdev-python/django-dajax-0.8.4 - Easy to use library to create asynchronous presentation logic with d2012-12-12 12:17:56
427754Ebuildsmaintainer-wantedUNCONFIRMEDdev-python/django-tinymce-1.5.1_beta2 - TinyMCE integration for Django2012-12-12 12:32:51
427762Ebuildsmaintainer-wantedUNCONFIRMEDNew: dev-python/django-grappelli-2.4.0 - A grid-based alternative/extension to the Django administra2012-07-24 14:52:05
427764Ebuildsmaintainer-wantedUNCONFIRMEDNew: dev-python/django-filebrowser-3.5.0 - File management in the Django admin interface2012-12-13 06:57:02
427770Ebuildsmaintainer-wantedUNCONFIRMEDNew: dev-python/django-publisher-0.0.3 - Django external publishing app2012-12-13 07:01:05
428246Ebuildsmaintainer-wantedUNCONFIRMEDapp-backup/jungledisk-server - offsite managed backup for servers2012-07-28 23:06:49
427734Ebuildsmaintainer-wantedUNCONFIRMEDNew: dev-python/django-sekizai-0.4.2 - Django Template Blocks with extra functionality2012-12-12 11:51:41
427738Ebuildsmaintainer-wantedUNCONFIRMEDNew: dev-python/django-cms-2.3 - A Django application for managing hierarchical pages of content2012-12-12 12:04:20
427730Ebuildsmaintainer-wantedUNCONFIRMEDNew: dev-python/django-mptt-0.4.2 - Utilities for implementing a modified pre-order traversal tree i2012-12-12 11:46:23
427728Ebuildsmaintainer-wantedUNCONFIRMEDNew: dev-python/django-classy-tags-0.3.4.1 - Class based template tags for Django2012-12-12 11:41:28
427296Ebuildsmaintainer-wantedUNCONFIRMEDdev-python/django-tables2-0.11.0 - Table/data-grid framework for Django2012-12-12 11:30:43
427162Ebuildsmaintainer-wantedUNCONFIRMEDdev-python/django-admin-tools-0.4.1 - a collection of tools for the django administration interface2012-12-12 12:25:24
425302Gamesmaintainer-wantedUNCONFIRMEDgames-strategy/p6014 - Project 6014 Mod sequel to Star Control II: The Ur-Quan Masters2012-07-09 11:21:25
421163Ebuildsmaintainer-wantedUNCONFIRMEDnew ebuild dev-java/javasqlite-201202092012-06-16 11:48:09
420013Ebuildsmaintainer-wantedUNCONFIRMEDnet-dns/ndjbdns - djbdns without daemontools2012-09-17 08:34:43
419533Ebuildsmaintainer-wantedUNCONFIRMEDdev-java/sbt-bin (new package) a build tool for Scala2012-06-03 22:14:43
418211Ebuildsmaintainer-wantedUNCONFIRMEDsys-process/xjobs - reads job descriptions line by line and executes them in parallel2012-06-01 14:23:50
415443Ebuildsmaintainer-wantedUNCONFIRMEDnet-fs/junglediskworkgroup-3.16 - Networked storage/backup using Amazon's S3 service2012-07-28 23:06:49
413535Ebuildsmaintainer-wantedUNCONFIRMEDdev-lang/julia - a high-level, high-performance dynamic programming language for technical computing2012-12-19 07:31:31
413389Ebuildsmaintainer-wantedUNCONFIRMEDmedia-fonts/prosto-1 - New font for project of free fonts www.jovanny.ru / / Font has multilanguage 2012-04-24 19:51:59
411895Ebuildsmaintainer-wantedUNCONFIRMEDapp-text/peg-markdown -- an implementation of John Gruber's markdown in C2012-06-30 09:24:16
409077Ebuildsmaintainer-wantedUNCONFIRMEDwww-apps/gerrit - web based code review and project management for Git based projects2012-03-21 15:35:16
402767Ebuildsmaintainer-wantedUNCONFIRMEDagner - a rebar-friendly Erlang package index and package manager inspired by Clojars and Homebrew2012-03-09 08:30:12
401921Ebuildsmaintainer-wantedUNCONFIRMEDsci-libs/o2scl - An object-oriented library for scientific computing in C++2012-02-04 17:07:01
396167Ebuildsmaintainer-wantedUNCONFIRMEDsys-power/jupiter-applet - a light weight power and hardware control applet for Linux2012-11-23 03:56:02
396247Ebuildsmaintainer-wantedUNCONFIRMEDx11-misc/xcompmgr-dana - Dana Jansens's fork of the X Composisting Manager2011-12-28 18:12:36
391767Ebuildsmaintainer-wantedUNCONFIRMED[EBuild Request] QDjango2011-12-10 07:31:25
389151Ebuildsmaintainer-wantedUNCONFIRMEDnet-misc/justwifiindicator-0.1 - Simple WiFi signal strength tray indicator2011-11-20 12:10:03
387595Ebuildsmaintainer-wantedUNCONFIRMEDNew Ebuild: app-admin/ajenti2011-10-21 07:15:46
382379Ebuildsmaintainer-wantedUNCONFIRMEDebuilds for several Epson inkjet printers2013-01-30 14:57:44
374789Ebuildsmaintainer-wantedUNCONFIRMEDebuild request: chiliproject - a community fork of redmine2013-02-13 20:47:13
370483Ebuildsmaintainer-wantedUNCONFIRMEDebuild request brother mfc-j265w lpr & cupswrapper ebuilds2012-04-08 14:01:44
370151Javamaintainer-wantedUNCONFIRMEDNew package: dev-java/stax2-api2011-06-07 21:13:04
369989Ebuildsmaintainer-wantedUNCONFIRMEDdev-libs/jcal-0.3.0 - Jalali calendar library2012-06-10 13:58:30
369977Javamaintainer-wantedUNCONFIRMEDNew package: dev-java/htmlcleaner2011-06-07 21:13:31
368849Ebuildsmaintainer-wantedUNCONFIRMEDJBroFuzz ebuild request2011-05-27 08:48:52
367429Ebuildsmaintainer-wantedUNCONFIRMEDmedia-sound/jackctlmmc-4 - JackCtlMMC is a slightly simpler command-line version of QJackMMC2011-05-17 11:44:37
367427Ebuildsmaintainer-wantedUNCONFIRMEDmedia-sound/qjackmmc-4 - a Qt based program that can connect to a device or program that emits MIDI 2011-05-18 11:04:44
434926Applicationsmaintainer-neededUNCONFIRMED>=net-im/skype-4.0.0.7 - login failure, stuck at "signing in" with JFS filesystem2013-01-03 19:31:41
454362Core systemkernel-miscUNCONFIRMEDsys-fs/jfsutils-1.1.15 - Fails to build with +static if sys-apps/util-linux is built without +static2013-01-28 02:04:19
453780Applicationskondor6cUNCONFIRMEDwww-client/elinks-0.12_pre5-r2 USE=javascript with spidermonkey-1.8.5-r1 - elinks freezes on startup2013-02-01 11:12:46
417701Ebuildsl33tmmxUNCONFIRMEDmedia-sound/a2jmidid-7 version bump2012-12-18 11:47:01
457732KDEkdeUNCONFIRMEDkde-base/kwin - Hyperthreading enabled + Java = Kwin unresponsive2013-02-17 17:49:19
456360KDEkdeUNCONFIRMEDkde-base/print-manager looking for org.fedoraproject.Config.Printing2013-02-14 21:31:30
386227ApplicationsjlecUNCONFIRMEDsci-libs/cgcode-1.0.ebuild doesn't install (shared object symlink issue)2011-11-21 16:34:36
457636JavajavaUNCONFIRMEDdev-java/icedtea won't build with giflib-52013-02-15 00:51:36
457960Keywording and StabilizationjavaUNCONFIRMEDdev-java/jdbc-postgresql-9.1_p902 stable request2013-02-17 17:38:38
458264JavajavaUNCONFIRMEDdev-java/sablecc-3.7 version bump2013-02-19 15:22:14
454608JavajavaUNCONFIRMEDdev-java/rxtx patches to build on ppc642013-01-30 05:47:24
456932JavajavaUNCONFIRMEDERROR: dev-java/netbeans-javafx-7.2 failed (compile phase)2013-02-13 20:19:37
453212JavajavaUNCONFIRMEDwww-servers/tomcat-7.0.X - classloading issues due to too much jars in initial classpath2013-01-21 11:59:16
453804JavajavaUNCONFIRMEDCreate ebuilds for jdk 8 (early access release), a current Java 8 partial implementation2013-01-24 12:02:05
442804JavajavaUNCONFIRMEDdev-java/jgoodies-forms-{1.5.1,1.6.0} version bump2013-01-20 18:41:59
449442JavajavaUNCONFIRMED[java-overlay] dev-java/gnu-classpath-0.99: ERROR: Package ecj-gcj-* was not found!2012-12-31 12:37:35
442334JavajavaUNCONFIRMEDdev-java/jlex should install jlex launcher2012-11-08 15:36:52
440636JavajavaUNCONFIRMEDdev-java/icedtea-web-1.3-r7: IcedTea-Web-Plugin displays garbage after version number in www-client/2012-10-31 17:38:32
440994JavajavaUNCONFIRMEDdev-java/xmlgraphics-commons-1.5 version bump2012-11-03 20:31:14
441618JavajavaUNCONFIRMEDdev-java/icedtea-bin-7.2.3.3: should not install libsplashscreen.so with USE=-X2013-01-17 14:25:52
439140JavajavaUNCONFIRMEDdev-java/icedtea: Use meaningful names for distfiles2013-02-20 07:39:04
439104JavajavaUNCONFIRMEDdev-java/avalon-logkit-2.1-r6: java7 patch requires jdk >= 1.62012-10-20 20:48:29
438834JavajavaUNCONFIRMEDdev-java/icedtea-6.1.11.4 fails to build with java.lang.OutOfMemoryError2012-10-18 18:57:31
437392JavajavaUNCONFIRMEDdev-java/owasp-antisamy-1.4.4 ebuild request2012-10-06 10:16:34
434222JavajavaUNCONFIRMEDdev-java/ant-ivy-2.0.0 compilation failed2012-09-07 15:04:44
435256JavajavaUNCONFIRMEDdev-java/xml-security-1.5.2 (aka apache santuario) version bump2012-09-16 20:18:33
435764JavajavaUNCONFIRMEDdev-java/wss4j-1.6.7 version bump request2012-09-21 18:44:27
435808JavajavaUNCONFIRMEDdev-java/opensaml-2.5.3 version bump request2012-09-22 06:45:45
436012JavajavaUNCONFIRMEDdev-java/ant-core-1.8.4-r1 can't override system properties for ant2012-09-23 18:13:25
436644JavajavaUNCONFIRMEDdev-java/owasp-esapi-2.0.1 ebuild request2012-10-06 10:59:19
434024JavajavaUNCONFIRMEDwww-client/firefox-15.0, "click to play": Java applets don't work2012-09-20 09:38:49
432350JavajavaUNCONFIRMEDdev-java/emma won't build on non-Sun JDKs2012-08-22 20:42:46
430432JavajavaUNCONFIRMED[java-overlay overlay] dev-util/eclipse-sdk-bin-4.2.0 - segmentation fault in: C [libgobject-2.0.so2012-08-26 15:50:14
430186JavajavaUNCONFIRMEDdev-java/hawtjni-runtime: New package2012-08-06 14:27:16
430054JavajavaUNCONFIRMEDdev-java/pdfbox-1.7 version bump2013-01-17 07:48:53
429294JavajavaUNCONFIRMED=dev-java/gnu-classpath-0.98-r3 uses gcc [gcj] to build but not chcecks gcc for USE=gcj2012-09-26 09:46:31
430184JavajavaUNCONFIRMEDdev-java/jansi and dev-java/jansi-native: Version bump (+ new dependency)2012-08-06 14:27:16
430062JavajavaUNCONFIRMEDdev-java/glazedlists-1.8 version bump2012-08-05 19:29:55
428340JavajavaUNCONFIRMEDVersion Bump: dev-java/jsr250-1.12012-07-27 16:31:44
428618Keywording and StabilizationjavaUNCONFIRMEDPlease mark =dev-java/rxtx-2.2_pre2 stable2012-07-30 23:35:26
427932JavajavaUNCONFIRMED[java-overlay] dev-java/j3d-core-1.5.1: compile phase fails with image resolution errors2012-07-24 19:35:50
427636JavajavaUNCONFIRMEDdev-java/bcpg-1.45 ebuild request2012-07-22 13:15:13
426756JavajavaUNCONFIRMEDsci-physics/jaxodraw-2.0.1 - doicon etc/OS/Linux/*.png: etc/OS/Linux/*.png is not a valid file/direc2012-12-16 14:31:24
426380JavajavaUNCONFIRMEDdev-java/cglib-{2.2.2,3.0} version bump request2012-08-18 14:17:39
426382JavajavaUNCONFIRMEDdev-java/nekohtml-1.9.16 version bump2012-08-07 21:02:08
426294JavajavaUNCONFIRMEDnet-nds/jxplorer-3.3 - version bump request2013-01-28 15:25:13
425158EbuildsjavaUNCONFIRMEDdev-java/swt-3.7.2: Cannot load 64-bit SWT libraries on 32-bit JVM2012-07-11 18:31:30
421077JavajavaUNCONFIRMEDdev-java/icedtea-7.2.2 compilation fails with Unrecognised option: -XX:-PrintVMOptions2012-10-18 16:15:26
421223JavajavaUNCONFIRMEDdev-java/gnu-classpath should make installing /usr/gnu-classpath-*/bin scripts optional2012-06-15 11:06:00
421677JavajavaUNCONFIRMEDdev-java/ant-commons-net-1.8.4 - *** Semantic Error: The abstract method "int compareTo(java.lang.Ob2012-06-19 02:39:45
421503JavajavaUNCONFIRMEDdev-java/groovy-{1.8.8,2.0.6,2.1.0} version bump request2013-01-29 00:25:12
420451JavajavaUNCONFIRMEDdev-java/jnr-netdb:0: Use dev-java/jnr-ffi:0.5 instead of dev-java/jaffl2012-06-10 00:57:49
413123JavajavaUNCONFIRMEDdev-java/lucene-2.9.4 and dev-java/lucene-analyzers-2.3.2 builds broken2012-04-22 21:15:07
416439JavajavaUNCONFIRMEDdev-java/rxtx cannot connect to serial port2012-07-30 18:07:11
417895JavajavaUNCONFIRMEDdev-java/stringtemplate-4.0.6 released2012-12-07 19:10:27
417897JavajavaUNCONFIRMEDdev-java/guava-12.0 released2012-05-28 20:37:26
405865JavajavaUNCONFIRMEDjavatoolkit improvement for xpath-like xml handling2012-02-26 15:48:58
402757JavajavaUNCONFIRMEDebuild for dev-java/poi-3.72012-06-05 17:59:23
405715JavajavaUNCONFIRMEDjava eclass improved documentation2012-02-25 09:32:02
396225JavajavaUNCONFIRMEDUpdate dev-java/lucene-analyzers for slots 2.4, 2.9, 3.0, 3.1, 3.2, 3.3, 3.4, 3.5, 3.6 of dev-java/l2012-06-04 21:47:55
399471JavajavaUNCONFIRMEDdev-java/ibm-jre-bin-1.6.0.9_p2-r1: error while loading shared libraries: libstdc++.so.5: cannot op2012-01-27 02:05:35
398689EbuildsjavaUNCONFIRMEDRemove dev-java/servletapi replace with java-virtuals/servlet-api2012-09-29 09:01:54
391171JavajavaUNCONFIRMEDNew package: dev-java/gson2012-08-06 14:29:01
391067JavajavaUNCONFIRMEDicedtea-7.2.0-r1 with javascript requires virtual/jdk:1.62012-09-16 15:08:31
391165JavajavaUNCONFIRMEDNew package: dev-java/sqlite-jdbc2011-11-20 22:16:24
390045Keywording and StabilizationjavaUNCONFIRMEDdev-java/antlr : ~arm keyword request2011-11-10 10:47:31
389763JavajavaUNCONFIRMEDdev-java/ecj-gcj-3.5.2-r2 - /usr/libexec/gcc/i686-pc-linux-gnu/4.5.3/ecj1: symbol lookup error: /usr2011-11-08 15:48:12
383013JavajavaUNCONFIRMEDOnline bank security apple refuses to work unless I create a '/etc/.java' folder2011-09-15 18:53:28
389709JavajavaUNCONFIRMEDdev-java/icedtea-7.2.0-r1: failed to emerge due to SIGSEGV in the build process2012-11-02 14:42:48
380441JavajavaUNCONFIRMEDjconsole (JRE 6.0_22-b22) crashes (SIGSEGV) in IcedTea6 1.10.32011-10-19 14:43:03
380493JavajavaUNCONFIRMEDdev-java/saxon-9.1.0.8 version bump2012-02-16 10:02:58
382807ApplicationsjavaUNCONFIRMED[java-overlay] app-text/languagetool-0.9.8 needs >=virtual/ooo-3.02011-12-09 23:13:42
378935JavajavaUNCONFIRMED[java-overlay] msv-20090415 fails QA2011-08-12 16:13:22
376823JavajavaUNCONFIRMEDdev-java/icedtea-6.1.10.3: I have problems when open Jdownloader program. A fatal error has been det2011-12-08 10:40:09
373561UnspecifiedjavaUNCONFIRMED[java-overlay] dev-java/testng-5.2 fails to download testng-5.2.zip2012-07-10 09:51:53
375319JavajavaUNCONFIRMEDProvide JavaScript for the dev-java/icedtea6-bin build2011-10-19 14:43:03
372097JavajavaUNCONFIRMEDdev-java/jpfcodegen-0.4 needs jdom-jaxen to build2011-06-17 20:35:53
368377JavajavaUNCONFIRMEDjava-config should support JNI related native config options and ld.so.conf pathes2012-04-04 14:19:10
368229DevelopmentjavaUNCONFIRMEDdev-util/eclipse-sdk - eclipse crashes on libmozjs.so2013-02-04 12:39:45
368205JavajavaUNCONFIRMEDjava-vm-2.eclass:pkg_prerm could mention eselect java-vm instead.2012-12-30 15:53:24
368049JavajavaUNCONFIRMEDdev-java/jjtraveler-0.4.3-r2 does not emerge, fails unpack2012-06-26 02:05:17
365463JavajavaUNCONFIRMEDJRuby's Ant fails to call javac2012-06-03 10:28:27
367037JavajavaUNCONFIRMEDdev-java/piccolo2d-1.2.1-r2 did not build unable to find paths2011-05-13 05:12:20
401397ServerhollowUNCONFIRMEDwww-servers/nginx: add automatic minification module (jitify)2012-11-26 08:02:58
456922UnspecifiedhardenedUNCONFIRMEDUnable to start any java-vm on hardened gentoo icedtea-bin-6.1.11.5: Could not reserve enough space 2013-02-13 15:13:44
400951HardenedhardenedUNCONFIRMEDJava does not run properly on non-root with Grsecurity Hardened Gentoo [workstation] level2012-01-26 19:28:36
386647HardenedhardenedUNCONFIRMEDdev-java/jamvm-1.5.4-r1 segfaults with hardened gcc-4.5.3-r1 (any profile), unless -Xnoinlining is s2012-07-11 11:36:26
428724Core systemhannoUNCONFIRMEDsys-auth/pam_mount-2.13: man: invalid option -- 'l', ERROR: ld.so: object 'libsandbox.so' from LD_PR2012-07-31 00:10:12
372893EbuildshannoUNCONFIRMED[hanno-overlay] net-im/gajim-9999 don't install all necessary packages2012-02-21 16:39:03
377817EbuildshannoUNCONFIRMED[hanno overlay] net-im/gajim-9999 Please split crypt USE to otr, gpg and new for E2E2011-08-05 08:55:52
449086ApplicationsgraphicsUNCONFIRMEDmedia-libs/lensfun-0.2.5-r2 fails using multiple jobs2013-01-10 07:44:47
414529LibrarygraphicsUNCONFIRMEDmedia-libs/openjpeg-1.5.0 does not build on Gentoo/FreeBSD2012-05-04 04:38:10
398093DevelopmentgraphicsUNCONFIRMEDsys-devel/gcc-4.6.2 with -march=bdver1 creates broken media-libs/jpeg2012-04-27 15:47:47
374137EbuildsgraphicsUNCONFIRMEDmedia-libs/openjpeg-9999.ebuild request2012-01-08 00:10:08
450808Javagnu_andrewUNCONFIRMEDdev-java/icedtea-6.1.11.5 SIGSEGV on nouveau_dri.so+0x26ea5b2013-01-08 14:10:07
393335Javagnu_andrewUNCONFIRMEDdev-java/icedtea-7.2.0-r3 - segmentation fault in /var/tmp/portage/dev-java/icedtea-7.2.0-r3/work/ic2011-12-25 05:58:41
364495Keywording and Stabilizationgnu_andrewUNCONFIRMEDPlease stabilize dev-java/icedtea-6.1.10.4 and dev-java/icedtea-web-1.1.12012-11-27 04:46:18
450262LibrarygnustepUNCONFIRMEDgnustep-base-1.24.0-r1 - Assembler messages: {standard input}:1430: Error: symbol `_OBJC_CLASS_GCObj2013-01-05 17:44:50
448896EbuildsgnomeUNCONFIRMEDdev-python/pygobject-3.4.2-r1 (and others): py-compile coming from 2012-12-28 19:03:04
437894GamesgamesUNCONFIRMEDgames-emulation/virtualjaguar-1.0.7 -> 2.0.2 ebuild submission2013-02-10 05:05:50
421309GamesgamesUNCONFIRMEDgames-emulation/jpcsp-bin - new ebuild2012-06-16 23:31:27
420625GamesgamesUNCONFIRMEDgames-arcade/jaspers-journeys - new ebuild2012-06-11 03:58:51
404589GamesgamesUNCONFIRMEDgames-arcade/jamestown: new ebuild2012-05-01 02:25:47
400779GamesgamesUNCONFIRMEDgames-puzzle/lemmini - a Java port of Lemmings2012-01-25 20:53:58
456646LibraryfontsUNCONFIRMEDmedia-libs/fontconfig-2.10.2: /var/lib/texmf/web2c/pdftex/pdfjadetex.fmt doesn't match pdftex.pool (2013-02-20 11:21:15
453540ApplicationsevermindUNCONFIRMED[pro-audio overlay] media-sound/jack-audio-connection-kit-1.9.9.5: TypeError: 'list' object is not c2013-02-09 17:14:49
426444ApplicationsemacsUNCONFIRMEDapp-editors/emacs-23.4-r3 fails to build in parallel (--jobs=64)2012-07-18 15:26:44
432588EbuildselvanorUNCONFIRMEDnet-voip/sflphone-1.0.1-r1 with net-libs/pjsip-1.8.10 (too old): sipaccount.cpp:612:17: error: ‘pjsi2012-08-24 13:48:14
431916ApplicationsdotnetUNCONFIRMEDdev-dotnet/libgdiplus-2.10.9 - Variable 'libjpeg_prefix' not defined in '/usr/lib64/pkgconfig/libgdi2012-11-09 14:13:30
404263EbuildsdotnetUNCONFIRMEDdev-lang/mono-2.10.5: remove MAKEOPTS=-j1 limitation2012-02-19 11:00:47
453362[RU]docs-teamUNCONFIRMEDTranslations in Jan 20132013-01-21 15:58:54
442616DevelopmentdjcUNCONFIRMEDdev-db/couchdb - /usr/lib/couchdb/bin/couchjs needs pax-mark mr on PaX-enabled systems.2013-01-12 18:34:44
458464Core - Interface (emerge)dev-portageUNCONFIRMEDsys-apps/portage-2.1.11.50: no way to JUST DAMN INSTALL a package2013-02-21 04:04:32
452172Unclassifieddev-portageUNCONFIRMEDemerge's --jobs does not do full parallelization due to PDEPEND circular dependencies2013-01-15 11:55:26
425554Core systemdev-portageUNCONFIRMEDsys-apps/portage-2.2.0_alpha116: Ctrl+C during --jobs simply halts progress w/o quitting2012-12-25 21:05:58
425682Enhancement/Feature Requestsdev-portageUNCONFIRMEDTrue parallel fetch for each job running2012-07-14 20:37:13
383323Javadev-portageUNCONFIRMEDsys-apps/portage: emerges pulls in older jdk slot when newer slot is masked (newer masked slot remai2012-09-06 19:32:08
409119ApplicationscppUNCONFIRMEDdev-libs/STLport-5.2.1 - Fatal error: can't create obj/gcc/so/dll_main.o: No such file or directory2012-03-21 09:41:23
456792LibrarycppUNCONFIRMEDdev-libs/boost-1.52.0-r5 fails to compile with custom /etc/site-config.jam: could not find main targ2013-02-12 22:13:10
449116EbuildsdanielpiUNCONFIRMEDapp-accessibility/julius::sunrise and sci-libs/fplll::sage-on-gentoo both install /usr/bin/generate2012-12-29 11:48:00
407173ApplicationsclusterUNCONFIRMEDsys-devel/icecream: distributed jobs fail because of missing libraries2012-06-27 00:00:39
432462ApplicationschainsawUNCONFIRMEDnet-im/jabber-base should not provide /var/run/jabber directory2012-08-24 13:26:45
429584EbuildscedkUNCONFIRMEDnet-firewall/nufw - new project name (ufwi), new HOMEPAGE2012-09-23 16:42:15
458576Applicationsbug-wranglersUNCONFIRMEDapp-emulation/xen-tools should depend on dev-libs/yajl2013-02-21 12:22:28
458572Applicationsbug-wranglersUNCONFIRMEDnet-im/gajim-0.15.2-r2: can't connect to some servers2013-02-21 11:46:54
419591FreeBSDbsdUNCONFIRMEDCreate an OpenJDK ebuild based on the FreeBSD port2012-06-04 09:05:30
458290Core systembase-systemUNCONFIRMEDsys-apps/groff-1.21, sys-apps/man-1.6g: Japanese manpages illegible2013-02-21 02:51:56
422877Core systembase-systemUNCONFIRMEDnet-firewall/iptables: ip6tables "state" test fails; will not jump to ACCEPT on ESTABLISHED,RELATED 2013-02-16 13:31:38
380341Applicationsapp-backupUNCONFIRMEDapp-backup/cdbkup-1.0-r1: make jobserver unavailable2011-08-25 14:00:21
452734OtheraltUNCONFIRMEDwww-client/firefox-18.0-r1 fails to build (prefix) - fatal error: jemalloc.h: No such file or direct2013-01-29 19:41:01
428462EbuildsaballierUNCONFIRMEDmedia-sound/a2jmidid should [R]DEPEND on dev-lang/python-2.72012-07-30 12:57:07
255644Ebuildsmaintainer-wantedUNCONFIRMEDapp-emulation/basiliskII-jit: a lot improved ebuild2012-12-14 15:37:41


back



Support us on Content Nation

New Packages

- as rdf newsfeed
- as rss newsfeed
- as Atom newsfeed
2022-09-30
angelscript - 2.36.0
Ebuild name:

dev-libs/angelscript-2.36.0

Description

A flexible, cross-platform scripting library

Added to portage

2022-09-30

awscli - 1.25.83
Ebuild name:

app-admin/awscli-1.25.83

Description

Universal Command Line Environment for AWS

Added to portage

2022-09-30

blender - 3.3.0
Ebuild name:

media-gfx/blender-3.3.0

Description

3D Creation/Animation/Publishing System

Added to portage

2022-09-30

boto3 - 1.24.82
Ebuild name:

dev-python/boto3-1.24.82

Description

The AWS SDK for Python

Added to portage

2022-09-30

botocore - 1.27.82
Ebuild name:

dev-python/botocore-1.27.82

Description

Low-level, data-driven core of boto 3

Added to portage

2022-09-30

chromium - 107.0.5304.18
Ebuild name:

www-client/chromium-107.0.5304.18

Description

Open-source version of Google Chrome web browser

Added to portage

2022-09-30

cifs-utils - 7.0
Ebuild name:

net-fs/cifs-utils-7.0

Description

Tools for Managing Linux CIFS Client Filesystems

Added to portage

2022-09-30

flycheck-inline - 0_pre20200808
Ebuild name:

app-emacs/flycheck-inline-0_pre20200808

Description

Display Flycheck errors inline

Added to portage

2022-09-30

flycheck-nimsuggest - 0.8.1_p20171027-r1
Ebuild name:

app-emacs/flycheck-nimsuggest-0.8.1_p20171027-r1

Description

Emacs Flycheck backend for Nim language using nims

Added to portage

2022-09-30

flycheck-package - 0.14
Ebuild name:

app-emacs/flycheck-package-0.14

Description

Flycheck checker for Emacs Lisp package metadata

Added to portage

2022-09-30

jpegpixi - 1.1.1-r1
Ebuild name:

media-gfx/jpegpixi-1.1.1-r1

Description

Almost lossless JPEG pixel interpolator, for correcting digital camera

Added to portage

2022-09-30

k3s - 1.25.2_p1
Ebuild name:

sys-cluster/k3s-1.25.2_p1

Description

Lightweight Kubernetes

Added to portage

2022-09-30

ldb - 2.6.1
Ebuild name:

sys-libs/ldb-2.6.1

Description

LDAP-like embedded database

Added to portage

2022-09-30

mediawiki - 1.37.6
Ebuild name:

www-apps/mediawiki-1.37.6

Description

The MediaWiki wiki web application (as used on wikipedia.org)

Added to portage

2022-09-30

mediawiki - 1.38.4
Ebuild name:

www-apps/mediawiki-1.38.4

Description

The MediaWiki wiki web application (as used on wikipedia.org)

Added to portage

2022-09-30

nodejs - 18.10.0
Ebuild name:

net-libs/nodejs-18.10.0

Description

A JavaScript runtime built on Chrome's V8 JavaScript engine

Added to portage

2022-09-30

openvdb - 9.1.0-r1
Ebuild name:

media-gfx/openvdb-9.1.0-r1

Description

Library for the efficient manipulation of volumetric data

Added to portage

2022-09-30

php - 7.4.32
Ebuild name:

dev-lang/php-7.4.32

Description

The PHP language runtime engine

Added to portage

2022-09-30

php - 8.1.11
Ebuild name:

dev-lang/php-8.1.11

Description

The PHP language runtime engine

Added to portage

2022-09-30

pngtools - 0.4_p20220314
Ebuild name:

media-gfx/pngtools-0.4_p20220314

Description

A series of tools for the PNG image format

Added to portage

2022-09-30

pytest-check - 1.0.10
Ebuild name:

dev-python/pytest-check-1.0.10

Description

pytest plugin that allows multiple failures per test

Added to portage

2022-09-30

python-nbxmpp - 3.2.3
Ebuild name:

dev-python/python-nbxmpp-3.2.3

Description

Python library to use Jabber/XMPP networks in a non-blocking way

Added to portage

2022-09-30

samba - 4.15.10
Ebuild name:

net-fs/samba-4.15.10

Description

Samba Suite Version 4

Added to portage

2022-09-30

samba - 4.15.9-r1
Ebuild name:

net-fs/samba-4.15.9-r1

Description

Samba Suite Version 4

Added to portage

2022-09-30

samba - 4.16.4-r1
Ebuild name:

net-fs/samba-4.16.4-r1

Description

Samba Suite Version 4

Added to portage

2022-09-30

samba - 4.16.5-r1
Ebuild name:

net-fs/samba-4.16.5-r1

Description

Samba Suite Version 4

Added to portage

2022-09-30

selenium - 4.5.0
Ebuild name:

dev-python/selenium-4.5.0

Description

Python language binding for Selenium Remote Control

Added to portage

2022-09-30

stimg - 0.1.0-r1
Ebuild name:

media-libs/stimg-0.1.0-r1

Description

Simple and tiny image loading library

Added to portage

2022-09-30

terminado - 0.16.0
Ebuild name:

dev-python/terminado-0.16.0

Description

Terminals served to term.js using Tornado websockets

Added to portage

2022-09-30

tevent - 0.13.0
Ebuild name:

sys-libs/tevent-0.13.0

Description

Samba tevent library

Added to portage

2022-09-30

typescript - 4.8.4
Ebuild name:

dev-lang/typescript-4.8.4

Description

Superset of JavaScript with optional static typing, classes and interface

Added to portage

2022-09-30

uxn - 0_p20220921
Ebuild name:

app-emulation/uxn-0_p20220921

Description

An assembler and emulator for the Uxn stack-machine, written in ANSI

Added to portage

2022-09-30

vault - 1.10.7
Ebuild name:

app-admin/vault-1.10.7

Description

A tool for managing secrets

Added to portage

2022-09-30

vault - 1.11.4
Ebuild name:

app-admin/vault-1.11.4

Description

A tool for managing secrets

Added to portage

2022-09-30

2022-09-29
Levenshtein - 0.20.5
Ebuild name:

dev-python/Levenshtein-0.20.5

Description

Functions for fast computation of Levenshtein distance, and edit oper

Added to portage

2022-09-29

aseqview - 0.2.8-r2
Ebuild name:

media-sound/aseqview-0.2.8-r2

Description

ALSA sequencer event viewer/filter

Added to portage

2022-09-29

bonnie - 2.0.6-r3
Ebuild name:

app-benchmarks/bonnie-2.0.6-r3

Description

Performance Test of Filesystem I/O using standard C library calls

Added to portage

2022-09-29

chrome-binary-plugins - 107.0.5304.18_alpha
Ebuild name:

www-plugins/chrome-binary-plugins-107.0.5304.18_alpha

Description

Binary plugins from Google Chrome for use in

Added to portage

2022-09-29

cosign - 1.12.1
Ebuild name:

app-containers/cosign-1.12.1

Description

container signing utility

Added to portage

2022-09-29

devhelp - 43.0
Ebuild name:

dev-util/devhelp-43.0

Description

An API documentation browser for GNOME

Added to portage

2022-09-29

dictd-vera - 1.24-r1
Ebuild name:

app-dicts/dictd-vera-1.24-r1

Description

V.E.R.A. -- Virtual Entity of Relevant Acronyms for dict

Added to portage

2022-09-29

dictd-wn - 3.0_p33-r1
Ebuild name:

app-dicts/dictd-wn-3.0_p33-r1

Description

WordNet for dict

Added to portage

2022-09-29

dikt - 2s_p1
Ebuild name:

app-dicts/dikt-2s_p1

Description

Dictionary application that implements the Dict protocol

Added to portage

2022-09-29

docker-compose - 2.11.2
Ebuild name:

app-containers/docker-compose-2.11.2

Description

Multi-container orchestration for Docker

Added to portage

2022-09-29

eblook - 1.6.1
Ebuild name:

app-dicts/eblook-1.6.1

Description

Interactive search utility for electronic dictionaries

Added to portage

2022-09-29

edictionary - 2.6-r1
Ebuild name:

app-dicts/edictionary-2.6-r1

Description

Command line dictionary and thesaurus

Added to portage

2022-09-29

element-desktop-bin - 1.11.8
Ebuild name:

net-im/element-desktop-bin-1.11.8

Description

A glossy Matrix collaboration client for desktop (binary package)

Added to portage

2022-09-29

emcee - 3.1.3
Ebuild name:

dev-python/emcee-3.1.3

Description

Python ensemble sampling toolkit for affine-invariant MCMC

Added to portage

2022-09-29

fakeredis - 1.9.3
Ebuild name:

dev-python/fakeredis-1.9.3

Description

Fake implementation of redis API for testing purposes

Added to portage

2022-09-29

firewalld - 1.1.3
Ebuild name:

net-firewall/firewalld-1.1.3

Description

A firewall daemon with D-Bus interface providing a dynamic firewall

Added to portage

2022-09-29

firewalld - 1.2.1
Ebuild name:

net-firewall/firewalld-1.2.1

Description

A firewall daemon with D-Bus interface providing a dynamic firewall

Added to portage

2022-09-29

flatbuffers - 22.9.24
Ebuild name:

dev-python/flatbuffers-22.9.24

Description

RFC 7049 - Concise Binary Object Representation

Added to portage

2022-09-29

freedict-deu-eng - 1.0
Ebuild name:

app-dicts/freedict-deu-eng-1.0

Description

Freedict for language translation from German to English

Added to portage

2022-09-29

freedict-eng-fra - 1.0
Ebuild name:

app-dicts/freedict-eng-fra-1.0

Description

Freedict for language translation from English to French

Added to portage

2022-09-29

freedict-eng-ita - 1.0
Ebuild name:

app-dicts/freedict-eng-ita-1.0

Description

Freedict for language translation from English to Italian

Added to portage

2022-09-29

freedict-eng-swe - 1.0
Ebuild name:

app-dicts/freedict-eng-swe-1.0

Description

Freedict for language translation from English to Swedish

Added to portage

2022-09-29

freedict-fra-eng - 1.0
Ebuild name:

app-dicts/freedict-fra-eng-1.0

Description

Freedict for language translation from French to English

Added to portage

2022-09-29

ftjam - 2.5.3_rc2-r3
Ebuild name:

dev-util/ftjam-2.5.3_rc2-r3

Description

A 100% compatible, enhanced implementation of the make alternative Jam

Added to portage

2022-09-29

fzf - 0.34.0
Ebuild name:

app-shells/fzf-0.34.0

Description

General-purpose command-line fuzzy finder, written in Golang

Added to portage

2022-09-29

git - 2.38.0_rc2
Ebuild name:

dev-vcs/git-2.38.0_rc2

Description

Stupid content tracker distributed VCS designed for speed and efficiency

Added to portage

2022-09-29

gitea - 1.17.2
Ebuild name:

www-apps/gitea-1.17.2

Description

A painless self-hosted Git service

Added to portage

2022-09-29

google-auth - 2.12.0
Ebuild name:

dev-python/google-auth-2.12.0

Description

Google Authentication Library

Added to portage

2022-09-29

google-chrome-unstable - 107.0.5304.18
Ebuild name:

www-client/google-chrome-unstable-107.0.5304.18

Description

The web browser from Google

Added to portage

2022-09-29

hackrf-tools - 2022.09.1
Ebuild name:

net-wireless/hackrf-tools-2022.09.1

Description

tools for communicating with HackRF SDR platform

Added to portage

2022-09-29

iso8601 - 1.1.0
Ebuild name:

dev-python/iso8601-1.1.0

Description

Simple module to parse ISO 8601 dates

Added to portage

2022-09-29

jack-client - 0.5.4
Ebuild name:

dev-python/jack-client-0.5.4

Description

JACK Audio Connection Kit client for Python

Added to portage

2022-09-29

jarowinkler - 1.2.3
Ebuild name:

dev-python/jarowinkler-1.2.3

Description

Fast fuzzy string matching using Jaro and Jaro-Winkler similarity

Added to portage

2022-09-29

jupyter_server - 1.19.1
Ebuild name:

dev-python/jupyter_server-1.19.1

Description

Core services, APIs, and REST endpoints to Jupyter web application

Added to portage

2022-09-29

libcap - 2.66
Ebuild name:

sys-libs/libcap-2.66

Description

POSIX 1003.1e capabilities

Added to portage

2022-09-29

libhackrf - 2022.09.1
Ebuild name:

net-libs/libhackrf-2022.09.1

Description

library for communicating with HackRF SDR platform

Added to portage

2022-09-29

libmaxminddb - 1.7.0
Ebuild name:

dev-libs/libmaxminddb-1.7.0

Description

C library for the MaxMind DB file format

Added to portage

2022-09-29

libva-intel-media-driver - 22.5.3.1
Ebuild name:

x11-libs/libva-intel-media-driver-22.5.3.1

Description

Intel Media Driver for VA-API (iHD)

Added to portage

2022-09-29

microsoft-edge-dev - 107.0.1402.2
Ebuild name:

www-client/microsoft-edge-dev-107.0.1402.2

Description

The web browser from Microsoft

Added to portage

2022-09-29

mido - 1.2.10
Ebuild name:

dev-python/mido-1.2.10

Description

MIDI Objects, a library for working with MIDI messages and ports

Added to portage

2022-09-29

mod_h2 - 2.0.8
Ebuild name:

www-apache/mod_h2-2.0.8

Description

HTTP/2 module for Apache

Added to portage

2022-09-29

nim - 1.6.8
Ebuild name:

dev-lang/nim-1.6.8

Description

compiled, garbage-collected systems programming language

Added to portage

2022-09-29

nuspell - 5.1.2
Ebuild name:

app-text/nuspell-5.1.2

Description

Spell checker library and CLI for complex natural languages

Added to portage

2022-09-29

obconf - 2.0.4_p20150213-r1
Ebuild name:

x11-misc/obconf-2.0.4_p20150213-r1

Description

Tool for configuring the Openbox window manager

Added to portage

2022-09-29

ocaml - 4.14.0-r1
Ebuild name:

dev-lang/ocaml-4.14.0-r1

Description

Programming language supporting functional, imperative & object-oriented s

Added to portage

2022-09-29

pg_activity - 3.0.1
Ebuild name:

dev-db/pg_activity-3.0.1

Description

Realtime PostgreSQL database server monitoring tool

Added to portage

2022-09-29

plasma-wayland-protocols - 1.9.0
Ebuild name:

dev-libs/plasma-wayland-protocols-1.9.0

Description

Plasma Specific Protocols for Wayland

Added to portage

2022-09-29

putty - 0.77-r3
Ebuild name:

net-misc/putty-0.77-r3

Description

A Free Telnet/SSH Client

Added to portage

2022-09-29

pwauth - 2.3.10-r2
Ebuild name:

www-apache/pwauth-2.3.10-r2

Description

A Unix Web Authenticator

Added to portage

2022-09-29

pyfuse3 - 3.2.2
Ebuild name:

dev-python/pyfuse3-3.2.2

Description

Python 3 bindings for libfuse 3 with asynchronous API

Added to portage

2022-09-29

pyscard - 2.0.5
Ebuild name:

dev-python/pyscard-2.0.5

Description

Smart card support in python

Added to portage

2022-09-29

pytest-mock - 3.9.0
Ebuild name:

dev-python/pytest-mock-3.9.0

Description

Thin-wrapper around the mock package for easier use with pytest

Added to portage

2022-09-29

python-rtmidi - 1.4.9
Ebuild name:

dev-python/python-rtmidi-1.4.9

Description

Python bindings for media-libs/rtmidi implemented using Cython

Added to portage

2022-09-29

rapidfuzz - 2.10.2
Ebuild name:

dev-python/rapidfuzz-2.10.2

Description

Rapid fuzzy string matching in Python using various string metrics

Added to portage

2022-09-29

rqlite - 7.7.0
Ebuild name:

dev-db/rqlite-7.7.0

Description

Replicated SQLite using the Raft consensus protocol

Added to portage

2022-09-29

scsiping - 0.0.1-r2
Ebuild name:

sys-block/scsiping-0.0.1-r2

Description

SCSIPing pings a host on the SCSI-chain

Added to portage

2022-09-29

signal-desktop-bin - 5.61.0
Ebuild name:

net-im/signal-desktop-bin-5.61.0

Description

Allows you to send and receive messages of Signal Messenger on you

Added to portage

2022-09-29

soapyhackrf - 0.3.4
Ebuild name:

net-wireless/soapyhackrf-0.3.4

Description

SoapySDR HackRF module

Added to portage

2022-09-29

sphinx-autoapi - 2.0.0
Ebuild name:

dev-python/sphinx-autoapi-2.0.0

Description

A new approach to API documentation in Sphinx

Added to portage

2022-09-29

squid - 5.7
Ebuild name:

net-proxy/squid-5.7

Description

A full-featured web proxy cache

Added to portage

2022-09-29

tomlkit - 0.11.5
Ebuild name:

dev-python/tomlkit-0.11.5

Description

Style preserving TOML library

Added to portage

2022-09-29

unidecode - 1.3.5
Ebuild name:

dev-python/unidecode-1.3.5

Description

Module providing ASCII transliterations of Unicode text

Added to portage

2022-09-29

unix2tcp - 0.8.2-r2
Ebuild name:

net-misc/unix2tcp-0.8.2-r2

Description

Connection forwarder that converts Unix sockets into TCP sockets

Added to portage

2022-09-29

vbetool - 1.2.2
Ebuild name:

sys-apps/vbetool-1.2.2

Description

Run real-mode video BIOS code to alter hw state (i.e. reinitialize video car

Added to portage

2022-09-29

vivaldi-snapshot - 5.5.2805.3
Ebuild name:

www-client/vivaldi-snapshot-5.5.2805.3

Description

A browser for our friends

Added to portage

2022-09-29

volpack - 1.0_p7-r2
Ebuild name:

media-libs/volpack-1.0_p7-r2

Description

Volume rendering library

Added to portage

2022-09-29

x2vnc - 1.7.2-r2
Ebuild name:

x11-misc/x2vnc-1.7.2-r2

Description

Control a remote computer running VNC from X

Added to portage

2022-09-29

rdf newsfeed | rss newsfeed | Atom newsfeed
- Powered by LeopardCMS - Running on Gentoo -
Copyright 2004-2020 Sascha Nitsch Unternehmensberatung GmbH
Valid XHTML1.1 : Valid CSS : buttonmaker
- Level Triple-A Conformance to Web Content Accessibility Guidelines 1.0 -
- Copyright and legal notices -
Time to create this page: 16.7 ms