from small one page howto to huge articles all in one place

search text in:




Other .linuxhowtos.org sites: www.linuxhowtos.org
toolsntoys.linuxhowtos.org



Last additions:
How to make X listen on port 6000

How to make X listen on port 6000

words:

34

views:

89499

userrating:

average rating: 1.2 (52 votes) (1=very good 6=terrible)


May, 25th 2007:
April, 26th 2007:
Apr, 10th. 2007:
Druckversion . pdf icon
You are here: Portage


Details of dev-haskell/fin:

Description: Nat and Fin: peano naturals and finite numbers
Homepage:
https://github.com/phadej/vec

available versions:

releasesalphaamd64armhppaia64mipsppcppc64ppc macoss390shsparcx86USE-Flagsdependenciesebuild warnings
fin-0.3.2 -~-----~----~none
show
show
Legend:
+ stable
~ testing
- not available
some ebuild warning depend on specific use-flags or architectures, all ebuild-warnings are shown.

Known bugs:
bug IDcomponentassigned tostatusdescriptionlast change
146951Core systemalphaUNCONFIRMEDsys-fs/quota - value too large for defined data type on Alpha systems2011-12-02 19:03:44
258018Applicationsnet-mailUNCONFIRMEDmail-mta/ssmtp-2.62-r8: blank password sent if ssmtp.conf defines password containing '#'2012-12-21 12:48:02
367037JavajavaUNCONFIRMEDdev-java/piccolo2d-1.2.1-r2 did not build unable to find paths2011-05-13 05:12:20
372647Prefix SupportprefixUNCONFIRMEDgnome-base/libgnomeui-2.24.5: ld: cannot find -lselinux2011-06-23 04:07:53
373387ApplicationsgraphicsUNCONFIRMEDmedia-gfx/hugin-2011.0.0 fail to compile; ld cannot find -lwx_gtk2_gl-2.82012-03-26 20:18:36
374535Prefix SupportprefixUNCONFIRMEDsandbox-2.4 can't find libc2011-07-09 14:15:22
374699ApplicationsbinkiUNCONFIRMEDdev-libs/lzo need LDFLAGS -no-undefined to build DLL for CHOST *-*-mingw322011-12-02 03:19:46
374839Mailing Listsinfra-bugsUNCONFIRMEDList-Id: is not very fine configured2011-07-11 12:05:40
375359ApplicationsschemeUNCONFIRMEDdev-scheme/slib ebuild scripts cannot find installed drscheme2013-02-06 06:05:35
376455DevelopmenttoolchainUNCONFIRMEDsys-devel/gdb-7.2 build broken by CFLAGS='-finline-functions -ftracer'2011-07-26 17:59:11
379177DevelopmenttexUNCONFIRMEDdev-tex/pdftex-1.40.10 ttf2afm.c:(.text+0x35e1): undefined reference to `kpse_set_progname'2011-08-19 21:14:54
380459PMS/EAPIpms-bugsUNCONFIRMEDMERGE_TYPE phases aren't defined2011-08-24 17:51:29
383295Librarymedia-videoUNCONFIRMEDmedia-libs/libdc1394-2.1.3-r1 fails to link (undefined references to yuy2_to_yv16 and yuy2_to_yv12)2011-10-05 09:12:28
383395UnspecifiedwineUNCONFIRMEDapp-emulation/wine-1.3.28 can't find gecko2012-08-18 09:34:28
383789Applicationssci-biologyUNCONFIRMEDsci-biology/ncbi-tools++-2010.06.15-r1: libmzXML.so: undefined reference to `ncbi::CMemberInfo::SetN2013-02-17 08:11:13
384617EbuildschainsawUNCONFIRMEDapp-emulation/dynamips fails to compile (w/ can't find a register in class 'GENERAL_REGS')2011-10-31 10:29:49
387623ApplicationsclusterUNCONFIRMEDsys-infiniband/opensm - Variables in /etc/init.d/opensm and /etc/conf.d/opensm do not match2011-10-19 12:06:50
388575Ebuildsmaintainer-wantedUNCONFIRMEDatem-0.3.2.ebuild - Fast command line tool that converts MetaStock financial binary data to CSV/text2011-11-03 18:46:04
388645Applicationsmaintainer-wantedUNCONFIRMEDapp-office/moneyguru - a personal finance management application2011-10-27 17:51:06
389021Ebuildsmaintainer-wantedUNCONFIRMED[net-misc?]/dlan-linux - Find and configure your devolo (Ethernet via existing electrical wiring) dL2012-01-12 10:14:40
390931Libraryx11UNCONFIRMEDmedia-libs/mesa-7.11: /usr/lib/dri/swrast_dri.so: undefined symbol: _glapi_tls_Context2012-04-27 07:05:34
393161ApplicationsevaUNCONFIRMEDx11-drivers/xf86-input-synaptics-1.5.0: TwoFingerScroll no longer has any effect2012-03-23 20:58:34
396179ApplicationspatrickUNCONFIRMEDdev-lang/nqp-2011.10 - /usr/bin/parrot: symbol lookup error: dynext/nqp_group.so: undefined symbol: 2011-12-27 21:15:43
398089ApplicationstristanUNCONFIRMEDx11-misc/revelation-0.4.11-r2 USE=applet - configure:13842: error: failed to find module gnomeapplet2012-01-10 00:03:01
399087ApplicationstexUNCONFIRMEDdev-tex/pgf-2.10: Undefined control sequence "\pgf@test"2012-01-17 04:11:17
399199Ebuildsmaintainer-wantedUNCONFIRMEDmedia-sound/acoustid-fingerprinter - GUI application for submitting audio fingerprints to Acoustid2012-01-17 21:28:50
400601ApplicationsgraphicsUNCONFIRMEDmedia-gfx/enblend-4.0 USE=doc - ./auxmac.tex:1: I can't find file `thumbpdf.sty'.2012-01-25 13:59:04
400701GCC PortingadaUNCONFIRMEDdev-lang/gnat-gcc-4.4.5 cannot find system.ads2012-01-25 15:19:05
402023KernelsecurityUNCONFIRMEDThe Linux kernel, when using IPv6, allows remote attackers to determine whether a host is sniffing t2012-02-03 04:38:20
402967Applicationskernel-miscUNCONFIRMEDsys-fs/fuse-2.8.7 - ld.gold: error: symbol fuse_new has undefined version2012-12-25 21:39:12
403051Applicationsmr_bones_UNCONFIRMEDmedia-gfx/gqview-2.1.5 - ld: pan-calendar.o: undefined reference to symbol 'sqrt@@GLIBC_2.0'2012-02-13 12:03:19
403455ApplicationsbilllUNCONFIRMEDmedia-video/ogmrip-0.13.7 - configure.in:132: error: possibly undefined macro: AM_GCONF_SOURCE_22012-02-15 17:31:54
404227ApplicationsgraphicsUNCONFIRMEDmedia-gfx/hugin-2011.4.0 - ../hugin_base/libhuginbase.so.0.0: undefined reference to `sgesvd_'2012-02-17 15:08:27
405765ApplicationsnetmonUNCONFIRMEDnet-analyzer/rrdtool-1.4.5-r2 - main.c:(.text+0x26c): undefined reference to `rrd_xport'2012-08-26 06:23:55
405813Ebuildsmedia-videoUNCONFIRMEDmedia-libs/libvpx-1.0.0 USE=ssse3 - x86_systemdependent.c:(.text+0x263): undefined reference to `vp82013-01-15 22:37:22
406085ServerfloppymUNCONFIRMEDnet-misc/openswan-2.6.37 with USE +caps fails to find cacert (X.509)2012-04-06 22:44:01
407155UnspecifiedjsbronderUNCONFIRMEDsys-cluster/openmpi - Rmpi fails to install under dev-lang/R-2.14.2 due to undefined symbol: mca_bas2012-05-11 12:13:24
409641DevelopmentaraujoUNCONFIRMEDdev-lang/io-2009.01.02-r2: Uncomment the IO_USE_SIMD define to turn on SIMD acceleration2012-12-24 08:55:55
410719ApplicationsnxUNCONFIRMEDnet-misc/nxclient - nxclient: symbol lookup error: /usr/lib/libfontconfig.so.1: undefined symbol: FT2012-04-04 02:19:00
416691KDEvoyageurUNCONFIRMEDkde-base/nepomuk-4.8.3 fails with undefined references (dragonegg problem)2012-09-28 13:05:52
416949Prefix SupportprefixUNCONFIRMEDapp-misc/figlet-222 works fine on x64-macos2012-05-21 18:21:31
417515Unclassifieddev-portageUNCONFIRMEDsys-apps/portage-2.1.10.49 etc-update finds rc.conf twice2012-05-27 21:31:38
417995EbuildsgraphicsUNCONFIRMEDmedia-gfx/gimageview-0.2.27-r3: 'pow@@GLIBC_2.0' is defined in DSO /lib/libm.so.2012-05-28 16:32:51
418287Core systembase-systemUNCONFIRMEDsys-boot/grub-0.97-r11 - Failed Running autoconf ! - configure.ac:59: error: possibly undefined macr2012-10-09 04:21:54
422907Prefix SupportprefixUNCONFIRMEDdev-lang/ghc-7.4.1-r1: Undefined symbols for architecture x86_64 when building in-tree ghc-pwd2012-09-28 20:27:16
423167Developmentphp-bugsUNCONFIRMEDdev-php/pecl-http-1.7.4 fails at runtime with "undefined symbol: gcry_control" when using net-libs/g2012-08-01 12:00:35
423817DevelopmentflameeyesUNCONFIRMEDdev-util/dwarves-1.9: ostra-cg cannot find python module ostra: ImportError: No module named ostra2012-06-27 18:54:10
427316Core systemvoyageurUNCONFIRMED=sys-apps/findutils-4.5.10-r1 fails tests with clang-3.1-r42012-07-21 14:07:00
427496ApplicationsalexxyUNCONFIRMEDnet-wireless/wimax-1.5.2-r1 with net-wireless/wpa_supplicant-1.0 USE=wimax - undefined reference to 2013-01-05 12:47:50
427854DevelopmentrubyUNCONFIRMEDdev-ruby/rspec-core-2.10.1 USE=doc - String finished while reading (break on []) already read: ...2012-07-26 05:09:16
430308DevelopmenthwoarangUNCONFIRMEDdev-util/qt-creator-2.5.0: cannot find/use tool chain2012-10-24 14:46:48
431560DevelopmentmozillaUNCONFIRMEDdev-lang/spidermonkey-1.8.2.15: building w/uClibc fails due to finite() vs isfinite()2013-02-18 06:26:46
431916ApplicationsdotnetUNCONFIRMEDdev-dotnet/libgdiplus-2.10.9 - Variable 'libjpeg_prefix' not defined in '/usr/lib64/pkgconfig/libgdi2012-11-09 14:13:30
432020Core systemtoolchainUNCONFIRMEDsys-libs/glibc-2.15-r2: /var/db/services.db causes infinite loop in getaddrinfo()2012-12-30 21:01:03
432688Ebuildsmaintainer-wantedUNCONFIRMEDapp-shells/zsh-completions-0.6.0 - Additional completion definitions for Zsh2012-10-22 11:21:26
433070KDEkdeUNCONFIRMEDapp-editors/kile-2.1.2-r1 - index.docbook:124: parser error : Entity 'ged.vertaald' not defined2013-02-17 22:53:14
433157LibraryfontsUNCONFIRMEDmedia-libs/freetype-2.4.10-r1 USE=infinality causes segmentation faults running x11-wm/openbox in _f2012-10-17 12:10:36
434130ApplicationsmozillaUNCONFIRMEDdev-libs/nss-3.13.6 - /usr/lib/libnspr4.so: undefined reference to `__fdelt_chk'2012-09-24 16:48:11
434216KDEkdeUNCONFIRMEDdev-util/cmake-2.8.9: FindLua51.cmake finds dev-lang/lua-5.2.12012-10-02 07:29:27
434472ApplicationshannoUNCONFIRMEDnet-analyzer/openvas-scanner-3.2.4 - ld: CMakeFiles/openvassd.dir/preferences.c.o: undefined referen2013-01-01 12:37:32
435338ApplicationstexUNCONFIRMEDdev-tex/chktex-1.7.0 - .../work/chktex-1.7.0/FindErrs.c:320: warning: implicit declaration of functi2012-09-18 13:41:50
435656EbuildshannoUNCONFIRMEDnet-analyzer/greenbone-security-assistant-2.0.1 - ld: CMakeFiles/gsad.dir/gsad.c.o: undefined refere2012-09-24 10:44:47
435676Applicationssci-chemistryUNCONFIRMEDsci-chemistry/ghemical-2.99.2-r2 - /usr/lib64/libSCwfn.so: undefined reference to `sc::DenFunctional2012-09-21 16:11:33
435812ApplicationssciUNCONFIRMED[science overlay] sci-libs/umfpack-5.5.2 - configure: error: Cannot find blas libraries2012-09-22 17:01:25
435960Core systemmaintainer-wantedUNCONFIRMEDsys-boot/refind - (rEFInd) Extensible Firmware Interface boot manager2013-01-28 19:33:22
436500LibraryprintingUNCONFIRMEDapp-text/ghostscript-gpl with media-libs/freetype-2.4.10-r1 USE=infinality - ghostscript based appli2013-02-16 21:14:40
436600GamesgamesUNCONFIRMEDgames-simulation/fgrun-1.6.0 fails to find dev-games/openscenegraph libs during linking2012-11-08 21:11:12
436708Ebuildsmedia-tvUNCONFIRMEDmedia-tv/xawtv-3.95-r2 - v4lctl: dlopen: /usr/lib64/xawtv/flt-disor.so: undefined symbol: atanf / po2013-02-15 14:53:00
436986Applicationsrobbat2UNCONFIRMEDapp-portage/g-cpan - perl-gcpan/Finance-QuoteHist-1.16 attempts to pull in perl-gcpan/Date-Manip, ig2012-10-02 17:09:49
437056LibraryyngwinUNCONFIRMEDapp-admin/eselect-infinality - after setting to nyx, 43-repl-terminus.conf cannot be load2012-10-17 12:12:28
437704Applicationsmedia-videoUNCONFIRMEDmedia-video/gpac-0.4.5-r5: wxOsmo4.o: undefined reference to symbol 'gtk_widget_get_parent_window'2012-10-09 15:40:38
438890Serverldap-bugsUNCONFIRMEDnet-nds/openldap USE="gnutls ssl" cannot find gcrypt.h2013-01-13 07:41:57
439164EbuildsultrabugUNCONFIRMED<=app-admin/rsyslog-5.8.12 USE=ssl undefined symbol: gcry_control2012-10-29 16:10:45
439894Applicationsapp-dictsUNCONFIRMEDapp-text/stardict - configure.ac:310: error: possibly undefined macro: AM_GCONF_SOURCE_22012-10-27 18:48:47
439920Core systemperlUNCONFIRMEDdev-lang/perl-5.12.4-r1 - pp.o: In function `Perl_pp_pow': pp.c:(.text+0x3a8a): undefined reference 2012-10-28 16:20:23
441760Ebuildssci-geosciencesUNCONFIRMEDsci-geosciences/gpsd-3.7 - NameError: name 'gps_regress' is not defined: File "/var/tmp/portage/sc2012-11-07 02:15:55
441862ApplicationsalexxyUNCONFIRMEDsys-apps/gptfdisk-0.8.5 - In function `GPTPart::GetDescription()': gptpart.cc:(.text+0x179): undefin2013-02-12 11:55:19
442106Core systemxmwUNCONFIRMEDsys-power/suspend-1.0 USE=fbsplash - ld: cannot find -lmng -ljpeg -llcms -lpng15 -lz -lfreetype2012-11-06 21:44:41
442628UnspecifiedvoipUNCONFIRMEDnet-voip/ekiga-3.9.90 - Fails to build, ld: cannot find -lQtCore2012-12-12 02:27:31
443604LibrarydotnetUNCONFIRMEDdev-dotnet/libgdiplus-2.10 - ../src/.libs/libgdiplus.so: error: undefined reference to 'atan' /// (m2012-11-19 10:30:17
444896Applicationsldap-bugsUNCONFIRMEDnet-nds/openldap-2.4.30 USE="overlays" - ld: cannot find -lldap_r2012-11-27 16:06:20
444928Libraryx11UNCONFIRMEDmedia-libs/mesa-9.0.1 - ld: ../../auxiliary//libgallium.a(u_dl.o): undefined reference to symbol 'dl2012-11-27 16:36:13
447530Ebuildsbase-systemUNCONFIRMEDnet-firewall/iptables[netlink] - please add support for loading fingerprint definitions from pf.os f2013-02-16 14:09:37
448130ApplicationsopenofficeUNCONFIRMEDapp-office/libreoffice-3.6.4.3 - /usr/lib64//libclucene-core.so: undefined reference to `std::__deta2012-12-27 07:54:58
448342GNOMEgnomeUNCONFIRMED[gnome-overlay] =app-admin/gnome-system-tools-3.0.0: undefined reference to `g_thread_init'2012-12-23 23:45:59
448424Applicationsx11UNCONFIRMEDx11-drivers/xf86-video-nouveau-1.0.4 cannot find the nVidia card on PowerBook G42012-12-25 18:16:24
448626Developmentdev-toolsUNCONFIRMEDdev-util/findbugs-2.0.2 version bump2012-12-26 03:10:32
449092LibraryqtUNCONFIRMED[qt overlay] x11-libs/qt-webkit-5.0.0 fails to build: undefined reference to `JSC::JSCell::classInfo2013-02-16 10:09:49
449232ApplicationssciUNCONFIRMED[science overlay] sci-libs/cholmod-2.0.1: pkg-config fails to find lapack libraries installed from s2013-01-29 19:26:55
449266LibrarycppUNCONFIRMEDdev-libs/Ice-3.4.2-r1 - /usr/lib64/libIceGrid.so.34: undefined reference to `IceInternal::upCast(Ice2012-12-31 15:31:18
449472DevelopmentsciUNCONFIRMED[science overlay] dev-lang/julia-9999 - ld: cannot find -lunwind-generic2013-01-06 15:57:08
450004GNOMEgnomeUNCONFIRMEDgnome-extra/libgda-5.1.1-r1: Couldn't find suitable VM2013-02-11 14:07:26
450322Applicationssci-biologyUNCONFIRMEDsci-biology/mira-3.4.0.2 - libtool: Version mismatch error. This is libtool 2.4, but the definition2013-02-17 09:09:47
450386DevelopmentkdeUNCONFIRMEDdev-util/cmake: FindBLAS patch doesn't correctly use pkg-config results and may fail2013-01-08 12:36:44
450512Prefix SupportprefixUNCONFIRMEDmedia-gfx/graphite2: Undefined symbols for architecture ppc2013-02-02 15:39:11
451054LibrarycjkUNCONFIRMEDdev-libs/oniguruma-5.9.2-r1 - autotools-utils_src_prepare: Cannot find the latest automake! Tried 1.2013-01-09 14:27:12
451270Core systemclusterUNCONFIRMEDsys-infiniband/ofed-3.5 - /etc/infiniband/openib.conf: MLX4_LOAD=yes not obeyed by init script2013-01-11 16:26:21
451524Applicationssci-mathematicsUNCONFIRMEDsci-mathematics/octave-3.6.3 - libcruft/.libs/libcruft.so: undefined reference to `_gfortran_transfe2013-02-12 03:35:50
451840Developmentphp-bugsUNCONFIRMED=dev-lang/php-5.4.8 - /usr/lib/gcc/x86_64-pc-linux-gnu/4.5.4/../../../../lib64/libldap.so: undefined2013-01-14 12:35:20
452464GNOMEgnomeUNCONFIRMEDmedia-video/totem-3.6.x: nautilus warning: libtotem-properties-page.so: undefined symbol: bacon_vide2013-01-16 18:49:29
452852Applicationsdev-toolsUNCONFIRMEDdev-util/insight-6.8.1 with >=dev-tcltk/itcl-4.0.0 - Error: can't find package Itcl 3.32013-02-03 11:53:40
453500ApplicationsbircophUNCONFIRMEDapp-doc/root-docs-5.34.03 - Error: Function Open(filename,"RECREATE") is not defined in current scop2013-02-19 19:12:58
453562GNOMEgnomeUNCONFIRMEDx11-libs/gtk+-3.6.3-r2 USE="wayland" - ./.libs/libgdk-3.so: undefined reference to `wl_egl_pixmap_cr2013-01-24 09:23:22
453644Core systemjsbronderUNCONFIRMEDsys-cluster/torque-2.5.12 - qstat-qstat.o: In function `tcl_run': qstat.c:(.text+0x1ac5): undefined 2013-02-06 16:34:18
453894ApplicationsflameeyesUNCONFIRMEDnet-misc/lksctp-tools-1.0.12 - src/apps/sctp_darn.c:1870: undefined reference to `sctp_connectx'2013-01-26 01:40:32
454460ApplicationsmozillaUNCONFIRMEDwww-client/firefox-18.0.1: undefined reference to `WebRtcAecm_WindowAndFFTNeon'2013-01-30 20:14:08
455058Applicationsmedia-videoUNCONFIRMEDmedia-video/gxine with dev-lang/spidermonkey-1.8.8 - build fails to find mozjs2013-02-05 11:27:23
455072ServerswegenerUNCONFIRMEDnet-dns/pdns-3.1 with USE="sqlite3" - checking for SQLITE3... configure: error: +Could not find sqli2013-02-02 17:34:19
455118Librarysci-geosciencesUNCONFIRMEDsci-libs/geos-3.3.7[php] does build fine with php-5.4.8[-threads]2013-02-04 02:29:24
455234KDEkdeUNCONFIRMEDkmix: dbuscontrolwrapper.cpp:(.text+0x169): undefined reference to `vtable for DBusControlWrapper'2013-02-03 07:06:26
455270Applicationssci-mathematicsUNCONFIRMED[science overlay] sci-mathematics/scilab-5.4.0 build can't find lots of files2013-02-12 13:14:40
455414Librarymaintainer-neededUNCONFIRMEDdev-libs/libmix-2.05-r6 with clang-3.2 - aes/saferp.c:22:8: error: redefinition of 'expf' as differe2013-02-05 12:13:40
455912OpenRCopenrcUNCONFIRMEDsys-apps/openrc-0.11.8 with sys-libs/ncurses[tinfo] - ../libeinfo/libeinfo.so: undefined reference t2013-02-14 14:13:57
456328ApplicationschithanhUNCONFIRMEDwww-plugins/gnash-08.10-r2 with dev-libs/boost-1.52.0-r5 - ld: sdl_gnash-gnash.o: undefined referenc2013-02-12 14:38:36
456792LibrarycppUNCONFIRMEDdev-libs/boost-1.52.0-r5 fails to compile with custom /etc/site-config.jam: could not find main targ2013-02-12 22:13:10
456928Applicationsphp-bugsUNCONFIRMEDdev-lang/php-5.4.8[imap] - ./conftest: symbol lookup error: /usr/lib64/libc-client.so.1: undefined s2013-02-13 19:05:07
457656ApplicationsnikoliUNCONFIRMEDmedia-sound/clementine (while scanning media) - segfault in TagLib::File::find(TagLib::ByteVector co2013-02-15 15:57:13
458262baselayoutrobbat2UNCONFIRMEDsys-fs/lvm2 Failed to find sysfs mount point when starting2013-02-20 16:20:15
458300Libraryx11UNCONFIRMED>=media-libs/mesa-9.1_rc1[xa]: libxatracker.so has undefined symbol: _ZTVN10__cxxabiv120__si_class_t2013-02-21 13:47:33
458596Applicationsbug-wranglersUNCONFIRMEDmedia-gfx/wings-1.1.1: can't find include lib "esdl/include/gl.hrl" and "esdl/include/glu.hrl"2013-02-21 14:35:44


back



Support us on Content Nation

New Packages

- as rdf newsfeed
- as rss newsfeed
- as Atom newsfeed
2026-10-24
chocolate-doom - 3.1.1-r1
Ebuild name:

games-fps/chocolate-doom-3.1.1-r1

Description

A Doom source port that is minimalist and historically accurate

Added to portage

2026-10-24

fangfrisch - 1.9.3
Ebuild name:

app-antivirus/fangfrisch-1.9.3

Description

Update and verify unofficial Clam Anti-Virus signatures

Added to portage

2026-10-24

git-lfs - 3.8.1
Ebuild name:

dev-vcs/git-lfs-3.8.1

Description

Command line extension and specification for managing large files with git

Added to portage

2026-10-24

openssl-compat - 1.1.1w
Ebuild name:

dev-libs/openssl-compat-1.1.1w

Description

Full-strength general purpose cryptography library (including SSL an

Added to portage

2026-10-24

openssl-compat - 3.6.5
Ebuild name:

dev-libs/openssl-compat-3.6.5

Description

Full-strength general purpose cryptography library (including SSL and

Added to portage

2026-10-24

2026-10-23
apparmor - 5.0.2
Ebuild name:

sys-apps/apparmor-5.0.2

Description

Userspace utils and init scripts for the AppArmor application security syst

Added to portage

2026-10-23

apparmor-profiles - 5.0.2
Ebuild name:

sec-policy/apparmor-profiles-5.0.2

Description

A collection of profiles for the AppArmor application security s

Added to portage

2026-10-23

apparmor-utils - 5.0.2
Ebuild name:

sys-apps/apparmor-utils-5.0.2

Description

Additional userspace utils to assist with AppArmor profile management

Added to portage

2026-10-23

asm - 9.11.1
Ebuild name:

dev-java/asm-9.11.1

Description

Bytecode manipulation framework for Java

Added to portage

2026-10-23

baloo - 6.31.0-r2
Ebuild name:

kde-frameworks/baloo-6.31.0-r2

Description

Framework for searching and managing metadata

Added to portage

2026-10-23

batik - 1.18-r3
Ebuild name:

dev-java/batik-1.18-r3

Description

XML Graphics Batik

Added to portage

2026-10-23

batik - 1.20
Ebuild name:

dev-java/batik-1.20

Description

XML Graphics Batik

Added to portage

2026-10-23

breezy - 3.3.23
Ebuild name:

dev-vcs/breezy-3.3.23

Description

Distributed Version Control System with a Friendly UI

Added to portage

2026-10-23

brotlicffi - 1.2.1.0
Ebuild name:

dev-python/brotlicffi-1.2.1.0

Description

Python binding to the Brotli library

Added to portage

2026-10-23

buildah - 1.46.0
Ebuild name:

app-containers/buildah-1.46.0

Description

A tool that facilitates building OCI images

Added to portage

2026-10-23

byte-buddy - 1.18.15
Ebuild name:

dev-java/byte-buddy-1.18.15

Description

Offers convenience for attaching an agent to the local or a remote VM

Added to portage

2026-10-23

container-libs - 0.70.0
Ebuild name:

app-containers/container-libs-0.70.0

Description

Several utilities from the containers project

Added to portage

2026-10-23

coredns - 1.15.0
Ebuild name:

net-dns/coredns-1.15.0

Description

CoreDNS is a DNS server that chains plugins

Added to portage

2026-10-23

courier - 2.0.8-r1
Ebuild name:

mail-mta/courier-2.0.8-r1

Description

An MTA designed specifically for maildirs

Added to portage

2026-10-23

courier - 2.0.9
Ebuild name:

mail-mta/courier-2.0.9

Description

An MTA designed specifically for maildirs

Added to portage

2026-10-23

coverage - 7.17.0
Ebuild name:

dev-python/coverage-7.17.0

Description

Code coverage measurement for Python

Added to portage

2026-10-23

dulwich - 1.2.19
Ebuild name:

dev-python/dulwich-1.2.19

Description

Pure-Python implementation of the Git file formats and protocols

Added to portage

2026-10-23

ebuild-mode - 1.89
Ebuild name:

app-xemacs/ebuild-mode-1.89

Description

Emacs modes for editing ebuilds and other Gentoo specific files

Added to portage

2026-10-23

ensurepip-pip - 26.2.1-r1
Ebuild name:

dev-python/ensurepip-pip-26.2.1-r1

Description

Shared pip wheel for ensurepip Python module

Added to portage

2026-10-23

ensurepip-pip - 26.2.2-r1
Ebuild name:

dev-python/ensurepip-pip-26.2.2-r1

Description

Shared pip wheel for ensurepip Python module

Added to portage

2026-10-23

fastapi - 0.161.1
Ebuild name:

dev-python/fastapi-0.161.1

Description

High performance framework, easy to learn, fast to code, ready for produ

Added to portage

2026-10-23

flask-paginate - 2026.10.22
Ebuild name:

dev-python/flask-paginate-2026.10.22

Description

Pagination support for flask

Added to portage

2026-10-23

fop - 2.10-r3
Ebuild name:

dev-java/fop-2.10-r3

Description

XML Graphics Format Object Processor All-In-One

Added to portage

2026-10-23

fop - 2.12
Ebuild name:

dev-java/fop-2.12

Description

XML Graphics Format Object Processor All-In-One

Added to portage

2026-10-23

gdb - 18.1-r1
Ebuild name:

dev-debug/gdb-18.1-r1

Description

GNU debugger

Added to portage

2026-10-23

glycin-loaders - 2.2.4
Ebuild name:

media-libs/glycin-loaders-2.2.4

Description

Loaders for glycin clients (glycin crate or libglycin)

Added to portage

2026-10-23

google-api-core - 2.43.0
Ebuild name:

dev-python/google-api-core-2.43.0

Description

Core Library for Google Client Libraries

Added to portage

2026-10-23

googleapis-common-protos - 1.76.0
Ebuild name:

dev-python/googleapis-common-protos-1.76.0

Description

Python classes generated from the common protos in the g

Added to portage

2026-10-23

gr-fosphor - 0.0_p20260330-r2
Ebuild name:

net-analyzer/gr-fosphor-0.0_p20260330-r2

Description

gnuradio fosphor block (GPU spectrum display)

Added to portage

2026-10-23

gr-paint - 0.0_p20250824-r2
Ebuild name:

net-wireless/gr-paint-0.0_p20250824-r2

Description

Paints monochrome images into the waterfall of a receiver

Added to portage

2026-10-23

grpcio - 1.84.1
Ebuild name:

dev-python/grpcio-1.84.1

Description

HTTP/2-based RPC framework

Added to portage

2026-10-23

grpcio-status - 1.84.1
Ebuild name:

dev-python/grpcio-status-1.84.1

Description

Reference package for GRPC Python status proto mapping

Added to portage

2026-10-23

gruvbox-theme - 1.30.4
Ebuild name:

app-emacs/gruvbox-theme-1.30.4

Description

Gruvbox is a retro groove color scheme, now in Emacs

Added to portage

2026-10-23

gruvbox-theme - 9999
Ebuild name:

app-emacs/gruvbox-theme-9999

Description

Gruvbox is a retro groove color scheme, now in Emacs

Added to portage

2026-10-23

h4x0r - 0.13-r1
Ebuild name:

app-emacs/h4x0r-0.13-r1

Description

Aid in writing like a script kiddie does

Added to portage

2026-10-23

hypothesis - 6.170.8
Ebuild name:

dev-python/hypothesis-6.170.8

Description

A library for property based testing

Added to portage

2026-10-23

importlib-metadata - 9.1.0
Ebuild name:

dev-python/importlib-metadata-9.1.0

Description

Read metadata from Python packages

Added to portage

2026-10-23

iotop-c - 1.33
Ebuild name:

sys-process/iotop-c-1.33

Description

top utility for IO (C port)

Added to portage

2026-10-23

jellyfin-bin - 12.3
Ebuild name:

www-apps/jellyfin-bin-12.3

Description

Jellyfin puts you in control of managing and streaming your media

Added to portage

2026-10-23

jetring - 0.31
Ebuild name:

app-crypt/jetring-0.31

Description

GPG keyring maintenance using changesets

Added to portage

2026-10-23

jetring - 0.32
Ebuild name:

app-crypt/jetring-0.32

Description

GPG keyring maintenance using changesets

Added to portage

2026-10-23

jitterentropy - 3.6.0
Ebuild name:

app-crypt/jitterentropy-3.6.0

Description

Hardware RNG based on CPU timing jitter

Added to portage

2026-10-23

jitterentropy - 3.6.3
Ebuild name:

app-crypt/jitterentropy-3.6.3

Description

Hardware RNG based on CPU timing jitter

Added to portage

2026-10-23

jitterentropy-rngd - 1.2.8
Ebuild name:

app-crypt/jitterentropy-rngd-1.2.8

Description

Jitter RNG daemon

Added to portage

2026-10-23

johntheripper - 1.8.0-r2
Ebuild name:

app-crypt/johntheripper-1.8.0-r2

Description

fast password cracker

Added to portage

2026-10-23

johntheripper - 1.9.0
Ebuild name:

app-crypt/johntheripper-1.9.0

Description

fast password cracker

Added to portage

2026-10-23

johntheripper-jumbo - 1.9.0_p20240102
Ebuild name:

app-crypt/johntheripper-jumbo-1.9.0_p20240102

Description

Fast password cracker, community enhanced version

Added to portage

2026-10-23

kddockwidgets - 2.5.1
Ebuild name:

gui-libs/kddockwidgets-2.5.1

Description

KDAB's Dock Widget Framework for Qt

Added to portage

2026-10-23

keepassxc - 2.8.0
Ebuild name:

app-admin/keepassxc-2.8.0

Description

KeePassXC - KeePass Cross-platform Community Edition

Added to portage

2026-10-23

keepassxc - 2.8.0_beta1
Ebuild name:

app-admin/keepassxc-2.8.0_beta1

Description

KeePassXC - KeePass Cross-platform Community Edition

Added to portage

2026-10-23

libapparmor - 5.0.2
Ebuild name:

sys-libs/libapparmor-5.0.2

Description

Library to support AppArmor userspace utilities

Added to portage

2026-10-23

mdbook - 0.5.4-r1
Ebuild name:

app-text/mdbook-0.5.4-r1

Description

Create a book from markdown files

Added to portage

2026-10-23

memory-allocator - 0.2.1
Ebuild name:

dev-python/memory-allocator-0.2.1

Description

An extension class for memory allocation in cython

Added to portage

2026-10-23

mmix - 20261012
Ebuild name:

dev-lang/mmix-20261012

Description

Donald Knuth's MMIX Assembler and Simulator

Added to portage

2026-10-23

nvidia-drivers - 595.44.16
Ebuild name:

x11-drivers/nvidia-drivers-595.44.16

Description

NVIDIA Accelerated Graphics Driver

Added to portage

2026-10-23

openh264 - 2.7.0
Ebuild name:

media-libs/openh264-2.7.0

Description

Cisco OpenH264 library and Gecko Media Plugin for Mozilla packages

Added to portage

2026-10-23

openjdk - 17.0.21.0.2_p1
Ebuild name:

dev-java/openjdk-17.0.21.0.2_p1

Description

Open source implementation of the Java programming language

Added to portage

2026-10-23

openjdk - 21.0.13.0.2_p1
Ebuild name:

dev-java/openjdk-21.0.13.0.2_p1

Description

Open source implementation of the Java programming language

Added to portage

2026-10-23

openjdk - 25.0.5.0.2_p1
Ebuild name:

dev-java/openjdk-25.0.5.0.2_p1

Description

Open source implementation of the Java programming language

Added to portage

2026-10-23

openjdk - 27.0.1.0.2_p1
Ebuild name:

dev-java/openjdk-27.0.1.0.2_p1

Description

Open source implementation of the Java programming language

Added to portage

2026-10-23

openjdk - 28_alpha21
Ebuild name:

dev-java/openjdk-28_alpha21

Description

Open source implementation of the Java programming language

Added to portage

2026-10-23

openjdk-bin - 28_alpha21
Ebuild name:

dev-java/openjdk-bin-28_alpha21

Description

Prebuilt Java JDK binaries provided by Eclipse Temurin

Added to portage

2026-10-23

openpgp-keys-apache-xmlgraphics - 20260128
Ebuild name:

sec-keys/openpgp-keys-apache-xmlgraphics-20260128

Description

OpenPGP keys used by xmlgraphics.apache.org/commo

Added to portage

2026-10-23

openpgp-keys-apparmor - 20260924
Ebuild name:

sec-keys/openpgp-keys-apparmor-20260924

Description

OpenPGP keys used by AppArmor

Added to portage

2026-10-23

openpgp-keys-keepassxc - 20261023
Ebuild name:

sec-keys/openpgp-keys-keepassxc-20261023

Description

OpenPGP key used for KeePassXC releases

Added to portage

2026-10-23

openstacksdk - 4.22.0
Ebuild name:

dev-python/openstacksdk-4.22.0

Description

A collection of libraries for building applications to work with Ope

Added to portage

2026-10-23

pandas - 3.1.0
Ebuild name:

dev-python/pandas-3.1.0

Description

Powerful data structures for data analysis and statistics

Added to portage

2026-10-23

passt - 2026.10.02
Ebuild name:

net-misc/passt-2026.10.02

Description

User-mode networking daemons for VMs and namespaces, replacement for Slir

Added to portage

2026-10-23

pixi - 0.83.0-r1
Ebuild name:

dev-util/pixi-0.83.0-r1

Description

A package management and workflow tool

Added to portage

2026-10-23

podman - 5.8.9
Ebuild name:

app-containers/podman-5.8.9

Description

A tool for managing OCI containers and pods with Docker-compatible CLI

Added to portage

2026-10-23

pycargoebuild - 0.17.2
Ebuild name:

app-portage/pycargoebuild-0.17.2

Description

A generator for Rust/Cargo ebuilds written in Python

Added to portage

2026-10-23

pycparser - 3.12
Ebuild name:

dev-python/pycparser-3.12

Description

C parser and AST generator written in Python

Added to portage

2026-10-23

python-openstackclient - 10.5.0
Ebuild name:

dev-python/python-openstackclient-10.5.0

Description

A client for the OpenStack APIs

Added to portage

2026-10-23

qemu - 10.0.14
Ebuild name:

app-emulation/qemu-10.0.14

Description

QEMU + Kernel-based Virtual Machine userland tools

Added to portage

2026-10-23

qemu - 10.2.4
Ebuild name:

app-emulation/qemu-10.2.4

Description

QEMU + Kernel-based Virtual Machine userland tools

Added to portage

2026-10-23

qemu - 11.1.2
Ebuild name:

app-emulation/qemu-11.1.2

Description

QEMU + Kernel-based Virtual Machine userland tools

Added to portage

2026-10-23

qemu-qmp - 0.0.6
Ebuild name:

dev-python/qemu-qmp-0.0.6

Description

QEMU Monitor Protocol library

Added to portage

2026-10-23

qtbase - 6.12.0-r1
Ebuild name:

dev-qt/qtbase-6.12.0-r1

Description

Cross-platform application development framework

Added to portage

2026-10-23

qtdeclarative - 6.12.0-r1
Ebuild name:

dev-qt/qtdeclarative-6.12.0-r1

Description

Qt Declarative (Quick 2)

Added to portage

2026-10-23

semi - 1.14.7_p20251130
Ebuild name:

app-emacs/semi-1.14.7_p20251130

Description

A library to provide MIME feature for GNU Emacs

Added to portage

2026-10-23

soapysdrplay - 0.5.3
Ebuild name:

net-wireless/soapysdrplay-0.5.3

Description

Soapy SDR plugin for SDRPlay

Added to portage

2026-10-23

spidermonkey - 153.5.1
Ebuild name:

dev-lang/spidermonkey-153.5.1

Description

Mozilla's JavaScript engine written in C and C++

Added to portage

2026-10-23

svglib - 2.3.1
Ebuild name:

dev-python/svglib-2.3.1

Description

Pure-Python library for reading and converting SVG

Added to portage

2026-10-23

syncthing - 2.1.7
Ebuild name:

net-p2p/syncthing-2.1.7

Description

Open Source Continuous File Synchronization

Added to portage

2026-10-23

timescaledb - 2.31.0
Ebuild name:

dev-db/timescaledb-2.31.0

Description

Open-source time-series SQL database

Added to portage

2026-10-23

tzlocal - 5.4.5
Ebuild name:

dev-python/tzlocal-5.4.5

Description

tzinfo object for the local timezone

Added to portage

2026-10-23

unicode-segmentation-rs - 1.0.0
Ebuild name:

dev-python/unicode-segmentation-rs-1.0.0

Description

Unicode segmentation and width for Python using Rust

Added to portage

2026-10-23

virtualenv - 21.14.13
Ebuild name:

dev-python/virtualenv-21.14.13

Description

Virtual Python Environment builder

Added to portage

2026-10-23

wanderlust - 2.15.9_p20251029
Ebuild name:

app-emacs/wanderlust-2.15.9_p20251029

Description

Yet Another Message Interface on Emacsen

Added to portage

2026-10-23

xmlgraphics-commons - 2.12
Ebuild name:

dev-java/xmlgraphics-commons-2.12

Description

XML Graphics Commons

Added to portage

2026-10-23

xvfbwrapper - 0.2.36
Ebuild name:

dev-python/xvfbwrapper-0.2.36

Description

Python wrapper for running a display inside X virtual framebuffer

Added to portage

2026-10-23

rdf newsfeed | rss newsfeed | Atom newsfeed
Copyright 2004-2025 Sascha Nitsch Unternehmensberatung GmbH
- Copyright and legal notices -
Time to create this page: 22.3 ms