from small one page howto to huge articles all in one place
 

search text in:




Other .linuxhowtos.org sites: www.linuxhowtos.org
toolsntoys.linuxhowtos.org



Last additions:
How to make X listen on port 6000

How to make X listen on port 6000

words:

34

views:

39553

userrating:

average rating: 1.5 (4 votes) (1=very good 6=terrible)


May, 25th 2007:
April, 26th 2007:
Apr, 10th. 2007:
Druckversion . pdf icon
You are here: Portage


Details of games-util/wit:

Description: command line tools to manipulate Wii/GameCube ISO images and WBFS containers
Homepage:
https://wit.wiimm.de/

available versions:

releasesalphaamd64armhppaia64mipsppcppc64ppc macoss390shsparcx86USE-Flagsdependenciesebuild warnings
wit-2.40a -+----------++fuse
+zlib
app-arch/bzip2
sys-libs/zlib USE-Flag: zlib
show
show
Legend:
+ stable
~ testing
- not available
some ebuild warning depend on specific use-flags or architectures, all ebuild-warnings are shown.

Known bugs:
bug IDcomponentassigned tostatusdescriptionlast change
444678FreeBSDbsdUNCONFIRMEDsys-devel/gcc-4.7.2 -- build fails on G/FBSD 9.1 with USE=cxx2012-12-07 11:06:19
386037DevelopmentqtUNCONFIRMEDapp-crypt/qca-ossl-2.0.0_beta3-r2: fails to build x86-abi with portage-multilib enabled2013-01-12 22:18:36
420095Applicationsrobbat2UNCONFIRMEDsci-mathematics/glpk-4.47 USE=mysql with dev-db/mariadb:5.5 - /usr/include/mysql/m_string.h:177:14: 2012-12-12 19:59:28
428588Applicationsc1pherUNCONFIRMEDnet-dns/djbdns: replace setup scripts with documentation2012-07-31 00:05:08
450254ApplicationsyamakuzureUNCONFIRMED[seden overlay] dev-util/eclipse-sdk-3.7.1-r7: slot conflicts with dev-java/swt-3.7.2:3.72013-01-09 07:27:10
453918ApplicationsxmwUNCONFIRMED=app-admin/conkyforecast-2.24 with conky-1.9.0-r1 - `conkyForecastWU --datatype=WI` - conkyForecastW2013-02-10 16:49:05
432954EbuildsxmwUNCONFIRMEDx11-misc/simpleswitcher - (new ebuild) simple EWMH window switcher2012-08-28 14:33:26
440182ApplicationsxfceUNCONFIRMEDxfce-extra/xfce4-mixer-4.10.0 panel plugin doesn't play nice with pulseaudio2012-10-30 07:12:10
415345UnspecifiedxfceUNCONFIRMEDxfce-base/xfce4-session with 2 nvidia displays and 1 intel display does not initialize the backgroun2012-05-10 15:45:30
416919ApplicationsxfceUNCONFIRMEDxfce-base/xfce4-session causes X to crash on login with external monitor2012-05-23 13:59:46
457588ApplicationsxboxUNCONFIRMEDmedia-tv/xbmc-11.0 with a PaX kernel - xbmc.bin: LLVM ERROR: Allocation failed when allocating new m2013-02-15 15:39:36
449508EbuildsxboxUNCONFIRMEDmedia-tv/xbmc-12.0_rc2 with media-video/libav-0.8.4 - configure: error: You need either libswresampl2013-01-19 19:49:11
457528Applicationsx11UNCONFIRMED[x11 overlay] x11-libs/xpyb-9999 with python3 - checking for python include dir... File ""2013-02-15 15:34:34
409015DevelopmentxarthisiusUNCONFIRMEDdev-util/intel-ocl-sdk: libOpenCL.so uses incompatible SONAME without SOVERSION2012-10-02 16:31:38
456682Applicationsx11UNCONFIRMEDx11-base/xorg-server-1.13.2 with x11-drivers/xf86-video-nouveau-1.0.6 crashes when displaying larger2013-02-12 10:53:49
450664Applicationsx11UNCONFIRMEDapp-emulation/wine-1.4.1 with >=x11-base/xorg-server-1.11 - mouse behaves erratically2013-01-08 04:22:22
447306Applicationsx11UNCONFIRMEDx11-base/xorg-server-1.13.0-r1 with x11-drivers/xf86-video-intel-2.20.13 - rapid flickering of rando2013-02-05 03:24:34
446034Applicationsx11UNCONFIRMEDx11-drivers/xf86-video-intel-2.20.14 causes high cpu time consumption with X server2012-12-05 14:30:46
445158Libraryx11UNCONFIRMEDx11-drivers/ati-drivers-12.11_beta with x11-base/xorg-server-1.13.0-r1 - segmentation fault in X2012-12-31 15:41:10
445590Libraryx11UNCONFIRMEDmedia-libs/mesa-9.0[g3dvl,vdpau]: Segmentation fault at surface.c:366 with media-video/mplayer2012-12-08 16:33:09
444964Applicationsx11UNCONFIRMEDx11-drivers/xf86-video-ati-7.0.0 with x11-base/xorg-server-1.13 - second X server fails to start on 2012-12-15 18:49:10
444442Applicationsx11UNCONFIRMEDx11-drivers/xf86-video-sis with xorg-server-1.13.0-r1 - X segfaults at startup2012-11-25 11:46:37
441666Unspecifiedx11UNCONFIRMEDmedia-libs/mesa: Install symlinks with splitdebug2012-11-04 00:12:13
437590Libraryx11UNCONFIRMEDmedia-libs/mesa-9.0_pre20120918: libGL error: failed to load driver: nouveau with a ATI graphic cont2012-10-24 20:57:35
430000Applicationsx11UNCONFIRMED>=x11-drivers/ati-drivers-12.6 incompatible with >=x11-drivers/xf86-video-intel-2.20.32013-02-19 19:10:05
426736Applicationsx11UNCONFIRMEDx11-base/xorg-server segfaults at startup with x11-drivers/xf86-video-ati-6.14.4-r12012-07-18 21:13:12
405707Applicationsx11UNCONFIRMED=x11-apps/xdpyinfo-1.3.0 automagic dependency with x11-libs/libXinerama2012-02-27 00:04:12
403013Applicationsx11UNCONFIRMEDmedia-libs/mesa-7.11.2 fails to build with sys-devel/llvm-99992012-02-11 03:45:34
401523Applicationsx11UNCONFIRMEDx11-apps/xdm-1.1.11: does not start from within a chrooted environment if LiveDVD was booted with no2012-01-31 19:37:14
392767Ebuildsx11UNCONFIRMEDmedia-libs/mesa: Bad string substitution in mesa-7.11.2.ebuild (when doing a prefix build with 'dri'2011-12-04 13:02:37
379827Ebuildsx11UNCONFIRMEDx11-base/xorg-server Patch for Hotkey Release Layout Switching (unofficial solution to bug on freed2012-06-06 06:40:18
455080Core systemwschlichUNCONFIRMEDsys-process/fcron-3.1.1 - Files were moved without updating default selinux file context policies, p2013-02-02 17:38:34
420939ApplicationswltUNCONFIRMEDFirebird-2.5.1.26351.0 with use xinetd implies superclassic patch and cannot build/install fb_inet_s2012-06-13 07:50:17
390429ApplicationswltUNCONFIRMEDdev-db/firebird-2.0.3.12981.0-r6: buffer overflow with kernel 3.0.62012-06-02 07:33:59
434924EbuildswilliamhUNCONFIRMEDdev-lang/go - static libraries in /usr/lib/go/pkg* with older mtimes than /usr/lib/go/src causes use2012-09-14 13:35:30
444368Applicationsweb-appsUNCONFIRMEDwww-apps/lxr fails with current dev-db/mysql. Bump version to 1.0.0?2012-11-23 16:04:59
443598Ebuildsweb-appsUNCONFIRMEDwww-apps/egroupware - Allow it to be build with PHP 5.4, it currently depends on php:5.3 through sql2013-02-16 21:35:19
438086Applicationsweb-appsUNCONFIRMEDwww-apps/gallery-2.3.1 - "Begin Installation" fails with "The requested URL /gallery/install/
<
2012-10-12 16:43:46
427348ApplicationsvoyageurUNCONFIRMED=dev-db/sqlite-3.7.13 fails test with clang-3.1-r42012-07-21 14:07:01
427350ApplicationsvoyageurUNCONFIRMED=dev-lang/perl-5.16.0 fails tests with clang-3.1-r42012-07-21 14:07:00
427352ApplicationsvoyageurUNCONFIRMED=dev-libs/klibc-1.5.25 fails to build with clang-3.1-r42012-07-21 14:07:01
427808EbuildsvoyageurUNCONFIRMEDx11-base/xorg-server-1.12.3 crashing at start-up when compiled with sys-devel/clang2012-12-31 12:32:19
434928ApplicationsvoyageurUNCONFIRMEDx11-drivers/xf86-video-intel-2.20.7 USE=sna crashes when built with clang2012-12-31 12:32:53
439676UnspecifiedvoyageurUNCONFIRMEDapp-i18n/ibus-qt-1.3.1 with clang 3.1 - qibusserializable.h:94:59: error: non-const lvalue reference2012-10-26 16:33:42
441778DevelopmentvoyageurUNCONFIRMEDsys-devel/clang-3.1 ICE's when a type with multiple copy-ctors is in a union2012-11-04 23:13:59
443556EbuildsvoyageurUNCONFIRMEDsys-devel/clang-3.1 - Updated ebuild with +python and +doc2012-11-17 09:03:06
458254ApplicationsvoyageurUNCONFIRMEDapp-cdr/cdrtools-3.01_alpha12 with sys-devel/clang-3.2 - sha2.c:1006:2: error: call to 'SHA384Pad' i2013-02-21 02:51:12
458480Core systemvserver-devsUNCONFIRMEDsys-cluster/util-vserver with sys-apps/openrc - conflict in cgroups management2013-02-20 16:30:03
370191Serverweb-appsUNCONFIRMED=www-apps/viewvc-1.1.11 problem with =webapp-config-1.50.182012-02-21 14:00:57
427342ApplicationsvoyageurUNCONFIRMEDdev-libs/apr fails to build with clang-3.1-r42012-12-29 16:58:30
427322Core systemvoyageurUNCONFIRMEDsys-libs/gpm fails to build with clang-3.1-r42012-07-21 14:07:00
427318ApplicationsvoyageurUNCONFIRMEDdev-libs/popt fails tests with clang-3.1-r42012-10-09 15:26:37
427314Core systemvoyageurUNCONFIRMEDsys-apps/sed fails test with clang-3.1-r42012-07-21 14:07:01
427316Core systemvoyageurUNCONFIRMED=sys-apps/findutils-4.5.10-r1 fails tests with clang-3.1-r42012-07-21 14:07:00
427310ApplicationsvoyageurUNCONFIRMED=dev-libs/ppl-0.12.1 fails tests with clang-3.1-r42012-07-25 14:12:12
427304ApplicationsvoyageurUNCONFIRMED=dev-libs/mpfr-3.1.1 fails tests with clang-3.1-r42012-10-08 15:16:38
416691KDEvoyageurUNCONFIRMEDkde-base/nepomuk-4.8.3 fails with undefined references (dragonegg problem)2012-09-28 13:05:52
393389KDEvoyageurUNCONFIRMED[kde overlay] kde-base/kdelibs-9999 fails to compile with sys-devel/dragonegg-3.02012-09-28 13:05:51
393391KDEvoyageurUNCONFIRMED[kde overlay] kde-base/katepart-9999 fails to compile with sys-devel/dragonegg-3.02012-09-28 13:05:52
393489EbuildsvoyageurUNCONFIRMEDapp-office/libreoffice-3.5.0.0 fails to compile with sys-devel/dragonegg-3.02012-09-28 13:05:51
393491UnspecifiedvoyageurUNCONFIRMEDsys-process/procps-3.2.8_p11 crashes (SIGSEGV) when built with sys-devel/dragonegg-3.02012-09-28 13:05:52
393385EbuildsvoyageurUNCONFIRMEDmedia-libs/phonon-vlc-0.4.1 fails to compile with sys-devel/dragonegg-3.02012-09-28 13:05:51
393383EbuildsvoyageurUNCONFIRMEDsys-devel/llvm-3.0 fails to compile with sys-devel/dragonegg-3.02012-09-28 13:05:52
393381EbuildsvoyageurUNCONFIRMEDx11-libs/qt-webkit-4.7.4 fails to compile with sys-devel/dragonegg-3.02012-09-28 13:05:52
393379EbuildsvoyageurUNCONFIRMEDx11-libs/qt-qt3support-4.7.4 fails to compile with sys-devel/dragonegg-3.02012-09-28 13:05:51
393373UnspecifiedvoyageurUNCONFIRMEDx11-libs/qt-gui-4.7.4-r1 fails to compile with sys-devel/dragonegg-3.02012-09-28 13:05:52
393377UnspecifiedvoyageurUNCONFIRMEDx11-libs/pixman-0.24.0 fails to compile with sys-devel/dragonegg-3.02012-09-28 13:05:51
388983EbuildsvmwareUNCONFIRMEDapp-emulation/vmware-modules-238.5 with sys-kernel/hardened-sources-3.0.4-r4 - work/vmci-only/linux/2013-01-18 22:06:24
378705ApplicationsvoipUNCONFIRMEDnet-voip/linphone-3.4.3: sometimes crashes with SIGFPE2012-03-25 10:42:56
430474ApplicationsvoipUNCONFIRMEDnet-voip/ekiga-3.2.7 with sys-devel/gcc-4.7 - ../../../../lib/engine/addressbook/source-impl.h:209:32012-12-14 13:07:23
457564ApplicationsvimUNCONFIRMEDapp-editors/vim-core-7.3.762 fails with ncurses[tinfo]2013-02-14 18:18:53
455276DevelopmentvapierUNCONFIRMEDdev-cpp/gmock-1.6.9 with python3 fails to execute test suite2013-02-05 11:28:28
400585ApplicationsvimUNCONFIRMEDapp-editors/vim-7.3: broken unicode while copy/paste with X PRIMARY and CLIPBOARD2012-01-25 13:56:18
417921ApplicationsvimUNCONFIRMEDapp-editors/vim - bash completion fails with paths containing spaces2012-05-28 11:50:58
456048ServerultrabugUNCONFIRMEDwww-servers/uwsgi-1.4.5 init script race condition if starting multiple uwsgi instances with differe2013-02-07 16:47:54
442706ApplicationsultrabugUNCONFIRMEDapp-admin/rsyslog.service file does not work with newer sys-apps/systemd2012-11-22 08:33:40
424189Core systemudev-bugsUNCONFIRMEDsys-fs/udev-171-r6: all modules are loaded even with rc_coldplug="NO"2013-02-08 17:46:29
399011ApplicationsultrabugUNCONFIRMEDapp-admin/rsyslog-5.8.6 logrotate config not working with systemd service2012-10-29 16:10:27
457570ApplicationstoveUNCONFIRMEDapp-shells/zsh fails to compile with ncurses[tinfo]2013-02-14 19:59:26
453584EbuildstoveUNCONFIRMEDapp-shells/zsh - prompt_gentoo_setup: replace globally declared variables with local variables2013-01-24 09:42:42
437976Toolstools-portageUNCONFIRMEDProblems with "euse --active" from app-portage/gentoolkit-0.3.0.6-r32012-10-11 14:02:48
421287Toolstools-portageUNCONFIRMEDgentoolkit 0.3.0.6 euse -i option causes a lot of no such file or directory with app-admin/eselect-12012-06-20 16:02:59
387213Applicationstools-portageUNCONFIRMEDapp-portage/gentoolkit-0.3.0.4-r4 - revdep-rebuild: replace "requires" with "was linked against"2011-10-18 16:20:34
367203Toolstools-portageUNCONFIRMEDapp-portage/gentoolkit equery d --name-only (as with option b) would be useful2011-05-20 16:39:30
458020Core systemtoolchainUNCONFIRMED[toolchain overlay] sys-libs/glibc-2.6.1 does not compile with up to date gcc and binutils (via cros2013-02-18 04:43:58
448024Core systemtoolchainUNCONFIRMEDdev-libs/cloog-ppl-0.15.10 fails with >=dev-libs/ppl-1.02013-01-07 00:30:36
435110Core systemtoolchainUNCONFIRMEDsys-devel/binutils: ar mishandles 4GB files (causing net-libs/webkit-gtk build to fail with debug fl2013-01-01 20:56:38
433056Core systemtoolchainUNCONFIRMEDsys-devel/gcc-4.7.1 fails to crosscompile with cross-powerpc64-unknown-linux-gnu/gcc-4.6.3: cc1: err2012-10-03 01:27:13
432112Core systemtoolchainUNCONFIRMEDsys-libs/libspe2 with ppc64 requires multilib install2012-09-14 22:21:15
415221Core systemtoolchainUNCONFIRMEDcross-i686-pc-mingw32/gcc-4.5.3-r2 g++ can't link programs with STL2012-06-29 20:29:50
456172ApplicationstommyUNCONFIRMEDdev-vcs/subversion-(1.7.* ?) needs dev-db/sqlite:3 to be compiled with threadsafe2013-02-11 11:20:24
455282LibrarytitanofoldUNCONFIRMEDdev-libs/libpqxx-4.0.1 with python 3.x - TypeError: 'str' does not support the buffer interface2013-02-19 08:19:43
417927ApplicationstexUNCONFIRMEDdev-tex/latexmk - bash completion fails with paths containing spaces2012-05-28 11:51:57
457994LiveCD/DVDtenUNCONFIRMEDlivedvd-amd64-multilib-20121221.iso: kernel panic when booting in kvm with "-cpu host"2013-02-18 02:55:55
379147UnspecifiedtcltkUNCONFIRMEDdev-tcltk/iwidgets-4.0.1-r3 fails to configure with et_EE locale2011-08-15 01:54:59
424637Core systemsystemdUNCONFIRMEDsys-apps/systemd won't work with lvm due to udev and genkernel problems2012-07-07 09:32:46
438464UnspecifiedsysadminUNCONFIRMEDnet-analyzer/nagios-3.3.1: apache-2.4.3 fails to start with Syntax error on line 6 of /etc/apache2/2012-12-14 16:11:32
457100LibrarysysadminUNCONFIRMEDsys-libs/freeipmi please add use flag for --with-dont-check-for-root2013-02-13 19:54:50
455072ServerswegenerUNCONFIRMEDnet-dns/pdns-3.1 with USE="sqlite3" - checking for SQLITE3... configure: error: +Could not find sqli2013-02-02 17:34:19
453396ApplicationsswegenerUNCONFIRMEDnet-irc/irssi with sys-libs/ncurses[tinfo] - .../work/irssi-0.8.15/src/fe-text/terminfo-core.c:281: 2013-02-14 14:13:49
457560ApplicationssoundUNCONFIRMEDmedia-sound/lame-3.99.5 fails with ncurses[tinfo]2013-02-14 18:18:05
458468ApplicationssoundUNCONFIRMEDmedia-sound/easytag-2.1.8-r1 with experimental gtk3 support2013-02-20 15:11:47
454504ApplicationssoundUNCONFIRMED>=media-sound/mpg123-1.14.4 x32 ABI built with wrong LFS alias2013-01-29 14:56:43
450074ApplicationssoundUNCONFIRMEDmedia-sound/fluidsynth - provide init script with package2013-01-04 12:03:17
436528LibrarysoundUNCONFIRMEDmedia-libs/speex: Resampler stops in the middle of run with multiple channels2012-09-29 15:26:02
441038ApplicationssoundUNCONFIRMEDdev-libs/redland-1.0.15 QA Notice: pkg-config files with wrong LDFLAGS detected2012-11-03 16:48:32
443600ApplicationssoundUNCONFIRMEDmedia-libs/libsndfile-1.0.25 - Fails test with SyntaxError: invalid syntax in binheader_writef_check2012-11-17 18:45:12
434528ApplicationssoundUNCONFIRMEDmedia-sound/dagrab fails with buffer overflow detected when using cddb2012-09-10 11:44:45
395817ApplicationssoundUNCONFIRMEDmedia-libs/libsndfile-1.0.25: fails tests with python-32012-01-18 16:03:11
398571LibrarysoundUNCONFIRMEDmedia-sound/id3v2-0.1.12 crashes when tagging mp3 with VBR due to a bug in media-libs/id3lib-3.8.32012-01-18 07:32:41
442544Applicationsshell-toolsUNCONFIRMEDapp-shells/bash-completion-1.3 - No support for XZ compression with Okular.2012-11-11 16:23:59
417945Applicationsshell-toolsUNCONFIRMEDapp-misc/devtodo - bash completion fails with paths containing spaces2012-05-28 12:08:16
417929Applicationsshell-toolsUNCONFIRMEDapp-shells/bash-completion: some builtin completions don't work with spaces2012-05-28 11:52:38
417925Applicationsshell-toolsUNCONFIRMEDapp-shells/gentoo-bashcomp - bash completion fails with paths containing spaces2012-05-28 11:51:25
417717Unspecifiedshell-toolsUNCONFIRMED[Tracker] bash completion files that fail with paths containing spaces2012-05-28 10:15:02
424041ApplicationssgmlUNCONFIRMEDapp-text/sgml-common-0.6.3-r5 fails with automake-1.12 - mkdir -p2012-10-13 18:56:21
457786SELinuxselinuxUNCONFIRMEDpolicycoreutils: runscript_selinux.so broken with USE"-pam" (2.1.10/13)2013-02-16 03:06:07
454478SELinuxselinuxUNCONFIRMEDsys-apps/busybox-1.20.2 fails to merge on selinux profile with USE="static"2013-02-17 09:37:40
454254Librarysci-mathematicsUNCONFIRMEDdev-python/cvxopt with dev-util/pkgconfig-0.28 - ?2013-02-11 19:55:23
392349VulnerabilitiessecurityUNCONFIRMEDsys-devel/gdb Loads untrusted files with possible arbitrary code execution (CVE-2011-4355)2011-12-30 07:19:51
445824Applicationssci-geosciencesUNCONFIRMEDsci-libs/shapelib-1.3.0-r1 with perl-gcpan/DBD-XBase - file collision in /usr/bin/dbfdump2012-12-04 15:31:13
455118Librarysci-geosciencesUNCONFIRMEDsci-libs/geos-3.3.7[php] does build fine with php-5.4.8[-threads]2013-02-04 02:29:24
421325Applicationssci-geosciencesUNCONFIRMEDsci-geosciences/osm2pgsql-20100413 with sci-libs/geos-3.3.3 - In function ‘char* get_wkt_simple(osmN2012-10-10 14:53:15
447532Applicationssci-chemistryUNCONFIRMEDsci-chemistry/avogadro segmentation fault with icc-built openbabel2012-12-18 16:45:45
381759Ebuildssci-geosciencesUNCONFIRMEDsci-geosciences/grass-6.4.1 wxwidgets GUI does not start with Python32013-01-24 22:56:15
368473Applicationssci-biologyUNCONFIRMEDsci-biology/hmmer-3.0 fails to build with "mpi.c:27:23: error: impl_dummy.: No such file or director2011-06-21 09:31:43
450886DevelopmentsciUNCONFIRMEDdev-python/numpy-1.6.2 with dev-lang/icc - blas_*_info: libraries mkl,vml,guide not found in [libd2013-01-08 14:09:21
443490ApplicationssciUNCONFIRMEDsci-misc/boinc - upstream switched to git2013-01-27 10:35:55
436100LibrarysciUNCONFIRMEDsci-libs/scipy 0.9.0-r1 with media-libs/qhull-2012.1-r1 - scipy/spatial/qhull.c:206:25: fatal error:2013-02-03 13:03:23
433647ApplicationssciUNCONFIRMEDsci-libs/netcdf-4.1.3 fails with -l-L/usr/lib/gcc/x86_64-pc...2012-10-08 19:14:17
424461EbuildssciUNCONFIRMED[science overlay] app-portage/g-octave-9999 fails running with ImportError: cannot import name Confi2012-07-02 10:57:20
372995LibrarysciUNCONFIRMED[sci-overlay] sci-misc/salome-yacs-5.1.4 fails to build with swig 2.0.22011-07-08 18:42:44
427346ApplicationsschemeUNCONFIRMED=dev-scheme/guile-1.8.8-r1 fails to build with clang-3.1-r42013-02-02 12:44:30
388073ApplicationssbriesenUNCONFIRMEDmedia-gfx/iscan scan area selection selection problem with >=gcc-4.52012-08-26 02:58:08
421665SandboxsandboxUNCONFIRMEDsys-apps/busybox-1.20.1 fails with sandboxing enabled2012-11-26 17:24:29
399123ApplicationssambaUNCONFIRMEDdev-db/ctdb requires sys-libs/tdb built with USE=tools2012-01-17 04:15:51
366675EbuildsrubyUNCONFIRMEDdev-lang/ruby-1.9.2 only builds with -fPIC2012-04-30 08:28:50
417709UnspecifiedrubyUNCONFIRMEDdev-ruby/ruby-opengl-0.60.1-r2 fails configure with ruby1.9 - cannot load such file -- mkrf2012-05-27 06:43:59
452124Core systemrobbat2UNCONFIRMEDsys-process/audit-2.2.2 with sys-devel/automake-1.13.1 - configure.ac:34: error: 'AM_CONFIG_HEADER':2013-01-15 17:29:39
451478Core systemrobbat2UNCONFIRMEDsys-fs/lvm2 - /etc/init.d/lvm should support multiple volume groups - Command failed with status cod2013-01-31 02:20:00
437718Core systemrobbat2UNCONFIRMEDsys-fs/lvm2-2.02.97 /etc/init.d/lvm-monitoring slows down boot and shutdown on systems with multiple2012-12-23 09:48:04
421741Developmentrobbat2UNCONFIRMEDdev-vcs/git-1.7.3.4-r1: test t7508-status.sh failed with FEATURES="sandbox -userpriv"2012-06-19 15:11:50
409011Applicationsrobbat2UNCONFIRMEDapp-portage/g-cpan-0.16.4 'g-cpan -u' fails with Invalid ebuild name: /var/lib/cpan/perl-gcpan/Best/2012-03-23 07:38:06
402925Ebuildsrobbat2UNCONFIRMEDdev-libs/yaz-3.0.50 with dev-libs/libgpg-error-1.10-r1[-static-libs] - libtool: grep: /usr/lib/libgp2012-02-10 18:05:02
405265Developmentrobbat2UNCONFIRMED"git svn clone/fetch/rebase" fail with dev-vcs/subversion[webdav-serf]2012-03-15 13:31:46
395839Applicationsrobbat2UNCONFIRMEDnet-misc/adjtimex-1.29 is not compatible with baselayout-22011-12-26 10:07:56
376767Ebuildsrobbat2UNCONFIRMEDapp-portage/g-cpan-0.16.4 creates non-existent categories file without newline (inconsistent)2011-08-03 01:16:53
376169Applicationsrobbat2UNCONFIRMEDapp-backup/amanda-3.2.[12] EXTRA_ECONF=--with-dump-honor-nodump - /usr/sbin/dump 9Sf /dev/null /dev/2013-01-13 19:09:47
370803NetbootreleaseUNCONFIRMEDgentoo.igz has very limited set of NIC drivers - this breaks netboot for machines without e1000 or 2011-06-22 18:25:31
458186ApplicationsreavertmUNCONFIRMED=dev-util/ddd-3.3.12-r3: fails to compile with ncurses[tinfo]2013-02-19 20:20:58
429646GamesreavertmUNCONFIRMEDdev-games/openscenegraph-3.0.1 with sys-devel/clang-3.1 - error: cannot initialize a parameter of ty2012-08-04 00:29:11
373891EbuildsramerethUNCONFIRMEDnet-misc/stunnel build fails: #error OpenSSL library compiled without thread support2012-12-25 04:27:10
434236DevelopmentrafaelmartinsUNCONFIRMEDdev-lua/luafilesystem-1.5.0 with dev-lang/lua-5.2.1: src/lfs.c:779:30: error: array type has incompl2013-02-03 13:08:19
435266EbuildsrafaelmartinsUNCONFIRMEDdev-vcs/mercurial-server-1.2 refresh-auth fails with a syntax error2012-09-17 11:51:10
403893Serverqmail-bugsUNCONFIRMEDmail-mta/netqmail-1.06 - qmail-pop3sd doesn't run on amd64 with default config2012-02-15 13:49:13
379033Serverqmail-bugsUNCONFIRMEDmail-filter/qmail-scanner: Causing problems with RBL-checks activated spamassassin on target when se2011-08-14 02:01:12
456814EbuildsqemuUNCONFIRMEDapp-emulation/qemu-1.2.2-r3[ncurses] fails configure with sys-libs/ncurses[tinfo]2013-02-14 14:14:03
440214EbuildsqaUNCONFIRMED[tracker] packages with emerge messages that can be improved by checking the previous installed vers2013-02-14 19:45:48
380499EbuildsqaUNCONFIRMED[TRACKER] Missing dependencies, found with autodep util2012-09-08 12:54:42
442272LibrarypythonUNCONFIRMEDdev-python/pylint-0.26.0 merges with python 2.6 but not 2.72012-12-05 23:58:15
438576DevelopmentpythonUNCONFIRMEDdev-python/pyenchant-1.6.5 doesn't build with Python3.32012-12-09 14:13:26
407681ApplicationspythonUNCONFIRMEDmedia-sound/quodlibet-2.3.92-r1 segfaults when dev-lang/python-2.7.2-r3 is compiled with the hardene2012-10-06 17:14:29
408147UnspecifiedpythonUNCONFIRMEDapp-admin/eselect-python with FEATURES="nomac nodoc" - eselect python does not set man page (...)2012-03-14 19:23:10
402027EbuildspythonUNCONFIRMEDdev-python/django-1.3.1 with dev-python/psycopg-2.4.2 fails app/project tests2012-04-28 20:35:29
399139EbuildspythonUNCONFIRMEDapp-admin/eselect-python - Can't select python without man page2012-01-17 14:56:48
381809EbuildspythonUNCONFIRMEDgames-simulation/singularity-0.30c fails to run with Python32012-12-29 15:00:48
386163Core systempythonUNCONFIRMEDEmerging app-admin/eselect-python-20100321 fails with 2011-10-09 11:37:24
451668ApplicationsproaudioUNCONFIRMEDmedia-sound/lash-0.5.4-r1 with sys-devel/gcc-4.7.2 - lash.c:203:19: error: storage size of ‘max_fds’2013-02-03 22:16:12
414447LibraryproaudioUNCONFIRMEDmedia-libs/lv2core-3.0 (with python 3) - ./waf: SyntaxError: invalid syntax2012-12-08 20:52:16
372525ApplicationsproaudioUNCONFIRMEDmedia-sound/jack-audio-connection-kit-0.120.2 crashes with buffer overflow detected in jack_alsa.so2011-10-10 00:02:33
436500LibraryprintingUNCONFIRMEDapp-text/ghostscript-gpl with media-libs/freetype-2.4.10-r1 USE=infinality - ghostscript based appli2013-02-16 21:14:40
434440PrintingprintingUNCONFIRMEDnet-print/cups-1.6.1 should pull in virtual/libusb:1 with USE=usb instead of libusb:02012-09-09 16:02:09
420641PrintingprintingUNCONFIRMEDapp-text/ghostscript-gpl-9.05-r1 - libgs.so gets built with _start etc2012-10-24 09:21:47
420623PrintingprintingUNCONFIRMEDnet-print/foo2zjs-99999999 fails emerge with permission denied, access attempt outside the sandbox2013-01-27 23:07:16
408855PrintingprintingUNCONFIRMEDapp-text/acroread-9.4.7 with www-client/firefox-10.0.1-r1 - after closing pdf loaded in tab acroread2012-03-20 14:30:11
419787PrintingprintingUNCONFIRMEDnet-print/foo2zjs-99999999 with app-text/ghostscript-gpl-9.05-r1 fails tests2012-10-09 09:27:44
451488Prefix SupportprefixUNCONFIRMEDbootstrap tar-1.26 fails with glibc 2.16 (no gets)2013-02-03 08:06:36
447556Mac OSXprefixUNCONFIRMEDdev-python/virtualenv-1.8.4 emerge failed with error virtualenv-3.3 already exists2013-01-19 18:48:58
427616Prefix SupportprefixUNCONFIRMEDdev-lisp/sbcl-1.0.55-r1 fails to install on OS X (with FEATURES=test)2012-10-22 18:12:45
425222Prefix SupportprefixUNCONFIRMEDopenexr/openexr-1.7.0-r1.ebuild with support for prefix2012-08-20 19:34:56
416147Prefix SupportprefixUNCONFIRMEDeix-0.25.4 fails to install with chown: invalid user: ‘portage:portage’2012-05-22 16:31:08
400843Prefix SupportprefixUNCONFIRMEDdev-python/pygtk-2.24.0-r2 fails to build on OS 10.7 with numerous errors2012-07-13 10:10:03
390669Prefix SupportprefixUNCONFIRMEDdev-lang/ocaml-3.12.0 emerge fails with ocamlopt useflag2011-11-29 19:27:40
384581Mac OSXprefixUNCONFIRMEDapp-editors/emacs-23.3-r2: emerge failed with error unexec: my_endbss_static is not in section __bss2011-10-31 03:04:33
409961Applicationspolynomial-cUNCONFIRMEDapp-emulation/virtualbox-4.1.10[vboxwebsrv] with net-libs/gsoap-2.8.8[gnutls] - /usr/lib64/libgsoaps2012-03-28 12:53:46
447356Unspecifiedpolynomial-cUNCONFIRMEDapp-emulation/virtualbox-modules-4.2.4 with kernel 3.7 - modprobe: FATAL: Error inserting vboxdrv (/2013-02-14 10:04:16
447302Applicationspolynomial-cUNCONFIRMEDapp-emulation/virtualbox-modules-4.2.4 with gentoo-sources-3.7.0 - Header files were moved and re-or2013-02-03 19:32:07
438164Unspecifiedpolynomial-cUNCONFIRMEDapp-emulation/virtualbox - EQ overflow in X server when virtualbox starts with Wacom tablet's mouse 2012-10-14 18:22:06
426898Applicationspolynomial-cUNCONFIRMED=app-emulation/virtualbox-modules-4.1.12 with sys-kernel/vanilla-sources-3.4.5 - src_test(): .../wor2012-11-13 17:18:09
375565Serverpolynomial-cUNCONFIRMEDnet-ftp/pure-ftpd init script fails with UPLOADSCRIPT set2011-09-06 09:49:17
380301Applicationspolynomial-cUNCONFIRMEDapp-emulation/virtualbox-4.1.2 crashes when compiling with -O2 option2012-02-01 09:06:12
456820Developmentphp-bugsUNCONFIRMEDdev-lang/php-5.3.21-r2 fails to compile with USE="ssl"2013-02-12 08:54:30
435742Applicationsphp-bugsUNCONFIRMEDdev-php/igbinary-1.1.1-r1 with dev-lang/php[threads] compilation fails with: apc_serializer.h:57:5: 2012-09-21 16:43:14
423167Developmentphp-bugsUNCONFIRMEDdev-php/pecl-http-1.7.4 fails at runtime with "undefined symbol: gcry_control" when using net-libs/g2012-08-01 12:00:35
392719Developmentphp-bugsUNCONFIRMEDdev-lang/php does not compile with alternative ROOT2012-03-02 12:58:20
440142LibraryperlUNCONFIRMEDdev-perl/XML-LibXML - Segmentation fault when removing child nodes with entity or namespace subnodes2012-10-29 19:19:42
432944UnspecifiedperlUNCONFIRMEDperl-gcpan/Math-GSL-0.27 wants to install perl-gcpan/Test-Tester-0.108 which conflics with installed2012-09-17 07:17:25
420033DevelopmentperlUNCONFIRMEDdev-perl/MooseX-Types-DateTimeX fails tests with MooseX-Types-DateTime-ButMaintained-0.140.02012-06-07 09:09:11
416455ServerperlUNCONFIRMEDmail-filter/spamassassin-3.3.2-r1 - child process [3695] exited or timed out without signaling produ2012-05-27 12:05:55
408151LibraryperlUNCONFIRMEDdev-perl/Cairo-1.90.0 with dev-lang/perl-5.14.2 - Failed 1/8 test programs. 6/270 subtests failed.2012-04-03 19:32:36
384137EbuildsperlUNCONFIRMEDdev-perl/Inline-0.480.0: fails tests with parallel make2011-09-27 16:26:48
381561DevelopmentperlUNCONFIRMEDdev-perl/DateTime-0.700.0 does not work with dev-lang/perl-5.14.1-r12011-09-03 16:16:11
374149DevelopmentperlUNCONFIRMEDMoose-2.1.0 conflicts with all existent versions of File-ChangeNotify, MooseX-Params-Validate, and M2011-07-10 03:47:03
452608ApplicationspdaUNCONFIRMEDapp-pda/gtkpod-2.1.3-r1 with dev-util/anjuta-3.4.3 - In function ‘on_layout_lock_toggle’: anjuta-act2013-02-01 22:49:13
453002LibrarypatrickUNCONFIRMEDsci-libs/openfoam-2.1.1 - Patches to make paraFoam work with Paraview 3.98.02013-02-18 18:55:08
432910ApplicationspatrickUNCONFIRMEDapache2-2.2.22 mod_proxy_ftp segfaults on IPv4 requests to hosts with DNS AAAA records2013-02-16 14:06:24
430274EbuildspatrickUNCONFIRMEDwww-servers/apache-2.2.22-r1: modules aren't compiled with -fPIC2013-02-16 13:34:26
405151ApplicationspatrickUNCONFIRMEDapp-emulation/virtualbox-guest-additions-4.1.4-r1: Failure to build with 3.2 kernel2012-04-02 07:44:24
458508EbuildspachoUNCONFIRMEDsys-power/bbswitch kernel 3.8 compatibility hack2013-02-20 22:50:36
458156OpenRCopenrcUNCONFIRMEDsys-apps/openrc-0.11.8 creates /etc/runlevels/sysinit/udev with wrong target when ROOT is not /2013-02-19 09:30:05
455912OpenRCopenrcUNCONFIRMEDsys-apps/openrc-0.11.8 with sys-libs/ncurses[tinfo] - ../libeinfo/libeinfo.so: undefined reference t2013-02-14 14:13:57
452776OpenRCopenrcUNCONFIRMEDsys-apps/openrc-0.11.*: system fails to shutdown with automount+nfs2013-02-16 13:44:26
425126OpenRCopenrcUNCONFIRMEDsys-apps/openrc-0.10.5 brings up br0 interface with nonfunctional route2012-07-07 00:20:16
442594OpenRCopenrcUNCONFIRMEDsys-apps/openrc-0.11.4: ifconfig module doesn't support ipv6 routes without explicit prefix2012-12-25 09:18:25
402347OpenRCopenrcUNCONFIRMEDnet.wlan0 fails to auto-start with 2013-02-03 08:30:09
383493baselayoutopenrcUNCONFIRMEDsys-apps/openrc-0.9.3-r1, net-firewall/ipset, net-firewall/iptables: Circular Dependency with custom2011-09-20 13:06:03
375597OpenRCopenrcUNCONFIRMEDsys-apps/openrc: netmount hangs with dead remotes2012-11-18 21:55:02
367793OpenRCopenrcUNCONFIRMED[TRACKER] packages with scripts that are not openrc compatible2011-12-12 05:30:39
369925OpenRCopenrcUNCONFIRMED/etc/conf.d/net - Setting associate_timeout_ does not have any effect with net-wireless/wpa_s2013-01-01 17:01:05
456980ApplicationsopenofficeUNCONFIRMEDapp-office/libreoffice-4.0.0.3 - inserting movie or sound in impress fails with "The format of the s2013-02-13 19:08:21
458274ApplicationsnirbheekUNCONFIRMEDnet-misc/networkmanager-0.9.6.4 does not save settings for wired connection with 802.1x authenticati2013-02-21 08:24:51
449104GNOMEopenofficeUNCONFIRMEDThe variable OOO_FORCE_DESKTOP=gnome don't work anymore with Libreoffice and Openbox2012-12-30 16:53:23
448764ApplicationsopenofficeUNCONFIRMEDapp-office/libreoffice-3.6.4.3 fails with dev-libs/boost-1.52.0-r5 (bug 425356 strikes again!)2012-12-27 05:37:52
456024ApplicationsnikoliUNCONFIRMEDmedia-sound/clementine 1.1.1 crashes with 0 size .mood file when moodbar is enabled in the playlist2013-02-07 14:14:11
457562ApplicationsneurogeekUNCONFIRMEDapp-accessibility/speech-tools-2.1-r2 fails with ncurses[tinfo]2013-02-14 18:21:15
428674ApplicationsnetmonUNCONFIRMEDnet-analyzer/ifmetric-0.3 with kernel 3.5 -
NETLINK: Packet too small or truncated! 32!=16!=101
2012-07-30 23:43:53
427146ApplicationsnetmonUNCONFIRMEDnet-analyzer/ntop - Segfaulting with high load netFlow monitoring2012-09-25 17:27:26
396353Prefix SupportnetmonUNCONFIRMEDnet-analyzer/nmap fails with LDFLAGS="-Wl,--as-needed" on sparc64-solaris2013-01-15 17:08:42
449818Applicationsnet-p2pUNCONFIRMEDnet-p2p/deluge-1.3.5 with >=net-libs/rb_libtorrent-0.16 - metadata for torrents added using a magnet2013-01-03 12:09:55
450392Librarynet-p2pUNCONFIRMEDnet-libs/gupnp-igd-0.2.2 fails to build with USE_PYTHON="... 2.7-pypy-1.9"2013-01-05 17:56:48
426912Librarynet-p2pUNCONFIRMEDnet-p2p/deluge unicode casting problems with net-libs/rb_torrent 0.16.x2013-01-26 06:22:29
401681Applicationsnet-p2pUNCONFIRMEDnet-misc/curl-7.24.0 with net-p2p/rtorrent-* leads to 100% CPU load.2013-01-01 14:36:36
424854Ebuildsnet-mailUNCONFIRMEDdev-libs/cyrus-2.1.25-r2: subversion lose support for SASL with DIGEST-MD5 after upgrade cyrus-sasl 2012-07-05 06:54:33
445568Librarynet-mailUNCONFIRMEDmail-mta/postfix with dev-libs/cyrus-sasl-2.1.25-r3 - broken SASL authentication2012-12-20 12:06:09
400609Unspecifiednet-mailUNCONFIRMEDnet-mail/perdition-1.18 - fails to build with errors because of a multi line macro in net-libs/vanes2012-12-04 18:16:40
409897Librarynet-mailUNCONFIRMEDcyrus-sasl-2.1.25-r2 breaks when using GSSAPI with MAXSSF=02012-03-27 19:22:10
449526Applicationsnet-imUNCONFIRMEDnet-im/pidgin-2.10.6 fails to compile with USE="eds" and gnome-extra/evolution-data-server-3.62013-02-12 16:15:52
423801Applicationsnet-imUNCONFIRMEDnet-im/pidgin-2.10.4[gnutls] fails configure with net-libs/gnutls[nettle]2013-02-13 20:41:47
429802Ebuildsnet-imUNCONFIRMEDnet-im/sendxmpp-1.20 with 2012-08-04 16:43:36
447034Applicationsnet-imUNCONFIRMEDnet-im/mcabber-0.10.2 - Doesn't build without USE+="crypt otr" - configure.ac: error: possibly undef2013-02-02 00:21:02
399489Applicationsnet-imUNCONFIRMEDnet-im/pidgin XMPP/SASL authentication fail with >=dev-libs/cyrus-sasl-2.1.252012-02-07 20:53:55
458110Applicationsnet-fsUNCONFIRMEDnet-fs/curlftpfs-0.9.2 fails with special characters in dir names2013-02-19 20:19:03
458024Applicationsnet-fsUNCONFIRMEDnet-nds/rpcbind with sys-libs/uclibc - security.c:23:26: fatal error: rpcsvc/mount.h: No such file o2013-02-20 11:38:41
431252Ebuildsnet-fsUNCONFIRMEDnet-fs/nfs-utils unable to run nfs client only (nfs4), without server support in kernel2012-08-14 12:57:57
414451Ebuildsnet-fsUNCONFIRMEDnet-fs/netatalk-2.2.2 USE=kerberos with app-crypt/heimdal - uams_gss.c:201:37: error: 'gss_nt_servic2012-05-03 16:05:11
402343Servernet-fsUNCONFIRMEDnet-fs/netatalk /etc/init.d/afpd needs avahi-daemon even if called with -nozeroconf2012-04-08 21:14:32
373635Ebuildsnet-dialupUNCONFIRMEDnet-dialup/ppp: add postinst message for break compatibility with dependent packages2011-07-01 01:38:55
384883Applicationsnet-dialupUNCONFIRMEDnet-dialup/ppp: with net-dns/openresolv /etc/ppp/ip-up.d/50-initd.sh stomps /etc/ppp/ip-up.d/40-dns.2011-10-01 02:49:50
425332Ebuildsnet-dialupUNCONFIRMEDnet-dialup/capisuite-0.4.5 doesn't compile with python 3.* as active python interpreter2012-07-09 11:37:10
424892Applicationsnet-dialupUNCONFIRMEDnet-dialup/capisuite-0.4.5-r6 fails to build with automake >= 1.12.12013-01-10 17:40:24
455280ApplicationsmythtvUNCONFIRMEDmedia-tv/mythtv-0.25.2_p20120716: links upon pulseaudio even with USE=-pulseaudio2013-02-03 13:49:02
385513Developmentmysql-bugsUNCONFIRMEDdev-db/mariadb-5.1.50: failed to compile x86-libs with multilib-overlay enabled2011-10-30 04:20:27
371369Applicationsmysql-bugsUNCONFIRMEDmod-auth-mysql-4.3.9: LoadModule statement is wrong (with solution)2012-11-27 19:59:19
370703Applicationsmysql-bugsUNCONFIRMEDdev-db/myodbc-5.1.6 - emerge --config fails: odbcinst: SQLWritePrivateProfileString failed with Gene2011-06-10 02:05:40
417947Applicationsmr_bones_UNCONFIRMEDapp-misc/figlet - bash completion fails with paths containing spaces2012-05-28 12:08:37
451544ApplicationsmozillaUNCONFIRMEDwww-client/firefox-18.0 fails to build without dbus flag2013-01-13 02:21:35
434174ApplicationsmozillaUNCONFIRMEDwww-client/firefox-15.0: Cannot watch youtube without flash after suspend to ram (KDE)2012-09-20 09:38:21
439148LibrarymozillaUNCONFIRMED{www-client/firefox,mail-clientthunderbird}-bin-{15,16},seamonkey-bin-2.13.2 with net-libs/libproxy-2013-01-22 19:39:26
427048ApplicationsmozillaUNCONFIRMEDwww-client/firefox-14.0.1 fails to build with ABI x32 - /usr/include/bits/sysctl.h:19:3: error: #err2013-01-16 13:49:43
391985ApplicationsmlUNCONFIRMEDnet-misc/unison-2.32.52 - /usr/bin/ocamlopt: don't know what to do with /usr/lib64.2012-06-07 08:32:01
455058Applicationsmedia-videoUNCONFIRMEDmedia-video/gxine with dev-lang/spidermonkey-1.8.8 - build fails to find mozjs2013-02-05 11:27:23
450526Applicationsmedia-videoUNCONFIRMEDmedia-video/tovid-0.34_p20120123 - Please rebuild dev-python/pypy:1.9 with the following USE flags e2013-01-07 11:52:42
447746Librarymedia-videoUNCONFIRMED[PATCH] media-libs/mlt-0.8.2 builds with -DARCH_X86_64 even though CHOST=i686-pc-linux-gnu and fails2012-12-24 10:27:50
426248Librarymedia-videoUNCONFIRMEDmedia-libs/libvpx-1.1.0 builds with incorrectly -m64 on x322012-09-25 05:38:06
428416Librarymedia-videoUNCONFIRMEDmedia-video/dirac-1.0.2 with sys-devel/gcc-4.7 (graphite) - ?2012-07-30 03:55:51
414911Applicationsmedia-videoUNCONFIRMEDErrors while reading video-dvd with label contains special characters2012-05-20 15:31:07
409327Applicationsmedia-videoUNCONFIRMEDmedia-video/vlc-2.0.1 crashes when playing dvd with menu (and dvd-CSS)2012-09-19 13:10:13
395801Applicationsmedia-videoUNCONFIRMEDmedia-video/libav-0.8_pre20111222 produces white noise with part of some music files2012-03-08 07:44:03
388849Ebuildsmedia-videoUNCONFIRMEDmedia-video/dirac-1.0.2 fails with gcc-4.5.32011-12-06 17:32:25
378557Librarymedia-videoUNCONFIRMEDmedia-libs/libvpx-0.9.7: Compile failure with debug USE flag - "No rule to make target libvpx_g.so, 2012-09-15 05:01:43
413987Ebuildsmedia-tvUNCONFIRMEDmedia-tv/xawtv with --as-needed drops libm link2012-04-29 18:01:29
377641Applicationsmedia-tvUNCONFIRMEDapp-misc/lirc-0.9.0 doesn't work with most keys in imon_pad2012-04-27 12:09:04
430894Core systemmattmUNCONFIRMEDsys-power/apcupsd-3.14.10-r1[snmp] fails to build with latest net-snmp2013-02-02 23:16:04
413779ApplicationsmatsuuUNCONFIRMEDwww-apps/redmine-1.4.1 without dev-ruby/ruby-net-ldap - ?2012-10-06 16:51:25
458356Ebuildsmaintainer-wantedUNCONFIRMEDdev-db/libodb-oracle - access an Oracle server with ODB (dependency of dev-db/odb)2013-02-19 20:47:53
458376Ebuildsmaintainer-wantedUNCONFIRMEDdev-db/odb-examples - Programming examples for use with ODB (dependency of dev-db/odb)2013-02-20 13:24:27
452572Ebuildsmaintainer-wantedUNCONFIRMEDdev-php/PHP_Invoker - Utility class for invoking callables with a timeout.2013-01-22 16:32:38
443476Ebuildsmaintainer-wantedUNCONFIRMEDapp-admin/reprepro - Tool for creating a Debian APT repository with a pool structure2012-11-16 16:10:46
437960Ebuildsmaintainer-wantedUNCONFIRMEDdev-libs/libdivecomputer-0.2.0 - Library for communication with dive computers from various manufact2012-10-11 13:48:40
435146Ebuildsmaintainer-wantedUNCONFIRMEDsci-electronics/bitscope-chart - a frequency and voltage logger designed for use with the BitScope P2012-09-16 15:52:10
435148Ebuildsmaintainer-wantedUNCONFIRMEDsci-electronics/bitscope-logic - a logic analyzer designed for use with the BitScope PC oscilloscope2012-09-16 15:53:01
436372Ebuildsmaintainer-wantedUNCONFIRMEDdev-ruby/jruby-pageant - Gem for communicating with Pageant agent from JRuby2012-09-27 07:21:29
435604Ebuildsmaintainer-wantedUNCONFIRMEDdev-ruby/trogdoro-el4r - Emacs Lisp Ruby bridge: extend Emacs with Ruby (or Ruby apps with Emacs Lis2012-10-03 17:46:09
435150Ebuildsmaintainer-wantedUNCONFIRMEDsci-electronics/bitscope-meter - a frequency and voltage meter designed for use with the BitScope PC2012-09-16 15:53:47
431804Ebuildsmaintainer-wantedUNCONFIRMEDapp-text/pelican-3.0 - A tool to generate a static blog, with restructured text (or markdown) input 2012-08-18 15:39:10
430862Ebuildsmaintainer-wantedUNCONFIRMEDx11-misc/pdfpc - a presenter console with multi-monitor support for PDF files2012-08-12 20:07:52
427746Ebuildsmaintainer-wantedUNCONFIRMEDdev-python/django-dajax-0.8.4 - Easy to use library to create asynchronous presentation logic with d2012-12-12 12:17:56
427734Ebuildsmaintainer-wantedUNCONFIRMEDNew: dev-python/django-sekizai-0.4.2 - Django Template Blocks with extra functionality2012-12-12 11:51:41
427334Ebuildsmaintainer-wantedUNCONFIRMEDmail-client/mutt-kz - a fork of mutt with added support for net-mail/notmuch2012-08-03 06:29:47
423867Ebuildsmaintainer-wantedUNCONFIRMEDdev-vcs/gync - Synchronize data of desktop applications with Git2012-09-27 07:19:07
420013Ebuildsmaintainer-wantedUNCONFIRMEDnet-dns/ndjbdns - djbdns without daemontools2012-09-17 08:34:43
415375Ebuildsmaintainer-wantedUNCONFIRMEDapp-office/makebeamerinfo - Creates .info file for use with app-office/impressive and dev-tex/latex-2012-05-10 14:51:46
415029Applicationsmaintainer-wantedUNCONFIRMEDapp-misc/doublecmd - Double Commander is a cross platform open source file manager with two panels s2012-08-09 06:24:21
411087Core systemmaintainer-wantedUNCONFIRMEDsys-fs/ddumbfs-1.0.11 - An inline data deduplicating filesystem designed with backup in mind2012-04-07 14:35:41
405945Ebuildsmaintainer-wantedUNCONFIRMEDNew ebuild: app-misc/pycarddav - a simple way of accessing a CardDAV resource, mainly for use with m2012-10-14 18:19:44
403913Gamesmaintainer-wantedUNCONFIRMEDgames-emulation/fs-uae - a multi-platform Amiga emulator based on WinUAE/E-UAE/PUAE, with a focus on2012-02-15 17:27:10
404273Ebuildsmaintainer-wantedUNCONFIRMEDx11-misc/dunst-9999 - (new ebuild) lightweight notification system with the looks of dmenu2012-07-02 10:02:30
401409Ebuildsmaintainer-wantedUNCONFIRMEDsys-auth/oath-toolkit - Toolkit for using one-time password authentication with HOTP/TOTP algorithms2012-02-01 20:03:54
394375Ebuildsmaintainer-wantedUNCONFIRMEDdev-vcs/rhodecode - Mercurial repository browser/management with build in push/pull server and full 2013-01-29 16:31:11
393275Ebuildsmaintainer-wantedUNCONFIRMEDdev-php/phpqrcode-1.1.4 - Generate QR Code 2-dimensional barcode with PHP2011-12-05 20:22:15
383097Ebuildsmaintainer-wantedUNCONFIRMEDsys-kernel/libre-sources with Freedo logo new request2011-09-16 14:42:35
371373Ebuildsmaintainer-wantedUNCONFIRMEDapp-i18n/wordforge-0.8_rc1 - Offline translation and localization program working internally with XL2011-06-13 22:39:51
368053Ebuildsmaintainer-wantedUNCONFIRMEDnew ebuild : net-dns/yaddns - ddns is a small ddns client with multiple ddns server supports and a h2011-05-19 20:48:37
455414Librarymaintainer-neededUNCONFIRMEDdev-libs/libmix-2.05-r6 with clang-3.2 - aes/saferp.c:22:8: error: redefinition of 'expf' as differe2013-02-05 12:13:40
450156Applicationsmaintainer-neededUNCONFIRMEDmedia-gfx/splashutils-1.5.4.4-r2 unable to switch from silent mode to verbose using F2 with the 2nd 2013-01-20 10:25:23
451360Librarymaintainer-neededUNCONFIRMEDsci-libs/opencascade-6.5 with tcl-8.6.0-r1: src/Draw/Draw_Window.cxx:1047:37: error: 'Tcl_Interp' ha2013-02-05 07:49:56
447352Unspecifiedmaintainer-neededUNCONFIRMEDapp-laptop/tp_smapi-0.41 with kernel 3.7 - modprobe: FATAL: Error inserting tp_smapi (/lib/modules/32013-01-02 20:30:53
444135Applicationsmaintainer-neededUNCONFIRMEDapp-misc/gpsdrive-2.11-r3 with boost-1.52.0-r3: /var/tmp/portage/app-misc/gpsdrive-2.11-r3/work/gpsd2013-01-11 19:10:30
437898Core systemmaintainer-neededUNCONFIRMEDnet-wireless/broadcom-sta-5.100.82.112-r2 with gentoo-sources-3.6.x - general protection fault in wl2013-02-03 13:08:44
434926Applicationsmaintainer-neededUNCONFIRMED>=net-im/skype-4.0.0.7 - login failure, stuck at "signing in" with JFS filesystem2013-01-03 19:31:41
434240Developmentmaintainer-neededUNCONFIRMEDdev-util/bam-0.4.0 with dev-lang/lua-5.2.1: src/context.c:34:18: error: ‘LUA_GLOBALSINDEX’ undeclare2012-09-16 10:46:57
427030Applicationsmaintainer-neededUNCONFIRMEDnet-misc/sks version bump (and it should install an init.d script along with a uid/gid)2013-01-05 21:37:02
410033Core systemmaintainer-neededUNCONFIRMEDsys-power/cpufreqd crashes on AC transition or startup with ACPI battery support2012-11-18 12:15:37
400905Applicationsmaintainer-neededUNCONFIRMEDnet-libs/udns please add filter-flags -fpeel-loops used with -03 or -0s2013-02-16 13:22:28
399747Ebuildsmaintainer-neededUNCONFIRMEDnet-wireless/broadcom-sta floods logs with "could not get rate/rssi"2013-02-03 13:03:07
389391Servermaintainer-neededUNCONFIRMEDwww-apache/mod_authnz_external-3.2.6 fails with method checkpassword2013-01-01 19:43:11
375825Applicationsmaintainer-neededUNCONFIRMEDapp-admin/ulogd-2.0.0_beta4 fails to build with +doc USE flag if latex is not installed2012-09-16 09:14:45
433002ApplicationslxnayUNCONFIRMEDnet-libs/libgrss-0.3.0 fails to build without gnome-doc-utils2012-12-19 08:18:58
432110Core systemlu_zeroUNCONFIRMEDsys-libs/libspe2-2.2.80_p95-r1 without dev-vcs/subversion - make: svnversion: Command not found2012-08-21 13:59:13
410631Applicationslu_zeroUNCONFIRMEDx11-drivers/ati-drivers-12.3 DMA bug with intel_iommu2012-05-04 15:26:08
135923Applicationslu_zeroUNCONFIRMEDx11-drivers/ati-drivers: weird image rendering problems with www-client/firefox2012-06-06 13:44:40
449940Core systemldap-bugsUNCONFIRMEDsys-auth/nss_ldap misses entries with nss_connect_policy oneshot2013-01-03 09:05:50
450528Serverldap-bugsUNCONFIRMEDnet-nds/openldap-2.4.30: configure: error: crossing compiling: use --with-yielding_select=yes|no|man2013-01-07 11:32:59
438692Core systemldap-bugsUNCONFIRMEDsys-auth/nss_ldap-265-r1 with sys-libs/glibc-2.16.0 - /bin/login: symbol lookup error: /lib64/libnss2013-01-23 18:05:21
416641Ebuildslang-miscUNCONFIRMEDdev-lang/fpc-2.6.0 configuration files contain paths with ${D}2012-05-21 03:37:35
454868ApplicationslackUNCONFIRMEDx11-wm/fluxbox-? with updated media-libs/glew-1.9.0 - `fbrun` yields error while loading shared libr2013-02-04 17:23:15
454866ApplicationslackUNCONFIRMEDx11-misc/ipager-1.1.0 - Calls imlib_render_image_on_drawable with image being NULL. (Imlib2 Develope2013-01-31 19:30:56
452656ApplicationslackUNCONFIRMEDx11-plugins/screenlets-0.1.2 does not work with python32013-01-18 10:16:15
440614ApplicationslackUNCONFIRMEDnet-dns/openresolv-3.4.1-r1: order of entries is not consistent with resolvconf -u on interface wake2012-10-31 16:01:39
453780Applicationskondor6cUNCONFIRMEDwww-client/elinks-0.12_pre5-r2 USE=javascript with spidermonkey-1.8.5-r1 - elinks freezes on startup2013-02-01 11:12:46
454362Core systemkernel-miscUNCONFIRMEDsys-fs/jfsutils-1.1.15 - Fails to build with +static if sys-apps/util-linux is built without +static2013-01-28 02:04:19
438784Eclasses and Profileskernel-miscUNCONFIRMEDlinux-mod.eclass - kernel modules packages are incompatible with using multiple kernels2012-10-18 14:18:50
454730Core systemkernelUNCONFIRMEDsys-kernel/gentoo-sources-3.6.11-3.7.5 - kexec doesn't work on laptop with i915 gpu2013-02-05 13:48:06
445222Core systemkernelUNCONFIRMEDsys-kernel/vanilla-sources uli526x module incompatible with GART_IOMMU2012-12-11 12:37:18
458402KDEkdeUNCONFIRMEDkde-base/kig-4.10.0 fails to emerge with USE=scripting2013-02-20 05:25:24
457640KDEkdeUNCONFIRMEDkdelibs 4.10.0 fails with giflib-52013-02-17 22:30:10
456026KDEkdeUNCONFIRMEDnet-misc/csync and net-misc/mirall crash with net-libs/neon[kerberos] -2013-02-14 15:48:38
455456LibrarykdeUNCONFIRMEDmedia-libs/phonon-gstreamer fails with gentoo-multilib - /usr/lib64/libphonon.so.4.6.0: could not re2013-02-05 06:18:13
453420KDEkdeUNCONFIRMEDmedia-libs/opengtl with sys-devel/llvm-3.2 fix2013-02-18 15:40:33
449630KDEkdeUNCONFIRMEDkde-base/kdelibs-4.9.4-r1: several *.desktop files are not compliant with XDG standard (missing trai2013-01-01 13:31:13
449742ApplicationskdeUNCONFIRMEDnet-im/ktp-call-ui-0.5.1 does not build with net-libs/telepathy-farstream-0.6.02013-02-19 21:49:10
430938KDEkdeUNCONFIRMEDkde-base/plasma-workspace-4.8.5 fails with parallel build: fatal error: ui_killrunner_config.h: No s2012-10-24 16:55:05
432976KDEkdeUNCONFIRMEDnet-libs/telepathy-logger-qt-0.5.0: fails to build with >=dev-libs/boost-1.50.0-r22013-01-18 10:48:33
433876KDEkdeUNCONFIRMEDkde-base/marble-4.9.0: cannot move globe with mouse2012-09-18 13:46:27
401183KDEkdeUNCONFIRMEDKDE 4.7 and 4.8: no file tooltips in dolphin/konqueror with USE=-semantic-desktop2012-08-03 16:19:43
406047KDEkdeUNCONFIRMEDKDE 4.8.1 compose key doesn't work with Kwrite & Konsole2012-03-23 08:13:36
373923LibraryjsbronderUNCONFIRMEDsys-cluster/openmpi-1.5.3-r1: mpirun hangs or fails with Segmentation faults2012-02-06 19:20:57
434242DevelopmentjohnnyUNCONFIRMEDdev-vcs/monotone-1.0-r3 with dev-lang/lua-5.2.1: src/lua.hh:41:23: error: ‘LUA_GLOBALSINDEX’ was not2013-01-29 06:21:50
457810Core systemjlecUNCONFIRMEDsys-fs/aufs3-3_p20130207 with USE="inotify" and sys-kernel/hardened-sources-3.7.5 doesn't compile - 2013-02-17 09:10:21
446122ApplicationsjlecUNCONFIRMED[science overlay] sci-chemistry/apbs-1.3-r3 with sci-libs/mkl-11.0.0.079 - ../../src/aaa_lib/.libs/l2012-12-12 07:38:17
420393ApplicationsjlecUNCONFIRMEDapp-arch/p7zip-9.20.1-r2 fails to build 7zG/7zFM with "-l" in MAKEOPTS2012-06-09 14:44:20
443116Core systemjerUNCONFIRMEDsys-apps/lsb-release with sys-apps/baselayout-2.2 - /etc/os-release breaks lsb-release2013-01-10 17:47:52
415521ApplicationsjerUNCONFIRMEDwww-client/opera with www-plugins/adobe-flash - opera: Plug-in NNNNNN is not responding. It will be 2012-05-16 03:19:54
456718LibraryjdhoreUNCONFIRMEDmedia-plugins/audacious-plugins-3.3.4 is incompatible with media-video/libav, fails during configure2013-02-11 17:14:50
457636JavajavaUNCONFIRMEDdev-java/icedtea won't build with giflib-52013-02-15 00:51:36
441618JavajavaUNCONFIRMEDdev-java/icedtea-bin-7.2.3.3: should not install libsplashscreen.so with USE=-X2013-01-17 14:25:52
438834JavajavaUNCONFIRMEDdev-java/icedtea-6.1.11.4 fails to build with java.lang.OutOfMemoryError2012-10-18 18:57:31
427932JavajavaUNCONFIRMED[java-overlay] dev-java/j3d-core-1.5.1: compile phase fails with image resolution errors2012-07-24 19:35:50
421077JavajavaUNCONFIRMEDdev-java/icedtea-7.2.2 compilation fails with Unrecognised option: -XX:-PrintVMOptions2012-10-18 16:15:26
401717JavajavaUNCONFIRMEDdev-lang/scala-2.9.1 with USE=binary should not depend on ant2012-05-01 22:32:43
398689EbuildsjavaUNCONFIRMEDRemove dev-java/servletapi replace with java-virtuals/servlet-api2012-09-29 09:01:54
391067JavajavaUNCONFIRMEDicedtea-7.2.0-r1 with javascript requires virtual/jdk:1.62012-09-16 15:08:31
456136Libraryidl0rUNCONFIRMEDnet-dns/bind-tools with dev-libs/openssl-1.0.1c - nslookup: error: [...] /usr/lib64/engines/libgost.2013-02-11 12:12:54
371947CVS/SVN/Gitinfra-bugsUNCONFIRMEDDo not allow commits of packages with no ebuilds (eg. empty directories.)2011-09-25 06:48:23
382719Ebuildsidl0rUNCONFIRMEDmedia-video/nvidia-settings hangs with three connected displays [patch]2012-02-17 05:16:12
454354Applicationsidella4UNCONFIRMEDapp-emulation/xen-tools-4.2.1 - Fails to compile with KeyError: '.text.asm.out/../src/smp.c.68'2013-02-01 21:20:22
443898ServerhwoarangUNCONFIRMED>=net-ftp/vsftpd-3.0.0: 500 OOPS: priv_sock_get_cmd with seccomp_sandbox=YES (default)2012-11-19 10:55:09
406757ApplicationshwoarangUNCONFIRMEDmedia-video/rtmpdump crashes with gnutls[nettle]2012-03-24 09:19:49
397391ApplicationshwoarangUNCONFIRMEDx11-misc/lightdm doesn't work properly with gnome-base/gdm installed.2013-01-22 22:35:59
457728ApplicationshasufellUNCONFIRMEDx11-misc/spacefm fails by opeining files with ö ä ü or pdf file with acroread.2013-02-16 17:18:18
454934GameshasufellUNCONFIRMEDgames-rpg/grimrock-20121222 segfault loading dungeon editor with USE=system-libs2013-02-05 01:39:36
458064ApplicationshaskellUNCONFIRMEDx11-misc/xmobar-0.16 with dev-lang/ghc-6.12.3-r2 - src/Xmobar.hs:170:16: Not in scope: `void'2013-02-18 13:39:06
455576DevelopmenthaskellUNCONFIRMEDdev-haskell/vty with sys-libs/ncurses[tinfo] - /usr/lib64/terminfo-0.3.2.5/ghc-7.6.2/libHSterminfo-02013-02-14 14:13:53
421623DevelopmenthaskellUNCONFIRMEDdev-lang/ghc-7.4.1-r1: unable to compile with portage because it results in a segmentation fault.2012-06-19 16:29:37
426772ApplicationshaskellUNCONFIRMEDx11-wm/xmonad - high wakeup count with GHC 7.4.1-r12012-09-15 08:05:04
456970Applicationshardened-kernelUNCONFIRMEDapp-editors/emacs-24.2 failed to emerge with a segmentation fault on hardened-sources-3.7.4-r12013-02-12 22:17:52
447754Core systemhardened-kernelUNCONFIRMEDsys-kernel/vanilla-sources with sys-devel/gcc-4.6+ creates unbootable kernel images on ia642013-02-21 02:19:12
444892Hardenedhardened-kernelUNCONFIRMEDNetwork failure with >sys-kernel/hardened-sources-3.4.5 tulip driver (DECchip 21140)2013-01-24 14:11:59
390363Core systemhardened-kernelUNCONFIRMEDsys-kernel/hardened-sources-2.6.32-r42/r68/r73 - Problem with support OCFS2 filesystems2011-12-24 02:47:23
457192HardenedhardenedUNCONFIRMEDnet-misc/quagga-0.99.21 with sys-devel/gcc-4.5.3 sometimes gives PAX: terminating task /usr/sbin/osp2013-02-21 02:32:42
456364HardenedhardenedUNCONFIRMEDsys-kernel/hardened-sources-3.7.5 ppc64 xics-common.c fails with "assignment of member 'cause_ipi' i2013-02-10 01:31:44
446850HardenedhardenedUNCONFIRMEDthunderbird-17.0-r2 fails to install with CONFIG_PAX_MPROTECT enabled2012-12-14 17:52:48
443296HardenedhardenedUNCONFIRMEDcrashes lvm&mkfs.xfs on mdraid10 with sys-kernel/hardened-sources > 3.22012-11-15 18:45:28
434922HardenedhardenedUNCONFIRMEDnet-fs/openafs-1.6.1 doesn't built with sys-kernel/hardened-sources with grsecurity/PaX enabled2013-02-10 14:52:43
416415HardenedhardenedUNCONFIRMEDsys-apps/v86d-0.1.10 fails to read EBDA with GRKERNSEC_KMEM=y on some configurations2012-06-11 17:44:30
400951HardenedhardenedUNCONFIRMEDJava does not run properly on non-root with Grsecurity Hardened Gentoo [workstation] level2012-01-26 19:28:36
386647HardenedhardenedUNCONFIRMEDdev-java/jamvm-1.5.4-r1 segfaults with hardened gcc-4.5.3-r1 (any profile), unless -Xnoinlining is s2012-07-11 11:36:26
416587LibraryhannoUNCONFIRMEDmedia-libs/gegl-0.2.0: fails to compile with USE="introspection"2012-11-17 12:46:15
422727ApplicationshannoUNCONFIRMEDapp-emulation/dosemu-1.4.1_pre20091009 - exits with SIGILL2012-06-21 15:43:13
407729LibraryhannoUNCONFIRMEDnet-analyzer/openvas-libraries-4.0.5 fails with gnutls 3.x - work/openvas-libraries-4.0.5/misc/netwo2013-02-04 18:28:58
409943EbuildshannoUNCONFIRMEDmail-mta/courier installs esmtpd with bad permissions2012-06-28 11:34:17
392277ApplicationshannoUNCONFIRMEDmail-mta/courier don't conflict with msmtp/ssmtp2011-12-05 11:33:59
390843ApplicationshannoUNCONFIRMEDnet-mail/mailman-2.1.14 doesn't work with hardened with TPE2011-11-17 16:39:35
392261UnspecifiedhannoUNCONFIRMEDapp-emulation/dosemu -fno-pic causes build failure when using hardened compiler with PIE2012-12-23 17:38:30
381365Core systemhannoUNCONFIRMEDsys-auth/pam_mount uses all virtual memory with app-cdr/k3b-2.0.2-r12013-01-08 13:37:30
373847ApplicationshannoUNCONFIRMEDmedia-gfx/gimp-2.6.11-r1: crash on startup with error GLib-WARNING ignoring no-arg, optional-arg or 2011-10-22 18:15:20
431522ApplicationsgstreamerUNCONFIRMEDmedia-video/flumotion: fails to build with python3* as system interpreter2012-12-28 00:22:54
421829ApplicationsgstreamerUNCONFIRMEDmedia-plugins/gst-plugins-ffmpeg-0.10.13-r1 with ABI=x32 - libswscale/x86/swscale_template.c:998: Er2012-09-11 06:15:09
374043ApplicationsgstreamerUNCONFIRMEDmedia-plugins/gst-plugins-ffmpeg-0.10.11-r1 does not compile on x86 with mstackrealign CFLAG and gcc2011-07-10 10:04:50
371869UnspecifiedgstreamerUNCONFIRMEDgst-plugins-bad-0.10.21: Regression in playback of avi with multiple ac3 audio tracks2011-10-22 06:53:58
365043GNOMEgstreamerUNCONFIRMEDmedia-plugins/gst-plugins-v4l2-0.10.28-r1: v4l2src is not working with ffmpegcolorspace (gst-plugins2011-07-07 12:30:25
457634LibrarygraphicsUNCONFIRMEDmedia-libs/imlib2-1.4.5 with media-libs/giflib-5.0.x - pass NULL a second argument to DGifOpenFileHa2013-02-15 15:41:00
440960ApplicationsgraphicsUNCONFIRMEDmedia-gfx/wings crashes at startup with incorrect version of erl_driver.h2012-11-02 17:02:33
431986ApplicationsgraphicsUNCONFIRMEDmedia-gfx/luminance-hdr-2.3.0 - crash when loading any hdr file if compiled with -march=core22012-08-20 12:08:47
398093DevelopmentgraphicsUNCONFIRMEDsys-devel/gcc-4.6.2 with -march=bdver1 creates broken media-libs/jpeg2012-04-27 15:47:47
385897ApplicationsgraphicsUNCONFIRMEDmedia-gfx/enblend-4.0 fails compilation with use="+image-cache"2011-10-07 00:52:55
451494gpackages - http://packages.gentoo.org/gpackagesUNCONFIRMEDpages on http://packages.gentoo.org with multiple "Homepages:" show no links to them and no license2013-01-25 09:34:32
455134Applicationsgnome-officeUNCONFIRMEDapp=office/gnucash with dev-db/libdbi - "The library "libdbi" installed on your system doesn't corre2013-02-12 19:39:30
453392GNOMEgnomeUNCONFIRMEDgnome-base/gdm-3.6 USE=plymouth prevents the automatic switch to vt7 on startup2013-02-12 09:11:09
454956GNOMEgnomeUNCONFIRMEDgnome-base/orbit-2.14.19-r1 with sys-devel/automake-1.13.1 - test/everything/Makefile.am:81: error: 2013-02-01 06:41:21
451130GNOMEgnomeUNCONFIRMEDcinnamon lock screen does not work with gnome 3.62013-01-15 21:11:27
450748GNOMEgnomeUNCONFIRMEDSegmentation fault with media-sound/rhythmbox-2.972013-01-07 21:31:17
448896EbuildsgnomeUNCONFIRMEDdev-python/pygobject-3.4.2-r1 (and others): py-compile coming from 2012-12-28 19:03:04
448964GNOMEgnomeUNCONFIRMEDgnome-extra/bug-buddy-2.32.0-r2 eds build fails with gnome-extra/evolution-data-server-3.62012-12-27 23:11:40
426676GNOMEgnomeUNCONFIRMEDmail-client/evolution-2.32.3-r1 deleted whole directory with calendars2012-07-21 12:09:48
421107GNOMEgnomeUNCONFIRMEDmedia-libs/cogl-1.10.2[gles2] error with GLchar (tegra2 headers of EGL & GLES1/2)2012-06-14 15:04:50
422695GNOMEgnomeUNCONFIRMEDmail-client/evolution-3.2.3-r1 fails to compile with USE flag clutter2012-06-20 19:07:36
398419New DocumentationgnomeUNCONFIRMEDPlease provide documentation for using pam_ldap.so in combination with sys-auth/pambase[gnome-keyrin2012-07-08 23:26:02
454780Core systemgenkernelUNCONFIRMEDsys-kernel/genkernel-3.4.45 - initramfs unable to switch on real-root on /dev/sdax2013-02-01 22:15:24
446916genkernelgenkernelUNCONFIRMEDsys-kernel/genkernel-3.4.45 produces bad volume names with --dmraid option2012-12-12 01:41:14
444934genkernelgenkernelUNCONFIRMEDsys-kernel/genkernel-3.4.45: no support for iptables target LOG with gentoo-sources-3.5.72012-12-13 12:03:26
444932genkernelgenkernelUNCONFIRMEDsys-kernel/genkernel-3.4.45: no rtc support with newer kernels2013-02-20 03:36:21
439214genkernelgenkernelUNCONFIRMEDsys-kernel/genkernel-3.4.44.2 and sys-fs/mdadm-3.2.3-r2; no auto-detection even with mdadm.conf?2013-01-04 19:27:33
401149genkernelgenkernelUNCONFIRMEDcomputer hangs before shutdown with genkernel config when trying suspend to ram2012-01-28 10:25:48
418463genkernelgenkernelUNCONFIRMEDlinuxrc in genkernel's initramfs does not properly deal with bind mounts2012-07-21 17:31:55
381361genkernelgenkernelUNCONFIRMEDConfigure videocards using vga_switcheroo during boot2012-04-28 00:14:57
389775Core systemgenkernelUNCONFIRMEDsys-kernel/gentoo-sources: install fails with FIRMWARE_IN_KERNEL = y2012-10-27 18:39:39
452352GamesgamesUNCONFIRMEDgames-fps/quake2-icculus uses wrong library name on x86(-32) with 64-bit kernel2013-01-15 15:02:35
449692GamesgamesUNCONFIRMEDmedia-libs/libsdl-1.2.15 with >=x11-base/xorg-server-1.7 - cannot set gamma2013-01-05 21:05:36
451674ApplicationsgamesUNCONFIRMEDgames-strategy/xconq-7.4.1 fails to build with dev-lang/tcl-8.6.02013-01-14 07:03:16
447904GamesgamesUNCONFIRMEDBuild games-rpg/pcgen from source with fewer bundled libraries2012-12-20 05:10:59
424539GamesgamesUNCONFIRMEDgames-fps/qudos: problem with opengl & sdl use flags2012-10-21 12:32:14
429604GamesgamesUNCONFIRMEDgames-puzzle/krosswordpuzzle-0.15.6.2.1259326 fails to configure with KDE 4.92012-12-21 22:55:29
424445GamesgamesUNCONFIRMEDufo-ai-2.4 fails with Com_EParseValue: Illegal color statement '1 .874 .294 1'2012-08-02 20:55:27
406621GamesgamesUNCONFIRMEDgames-board/pioneers better with optional deps2012-03-05 12:53:20
394849GamesgamesUNCONFIRMEDgames-action/shank - A side scrolling beat 'em up with a comic book art style2012-09-23 17:44:45
426952Core systemfreedesktop-bugsUNCONFIRMEDsys-power/pm-utils - Wifi doesn't work after suspend on MacBook Pro with b432012-07-18 17:43:43
457642Applicationsfreedesktop-bugsUNCONFIRMEDapp-misc/tracker-0.14.4 with media-libs/giflib-5 - add NULL as second argument to DGifOpenFileHandle2013-02-15 15:43:43
409583GNOMEfreedesktop-bugsUNCONFIRMEDapp-misc/tracker-9999 fails to compile with sys-devel/gettext-0.182012-04-02 12:35:18
410663Applicationsford_prefectUNCONFIRMEDmedia-sound/pulseaudio - without "flat-volumes = no" in daemon.conf pulseaudio doesn't restore mixer2012-04-04 07:10:48
456264LibraryfontsUNCONFIRMEDmedia-fonts/droid-113-r2 with multiple values in 2013-02-15 20:47:53
435848ApplicationsfloppymUNCONFIRMEDx11-misc/x11vnc-0.9.13 with net-libs/libvncserver-0.9.9 - buffer overflow detected in /usr/lib/libvn2013-01-20 19:18:24
406085ServerfloppymUNCONFIRMEDnet-misc/openswan-2.6.37 with USE +caps fails to find cacert (X.509)2012-04-06 22:44:01
399839EbuildsfauliUNCONFIRMEDapp-admin/tmpwatch reports "Cannot stat file" with --fuser on sufficiently loaded system2012-02-17 15:33:53
446432EbuildsembeddedUNCONFIRMEDx11-drivers/xf86-input-tslib does not work with xorg > 1.112012-12-27 18:11:59
407099Project-specific documentationembeddedUNCONFIRMEDIncorrect mount options and binfmt_misc mask for "Compiling with qemu-user chroot" secion2012-03-06 17:22:43
370063DevelopmentembeddedUNCONFIRMEDsys-devel/crossdev: settings masked via arch profiles are not considered with cross-compilers2012-03-08 21:08:25
432588EbuildselvanorUNCONFIRMEDnet-voip/sflphone-1.0.1-r1 with net-libs/pjsip-1.8.10 (too old): sipaccount.cpp:612:17: error: ‘pjsi2012-08-24 13:48:14
417003ApplicationselvanorUNCONFIRMEDnet-voip/sflphone can be build without pulseaudio2012-11-15 01:07:54
435168EbuildsdotnetUNCONFIRMEDdev-lang/mono-2.10.9-r2 merge fails with configure error2012-10-04 18:38:09
449512Third-Party ToolsdolsenUNCONFIRMEDapp-portage/porthole with python3 - File "/usr/lib/portage/pym/portage/__init__.py", line 224, in __2013-02-10 22:16:25
410981ToolsdolsenUNCONFIRMEDapp-portage/etc-proposals with dev-lang/python-2.7[-berkdb] - raise error, "db type could not be det2012-04-09 20:36:29
451040[DE]docs-teamUNCONFIRMEDConflict with english translation "Anacron exits"2013-01-09 12:11:06
451846Installation Handbookdocs-teamUNCONFIRMEDwireless-tools no longer function with default installation2013-01-20 16:04:16
442930New Documentationdocs-teamUNCONFIRMEDHow to install Gentoo with a UEFI motherboard2012-12-28 16:49:35
451996ApplicationsdjcUNCONFIRMEDdev-vcs/hgsubversion-1.4: compilation failure with Python 2.52013-01-15 12:37:58
397863EbuildsdjcUNCONFIRMEDnet-misc/openvpn: add /var/run/openvpn to be ok with selinux and openvpn-status.log file2012-01-29 16:29:33
442420ApplicationsdilfridgeUNCONFIRMEDmedia-libs/opencv-2.4.3 with USE=cuda : /opt/cuda/bin/nvcc compiles in /tmp which results in "No spa2013-02-04 21:24:25
440794ApplicationsdilfridgeUNCONFIRMEDmedia-gfx/digikam 2.9.0 - digikam (core): Failed to detect camera with GPhoto2 from Solid (canon ixu2013-01-27 16:08:36
458006Applicationsdev-zeroUNCONFIRMEDx11-drivers/xf86-video-vmware with media-libs/mesa-9.1_rc1 - module fails to load2013-02-20 00:43:23
447630Unspecifieddev-zeroUNCONFIRMED=net-misc/openvswitch-1.6.1-r2 - /etc/init.d/ovs-controller: ERROR: ovs-controller needs service(s) 2013-02-12 08:26:14
444306Librarydev-zeroUNCONFIRMEDx11-drivers/xf86-input-vmmouse-12.9.0 with x11-base/xorg-server-1.13.0-r1 - Warning: attempting to l2013-01-01 21:31:12
452852Applicationsdev-toolsUNCONFIRMEDdev-util/insight-6.8.1 with >=dev-tcltk/itcl-4.0.0 - Error: can't find package Itcl 3.32013-02-03 11:53:40
386125Applicationsdev-zeroUNCONFIRMEDx11-drivers/xf86-video-vmware does not install with reason bad programming practice2013-01-31 11:11:18
447638Coredev-portageUNCONFIRMEDBuilding packages as normal user with fakeroot sometimes fails due to tar complaining about "Too man2012-12-18 19:12:05
448138Coredev-portageUNCONFIRMEDsys-apps/portage no longer works with dev-lang/python-2.52012-12-22 07:22:48
437494Core - Interface (emerge)dev-portageUNCONFIRMEDProvide a parameter for emerge so that 'emerge -pv' can display package description along with other2012-10-08 19:09:40
430132Core - Dependenciesdev-portageUNCONFIRMEDVersioned virtuals cause slot conflict when weak block dependencies could resolve with uninstall2012-08-08 07:44:32
428474Enhancement/Feature Requestsdev-portageUNCONFIRMEDPrint a warning after merge with wrong permissions on existing file2012-07-28 22:34:46
414249Core - Dependenciesdev-portageUNCONFIRMEDAutomatically keyword/unmask all dependencies with a single entry2012-12-25 21:12:28
406811Coredev-portageUNCONFIRMEDFeature request: enhance portage with "buildsrcpkg" that captures all source files for GPL complianc2012-03-04 07:20:32
402935Core - Dependenciesdev-portageUNCONFIRMEDemerge bad handle on --exclude with masked packages2012-02-10 18:02:04
389843Coredev-portageUNCONFIRMEDemerge --skipfirst without --resume tries to emerge wrong packages with portage 2.2.0_alpha722011-11-08 01:14:55
382827Coredev-portageUNCONFIRMEDsys-apps/portage-2.1.10.11 crashes with confusing error when out of memory: TypeError: an integer is2011-09-14 13:56:03
365655Unclassifieddev-portageUNCONFIRMEDsys-apps/portage implicit pointer check is broken with gcc-4.52011-05-06 02:51:27
456120Applicationscron-bugsUNCONFIRMEDsys-process/vixie-cron with app-admin/logrotate - cron cannot handle cron.daily file with a dot in i2013-02-15 08:38:29
458338DevelopmentcppUNCONFIRMEDdev-libs/boost-1.49.0-r2 with sys-libs/uclibc - In file included from libs/locale/src/posix/codecvt.2013-02-21 02:53:30
456792LibrarycppUNCONFIRMEDdev-libs/boost-1.52.0-r5 fails to compile with custom /etc/site-config.jam: could not find main targ2013-02-12 22:13:10
425188ApplicationscppUNCONFIRMED[TRACKER] Packages failing to build with >=dev-libs/boost-1.502012-12-16 15:28:26
438188Developmentcommon-lispUNCONFIRMEDdev-lisp/clisp-2.48-r1 - fails to compile with ENOMEM, although there is plenty left2013-01-01 04:00:02
432980Applicationscommon-lispUNCONFIRMEDdev-lisp/sbcl-1.0.55-r1 fails to compile with "The value 18446744073 is not of type (UNSIGNED-BYTE 32012-08-29 09:14:51
455516Core systemclusterUNCONFIRMEDsys-fs/gfs2-utils with sys-kernel/hardened-sources-3.7.3 - In file included from conftest.c:84: /usr2013-02-08 16:35:19
452378ServerclusterUNCONFIRMED>=sys-cluster/ceph-0.55.1 with dev-libs/boost-1.49 - In file included from mds/Dumper.cc:24: /usr/in2013-01-15 17:14:48
436218EbuildsclusterUNCONFIRMEDnet-misc/pssh with dev-lang/python-3.2 - pssh --help: ImportError: No module named version2013-01-04 06:31:50
407483ApplicationscjkUNCONFIRMEDapp-i18n/ibus-pinyin with dev-lang/lua-5.2.0 - ./.libs/libpylua.a(libpylua_la-lua-plugin.o): In func2012-03-09 15:19:06
456328ApplicationschithanhUNCONFIRMEDwww-plugins/gnash-08.10-r2 with dev-libs/boost-1.52.0-r5 - ld: sdl_gnash-gnash.o: undefined referenc2013-02-12 14:38:36
456898ApplicationscardoeUNCONFIRMEDmedia-tv/mythtv with sys-fs/udisks:2 fails to detect DVD drives2013-02-14 00:28:21
454560LibrarycardoeUNCONFIRMEDx11-drivers/nvidia-drivers-313.18 with kernel 3.7.4 - NVRM: This PCI I/O region assigned to your NVI2013-02-05 19:04:08
439540ApplicationscardoeUNCONFIRMEDapp-emulation/qemu fails to handle a usb serial port with a specific vendorid - qdev_prop_set: prope2013-02-10 17:43:13
438248ApplicationscalchanUNCONFIRMEDmedia-video/kino-1.3.4 generates XML DVD indices incompatible with media-video/dvdauthor-0.7.02012-10-15 10:52:33
454384BugzillabugzillaUNCONFIRMEDExtend "My Bugs" list with RESOLVED NEEDINFO and RESOLVED TEST-REQUEST states2013-01-28 15:27:34
374949BugzillabugzillaUNCONFIRMEDSubmitting bugs with attachments without method to determine content type causes error but still cre2011-10-30 23:16:37
458598Applicationsbug-wranglersUNCONFIRMED[media-gfx/asymptote-2.21] emerge failed with USE="doc latex"2013-02-21 14:49:39
421017FreeBSDbsdUNCONFIRMEDnet-nds/openldap-2.4.31 links with /lib/libcom_err.so.22012-06-13 18:25:22
445594Core systembluenessUNCONFIRMEDsys-apps/coreutils - FAIL: tests/cp/fiemap-FMR.sh - Fails src_test with -march=native : valgrind "un2013-02-12 03:34:41
438508Core systembluenessUNCONFIRMEDhardened kernel 3.4.9 with ZFS patch - Recursive fault on unsuspending (resuming from RAM) laptop wi2012-10-17 03:55:19
437416LibrarybluenessUNCONFIRMEDnet-libs/libmicrohttpd-0.9.21 fails tests with USE="ssl"2012-12-26 13:26:06
432206ApplicationsbluenessUNCONFIRMEDnet-misc/arm with dev-lang/python:3.2 - SyntaxError: invalid syntax in print "TorCtl successfully in2013-01-15 13:00:59
427972PrintingbillieUNCONFIRMEDnet-print/hplip - Scanning with hplip fails: Invalid argument2012-11-13 18:44:02
457556Applicationsbase-systemUNCONFIRMEDsys-apps/texinfo-4.13-r2 fails with ncurses[tinfo]2013-02-14 18:19:20
457558Librarybase-systemUNCONFIRMEDsys-libs/readline-6.2_p4 fails with ncurses[tinfo]2013-02-14 18:20:16
458496Core systembase-systemUNCONFIRMEDsys-apps/util-linux-2.22.2 install fails with: unable to read SONAME from libmount.so2013-02-20 20:32:45
456906Core systembase-systemUNCONFIRMEDsys-block/open-iscsi iscsiadm fails with sh: /sbin/iscsid: No such file or directory2013-02-13 18:58:13
448752Core systembase-systemUNCONFIRMEDsys-devel/gettext-0.18.1.1-r3 with USE=cxx - /usr/lib/gcc/x86_64-pc-linux-gnu/4.6.3/../../../../x86_2012-12-27 02:15:45
454248Core systembase-systemUNCONFIRMEDnet-misc/openssh-6.1_p1-r1: ssh login with key hangs2013-01-28 12:38:04
442690baselayoutbase-systemUNCONFIRMEDsys-apps/baselayout - share.BSD/fstab device names have changed with FreeBSD 9.02012-11-12 22:39:21
439728Core systembase-systemUNCONFIRMEDnet-misc/ntp with sys-libs/glibc-2.15-r3 - ntpq -p: Request timed out2012-10-26 16:32:10
438998Core systembase-systemUNCONFIRMEDsys-fs/cryptsetup[selinux,static]: with sys-libs/libselinux-2.1.12, link fails with pcre missing sym2012-10-23 15:34:25
432454Applicationsbase-systemUNCONFIRMEDsys-block/open-iscsi - init script has problems with automatic mounting of iSCSI2012-10-22 16:22:50
426358Core systembase-systemUNCONFIRMEDsys-block/partimage server crashes with pthread error when client attempts to download image2012-07-18 00:00:36
423593Core systembase-systemUNCONFIRMEDnet-misc/openssh-6.0_p1-r1: ssh hangs with 100% cpu connecting to HPUX sshd2012-11-12 12:36:02
424453Core systembase-systemUNCONFIRMEDsys-devel/automake-1.1[12] cause warning in combination with dev-lang/perl-5.16.02012-07-03 16:25:08
419529Applicationsbase-systemUNCONFIRMEDsys-libs/db-4.8.30 fails tests with no space left on device2012-06-04 10:55:39
419741Applicationsbase-systemUNCONFIRMEDdev-util/mono-tools-2.10 fails to emerge with Automake 1.11.52012-06-11 07:28:14
416361Core systembase-systemUNCONFIRMEDapp-arch/dump-0.4.44-r1 restore crashes restoring UNIX-domain socket with very long name2012-05-18 14:49:10
405581Core systembase-systemUNCONFIRMEDapp-admin/sudo with net-nds/openldap-1.8.4_p1 - sudo: sudo_ldap_build_pass1 allocation mismatch2012-02-24 16:05:21
403119Core systembase-systemUNCONFIRMEDReplace sys-apps/microcode-data with a separate sys-kernel/intel-ucode2013-01-01 21:57:37
390829Ebuildsbase-systemUNCONFIRMEDsys-fs/multipath-tools-0.4.8-r1: Problem with init.d script2011-11-17 15:55:55
383339Applicationsbase-systemUNCONFIRMEDapp-admin/syslog-ng-3.2.4: init script fails to start with ethernet bonding2011-09-19 10:38:08
389487Core systembase-systemUNCONFIRMEDnet-misc/keychain - keychain matches all (too many) processes with "ssh-agent" in cmdline2012-09-19 20:23:16
390245Core systembase-systemUNCONFIRMEDsys-fs/mtools-4.0.15 - mcd fails to mount SD memory card (with all available (tested) card readers)2011-11-20 07:19:18
382451Core systembase-systemUNCONFIRMEDapp-misc/ca-certificates-20110502: older verisign cert breaks with newer verisign cert2011-10-08 19:36:05
368997Ebuildsarmin76UNCONFIRMEDnet-misc/tightvnc: /etc/ini.d/vnc failes to start when media-fonts/font-misc-misc is installed with 2012-06-23 17:45:55
237994Applicationsbase-systemUNCONFIRMEDadd support for microcode loading with linux-2.6.27+2013-02-17 17:39:21
456362Libraryarfrever.ftaUNCONFIRMEDnet-libs/neon with >=dev-libs/openssl-1.0.1 - net-fs/davfs2 and net-misc/cadaver fail to connect to 2013-02-12 22:59:56
451400Applicationsapp-dictsUNCONFIRMEDapp-dicts/wordnet with dev-lang/tcl-8.6.0 - replace interp -> result by call to Tcl_SetResult() rout2013-02-01 06:55:10
458416ApplicationsangelosUNCONFIRMEDnet-wireless/ndiswrapper-1.58_rc1 with sys-kernel/vanilla-sources-3.8.0 - [...]/work/ndiswrapper-1.52013-02-20 14:35:53
416267Applicationsapp-backupUNCONFIRMEDapp-backup/backuppc-3.2.1 hangs and shows warnings about deprecated qw(...) with perl-5.142012-05-16 14:10:07
429564ApplicationsangelosUNCONFIRMEDgnome-extra/docky-2.1.4 compile error with mono 2.11.12012-09-11 06:58:49
403551OtheraltUNCONFIRMEDCompilation of gcc-4.5.3-r1 fails with "configure: error: Link tests are not allowed after GCC_NO_EX2012-02-14 10:57:13
447578Unspecifiedalsa-bugsUNCONFIRMEDmedia-sound/alsa-utils-? with kernel 3.7.0 - alsactl: set_control:1464: Cannot write control '3:3:0:2013-01-25 17:23:47
383605Core systemalsa-bugsUNCONFIRMEDmedia-libs/alsa-lib-1.0.23 crash when compiled with sys-devel/gcc-4.4.5 / -O32011-09-20 16:11:19
369327Applicationsalsa-bugsUNCONFIRMEDNo sound with Poulsbo HD Audio Controller2011-06-01 14:12:24
451824ApplicationsalexxyUNCONFIRMEDsci-chemistry/vmd-1.9.1-r2 with tcl/tk-8.6 break g(r) analysis module2013-01-17 20:52:47
431920EbuildsalexxyUNCONFIRMEDnet-wireless/wimax-1.5.2-r1 installs /var/log/wimax with mode 7772013-01-01 21:49:31
427496ApplicationsalexxyUNCONFIRMEDnet-wireless/wimax-1.5.2-r1 with net-wireless/wpa_supplicant-1.0 USE=wimax - undefined reference to 2013-01-05 12:47:50
438578DevelopmentaidecoeUNCONFIRMEDdev-python/pyro-4.14 fails to build with Python3.32012-12-26 12:48:10
428146Core systema3liUNCONFIRMEDsys-boot/plymouth-0.8.4 with x11-libs/libdrm-2.4.37 - .../work/plymouth-0.8.4/src/plugins/renderers/2013-02-07 11:16:42
411321Ebuildsa3liUNCONFIRMEDsys-boot/plymouth boot fails : switchroot can't switch /dev from /sysroot/dev2012-04-23 20:05:34
434668EbuildsperlUNCONFIRMEDdev-perl/gnome2-gconf with gnome-base/gconf USE=-orbit - Can't load 'blib/arch/auto/Gnome2/GConf/GCo2012-09-21 16:07:12
346251ApplicationspdaUNCONFIRMEDapp-pda/gtkpod: normalize volume doesn't work for .mp3 files with ApeV2 tags2013-01-11 16:10:10
298753EbuildsnetmonUNCONFIRMEDnet-analyzer/rrdtool - src_configure() hangs at: configure:19935: checking if msync with MS_ASYNC up2011-06-01 15:21:23
350685Unspecifiedmaintainer-neededUNCONFIRMEDnet-misc/htpdate-1.0.4 segfaults with -b command line option2012-03-04 09:21:29
312161GNOMEgnomeUNCONFIRMEDgnome-base/libbonobo-2.24.2 fails to build on hardened with2013-02-19 13:28:21
339725EbuildsaballierUNCONFIRMEDmedia-sound/lmms fails to build remote_vst_plugin: winebuild: as --32 failed with status 12011-04-19 16:10:52
457104KernelsecurityUNCONFIRMEDDriver of cypress corrupts file-system and partition table of external hard drives with M6116 SATA B2013-02-14 15:53:16


back
Please read "Why adblockers are bad".



other Ads
Trace My Cash
Wenn Sie sich schon immer mal gefragt haben, wo eigentlich Ihr geliebtes Bargeld geblieben ist, finden Sie hier vielleicht die Antwort.
www.tracemycash.com
Other free services
toURL.org
Shorten long
URLs to short
links like
http://tourl.org/2
tourl.org
.
Reverse DNS lookup
Find out which hostname(s)
resolve to a
given IP or other hostnames for the server
www.reversednslookup.org

New Packages

- as rdf newsfeed
- as rss newsfeed
- as Atom newsfeed
2017-11-25
PyQt5 - 5.9.2
Ebuild name:

dev-python/PyQt5-5.9.2

Description

Python bindings for the Qt framework

Added to portage

2017-11-25

ipkg-utils - 1.7.050831-r3
Ebuild name:

app-arch/ipkg-utils-1.7.050831-r3

Description

Tools for working with the ipkg binary package format

Added to portage

2017-11-25

sip - 4.19.6
Ebuild name:

dev-python/sip-4.19.6

Description

Python extension module generator for C and C++ libraries

Added to portage

2017-11-25

tint2 - 15.3
Ebuild name:

x11-misc/tint2-15.3

Description

tint2 is a lightweight panel/taskbar for Linux.

Added to portage

2017-11-25

2017-11-24
alpine - 2.21
Ebuild name:

mail-client/alpine-2.21

Description

alpine is an easy to use text-based based mail and news client

Added to portage

2017-11-24

buildbot - 0.9.13
Ebuild name:

dev-util/buildbot-0.9.13

Description

BuildBot build automation system

Added to portage

2017-11-24

buildbot-console-view - 0.9.13
Ebuild name:

dev-util/buildbot-console-view-0.9.13

Description

Buildbot console-view plugin

Added to portage

2017-11-24

buildbot-grid-view - 0.9.13
Ebuild name:

dev-util/buildbot-grid-view-0.9.13

Description

BuildBot grid view web interface

Added to portage

2017-11-24

buildbot-pkg - 0.9.13
Ebuild name:

dev-util/buildbot-pkg-0.9.13

Description

BuildBot common www build tools for packaging releases

Added to portage

2017-11-24

buildbot-waterfall-view - 0.9.13
Ebuild name:

dev-util/buildbot-waterfall-view-0.9.13

Description

Buildbot waterfall-view plugin

Added to portage

2017-11-24

buildbot-worker - 0.9.13
Ebuild name:

dev-util/buildbot-worker-0.9.13

Description

BuildBot Worker (slave) Daemon

Added to portage

2017-11-24

buildbot-wsgi-dashboards - 0.9.13
Ebuild name:

dev-util/buildbot-wsgi-dashboards-0.9.13

Description

Buildbot plugin to integrate flask or bottle dashboards to

Added to portage

2017-11-24

buildbot-www - 0.9.13
Ebuild name:

dev-util/buildbot-www-0.9.13

Description

BuildBot base web interface, use with buildbot-{console-view,waterfall

Added to portage

2017-11-24

chromium - 63.0.3239.59
Ebuild name:

www-client/chromium-63.0.3239.59

Description

Open-source version of Google Chrome web browser

Added to portage

2017-11-24

convmv - 2.04
Ebuild name:

app-text/convmv-2.04

Description

convert filenames to utf8 or any other charset

Added to portage

2017-11-24

dd-rescue - 1.99.7
Ebuild name:

sys-fs/dd-rescue-1.99.7

Description

Similar to dd but can copy from source with errors

Added to portage

2017-11-24

debianutils - 4.8.3
Ebuild name:

sys-apps/debianutils-4.8.3

Description

A selection of tools from Debian

Added to portage

2017-11-24

elogind - 233.7-r1
Ebuild name:

sys-auth/elogind-233.7-r1

Description

The systemd project's logind, extracted to a standalone package

Added to portage

2017-11-24

elogind - 234.4-r1
Ebuild name:

sys-auth/elogind-234.4-r1

Description

The systemd project's logind, extracted to a standalone package

Added to portage

2017-11-24

extra-syntax - 4-r2
Ebuild name:

app-vim/extra-syntax-4-r2

Description

vim plugin metapackage for all extra syntax packages

Added to portage

2017-11-24

gentoo-sources - 4.13.16
Ebuild name:

sys-kernel/gentoo-sources-4.13.16

Description

Full sources including the Gentoo patchset for the . kernel tree

Added to portage

2017-11-24

gentoo-sources - 4.14.2
Ebuild name:

sys-kernel/gentoo-sources-4.14.2

Description

Full sources including the Gentoo patchset for the . kernel tree

Added to portage

2017-11-24

gentoo-sources - 4.4.102
Ebuild name:

sys-kernel/gentoo-sources-4.4.102

Description

Full sources including the Gentoo patchset for the . kernel tree

Added to portage

2017-11-24

gentoo-sources - 4.9.65
Ebuild name:

sys-kernel/gentoo-sources-4.9.65

Description

Full sources including the Gentoo patchset for the . kernel tree

Added to portage

2017-11-24

ghc - 8.2.2
Ebuild name:

dev-lang/ghc-8.2.2

Description

The Glasgow Haskell Compiler

Added to portage

2017-11-24

github_api - 0.18.2
Ebuild name:

dev-ruby/github_api-0.18.2

Description

A Ruby wrapper for the GitHub REST API v3

Added to portage

2017-11-24

guayadeque - 9999
Ebuild name:

media-sound/guayadeque-9999

Description

Music management program designed for all music enthusiasts

Added to portage

2017-11-24

irqbalance - 1.3.0
Ebuild name:

sys-apps/irqbalance-1.3.0

Description

Distribute hardware interrupts across processors on a multiprocessor syst

Added to portage

2017-11-24

jhead - 3.00-r2
Ebuild name:

media-gfx/jhead-3.00-r2

Description

Exif Jpeg camera setting parser and thumbnail remover

Added to portage

2017-11-24

kexec-tools - 2.0.16
Ebuild name:

sys-apps/kexec-tools-2.0.16

Description

Load another kernel from the currently executing Linux kernel

Added to portage

2017-11-24

keychain - 2.8.4
Ebuild name:

net-misc/keychain-2.8.4

Description

Agent manager for OpenSSH, ssh.com, Sun SSH, and GnuPG

Added to portage

2017-11-24

kompose - 1.5.0
Ebuild name:

app-emulation/kompose-1.5.0

Description

Tool to move from docker-compose to Kubernetes

Added to portage

2017-11-24

libcdio - 1.0.0-r1
Ebuild name:

dev-libs/libcdio-1.0.0-r1

Description

A library to encapsulate CD-ROM reading and control

Added to portage

2017-11-24

libconfig - 1.7.1
Ebuild name:

dev-libs/libconfig-1.7.1

Description

Libconfig is a simple library for manipulating structured configuration fi

Added to portage

2017-11-24

libfaketime - 0.9.7
Ebuild name:

sys-libs/libfaketime-0.9.7

Description

Report faked system time to programs

Added to portage

2017-11-24

libnsl - 1.2.0
Ebuild name:

net-libs/libnsl-1.2.0

Description

Public client interface for NIS(YP) and NIS+ in a IPv6 ready version

Added to portage

2017-11-24

librdkafka - 0.11.1
Ebuild name:

dev-libs/librdkafka-0.11.1

Description

Apache Kafka C/C++ client library

Added to portage

2017-11-24

libsass - 3.4.7
Ebuild name:

dev-libs/libsass-3.4.7

Description

A C/C++ implementation of a Sass CSS compiler

Added to portage

2017-11-24

lumina - 1.4.0
Ebuild name:

x11-wm/lumina-1.4.0

Description

Lumina desktop environment

Added to portage

2017-11-24

multipath-tools - 0.7.4
Ebuild name:

sys-fs/multipath-tools-0.7.4

Description

Device mapper target autoconfig

Added to portage

2017-11-24

openpam - 20140912-r1
Ebuild name:

sys-auth/openpam-20140912-r1

Description

Open source PAM library

Added to portage

2017-11-24

pam - 1.3.0-r1
Ebuild name:

sys-libs/pam-1.3.0-r1

Description

Linux-PAM (Pluggable Authentication Modules)

Added to portage

2017-11-24

passenger - 5.1.12
Ebuild name:

www-apache/passenger-5.1.12

Description

Passenger makes deployment of Ruby on Rails applications a breeze

Added to portage

2017-11-24

pyblake2 - 1.1.0
Ebuild name:

dev-python/pyblake2-1.1.0

Description

BLAKE2 hash function extension module

Added to portage

2017-11-24

sassc - 3.4.7
Ebuild name:

dev-lang/sassc-3.4.7

Description

A libsass command line driver

Added to portage

2017-11-24

thin-provisioning-tools - 0.7.5
Ebuild name:

sys-block/thin-provisioning-tools-0.7.5

Description

A suite of tools for thin provisioning on Linux

Added to portage

2017-11-24

tor - 0.3.2.5_alpha
Ebuild name:

net-vpn/tor-0.3.2.5_alpha

Description

Anonymizing overlay network for TCP

Added to portage

2017-11-24

uhashring - 1.0
Ebuild name:

dev-python/uhashring-1.0

Description

Full featured consistent hashing python library compatible with ketama

Added to portage

2017-11-24

uncrustify - 0.66.1
Ebuild name:

dev-util/uncrustify-0.66.1

Description

C/C++/C/D/Java/Pawn code indenter and beautifier

Added to portage

2017-11-24

vanilla-sources - 4.14.2
Ebuild name:

sys-kernel/vanilla-sources-4.14.2

Description

Full sources for the Linux kernel

Added to portage

2017-11-24

vanilla-sources - 4.4.102
Ebuild name:

sys-kernel/vanilla-sources-4.4.102

Description

Full sources for the Linux kernel

Added to portage

2017-11-24

vanilla-sources - 4.9.65
Ebuild name:

sys-kernel/vanilla-sources-4.9.65

Description

Full sources for the Linux kernel

Added to portage

2017-11-24

xtables-addons - 2.14
Ebuild name:

net-firewall/xtables-addons-2.14

Description

iptables extensions not yet accepted in the main kernel

Added to portage

2017-11-24

yard - 0.9.11
Ebuild name:

dev-ruby/yard-0.9.11

Description

Documentation generation tool for the Ruby programming language

Added to portage

2017-11-24

rdf newsfeed | rss newsfeed | Atom newsfeed
- Powered by LeopardCMS - Running on Gentoo -
Copyright 2004-2017 Sascha Nitsch Unternehmensberatung UG(haftungsbeschänkt)
Valid XHTML1.1 : Valid CSS : buttonmaker
- Level Triple-A Conformance to Web Content Accessibility Guidelines 1.0 -
- Copyright and legal notices -
Time to create this page: 8.3 ms
system status display