from small one page howto to huge articles all in one place
 

search text in:




Other .linuxhowtos.org sites: www.linuxhowtos.org
toolsntoys.linuxhowtos.org



Last additions:
How to make X listen on port 6000

How to make X listen on port 6000

words:

34

views:

73561

userrating:

average rating: 1.2 (8 votes) (1=very good 6=terrible)


May, 25th 2007:
April, 26th 2007:
Apr, 10th. 2007:
Druckversion . pdf icon
You are here: Portage


Details of dev-python/py:

Description: library with cross-python path, ini-parsing, io, code, log facilities
Homepage:
https://py.readthedocs.io/ https://github.com/pytest-dev/py/ https://pypi.org/project/py/

available versions:

releasesalphaamd64armhppaia64mipsppcppc64ppc macoss390shsparcx86USE-Flagsdependenciesebuild warnings
py-1.11.0-r1 ~+++-~++-~-++none
show
show
Legend:
+ stable
~ testing
- not available
some ebuild warning depend on specific use-flags or architectures, all ebuild-warnings are shown.

Known bugs:
bug IDcomponentassigned tostatusdescriptionlast change
313491ApplicationsgraphicsUNCONFIRMEDmedia-gfx/exact-image: Verify and potentially improve Python-related code2012-10-06 11:48:14
365345Ebuildsmaintainer-wantedUNCONFIRMEDgxsm-2.0 (New Package Gnome X Scanning Microscopy)2011-05-02 01:45:44
365899.tbz2 supportpms-bugsUNCONFIRMEDautomatic RDEPEND for binpkgs using python2011-05-11 17:58:24
366571DevelopmentpythonUNCONFIRMEDapp-admin/eselect-python: override python version from environment2011-07-29 06:41:23
367783ApplicationspythonUNCONFIRMEDInvalid homepage for dev-python/pyds-0.7.32011-10-24 07:57:11
369375Ebuildsmaintainer-wantedUNCONFIRMEDdev-utils/pycharm (new package)2013-01-13 10:52:43
371009DevelopmentpythonUNCONFIRMEDdev-lang/python-2.7.1-r1 fails to cross compile on mipsel-r3000-linux-uclibc2011-10-02 21:07:28
372933ApplicationspythonUNCONFIRMEDgnome-base/libglade binpkg fails after python upgrade2011-06-29 16:11:40
372949UnspecifiedpythonUNCONFIRMEDapp-admin/python-updater should depend on sys-apps/openrc2012-07-05 13:59:19
374439ApplicationsgrozinUNCONFIRMEDapp-text/pybookreader-0.5.0 has bad homepage2011-07-27 06:53:37
374871Ebuildsmaintainer-wantedUNCONFIRMEDebuild request - pyload Download Manager2012-12-05 17:09:05
374901Applicationsarmin76UNCONFIRMED[embedded-cross overlay] dev-python/pyxml-0.8.4-r2: multiple Python ABIs in EAPI <=2 is deprecated a2011-11-05 18:47:19
375791Ebuildsmaintainer-wantedUNCONFIRMEDdev-python/svgwrite (New Package)2011-07-21 12:06:51
377925DevelopmentpythonUNCONFIRMEDdev-python/docutils-0.[78]: TypeError: can't use a bytes pattern on a string-like object2011-10-07 21:22:24
378843Ebuildsmaintainer-wantedUNCONFIRMED[Science overlay] omniORBpy version 3.6 ebuild2011-09-17 21:27:40
379001LibrarygnomeUNCONFIRMEDsys-libs/ldb-1.1.4 fails on portage-multilib because of waflib module's python support2013-01-01 18:40:16
379003LibrarypatrickUNCONFIRMEDsys-libs/tevent-0.9.12 fails on portage-multilib because of waflib module's python support2012-12-25 21:03:18
379201Core systemmultilibUNCONFIRMED[multilib overlay] /dev-libs/libxml2-2.7.7 USE=lib32 - /usr/include/python2.7/pyport.h:849:2: ??????2011-08-15 07:34:05
381487Ebuildsmaintainer-wantedUNCONFIRMEDdev-python/DerApproximator - A python module for numerical optimization2011-09-05 11:36:51
381759Ebuildssci-geosciencesUNCONFIRMEDsci-geosciences/grass-6.4.1 wxwidgets GUI does not start with Python32013-01-24 22:56:15
381809EbuildspythonUNCONFIRMEDgames-simulation/singularity-0.30c fails to run with Python32012-12-29 15:00:48
383699ApplicationslackUNCONFIRMEDx11-plugins/screenlets-0.1.2 some parts depend on gconf-python2011-09-20 04:04:24
384429ApplicationsjlecUNCONFIRMEDdev-python/pyglet should depend on media-libs/libtxc_dxtn2011-10-05 19:38:41
385131CorepythonUNCONFIRMEDapp-admin/python-updater-0.9: append --keep-going to emerge2012-03-17 11:41:48
385401ApplicationslxnayUNCONFIRMEDapp-admin/packagekit-base-0.6.18 compile error on using python3 as default2012-05-12 22:10:25
386163Core systempythonUNCONFIRMEDEmerging app-admin/eselect-python-20100321 fails with 2011-10-09 11:37:24
386269UnspecifiedsciUNCONFIRMEDsci-libs/scipy-0.9.0-r2 fails to emerge due to missing blas2012-06-03 10:35:59
387045EbuildsgrozinUNCONFIRMEDapp-text/pybookreader-0.5.0 should (R)DEPEND on gnome-base/libgnome{,ui}2011-11-18 14:13:50
387109Ebuildsmaintainer-wantedUNCONFIRMEDNew Ebuild: dev-python/lazr-restfulclient2011-10-21 07:15:05
387111Ebuildsmaintainer-wantedUNCONFIRMEDNew Ebuild: dev-python/wadllib2011-10-21 07:14:36
387113Ebuildsmaintainer-wantedUNCONFIRMEDNew ebuild: dev-python/lazr-uri2011-10-21 07:13:52
387377Ebuildsmaintainer-wantedUNCONFIRMEDdev-python/configglue (new ebuild)2011-10-21 19:24:20
388549ApplicationsproaudioUNCONFIRMEDmedia-libs/lv2core-9999 - missing dependency on dev-python/rdflib2011-10-26 14:24:49
389017Ebuildsmaintainer-wantedUNCONFIRMEDdev-python/acutil - Tool for setting up authentication from network services ( Python2 library )2011-11-01 15:34:30
391185UnspecifiedpythonUNCONFIRMED=dev-python/utidylib-0.2-r1 - src_test(): Segmentation fault in trial2012-02-18 20:19:49
391319EbuildssciUNCONFIRMED[science overlay] sci-geosciences/pydap_handlers_hdf52011-11-23 15:49:27
391659EbuildssciUNCONFIRMED[science overlay] sci-geosciences/pydap_handlers_sqlite2011-11-23 16:02:22
392463EbuildsroxUNCONFIRMEDrox-extra/roxcd: Deprecation Warning about of python_mod_cleanup()2012-09-09 01:16:09
392473Ebuildsmaintainer-wantedUNCONFIRMED[new ebuild] PyBrain 0.3.12011-11-29 22:49:34
392975Ebuildsmaintainer-wantedUNCONFIRMED[science overlay] sci-mathematics/pulp - a Python wrapper for linear programming solvers2011-12-04 05:05:24
394103Core systempythonUNCONFIRMEDdev-lang/python-2.7.2-r3 fix for exception: "handle out of range in select()"2011-12-10 21:27:35
395495ApplicationspythonUNCONFIRMEDdev-lang/python-3.2.2 failed (test phase)2011-12-22 08:56:37
395817ApplicationssoundUNCONFIRMEDmedia-libs/libsndfile-1.0.25: fails tests with python-32012-01-18 16:03:11
395929EbuildsroxUNCONFIRMEDrox-base/mime-editor-0.6: uses still python_mod_optimize()2011-12-24 20:01:06
396665ApplicationspythonUNCONFIRMEDapp-admin/python-updater-0.10 does not update from /usr/lib/python3.1 to /usr/lib/python3.22012-11-07 14:06:55
398955GNOMEgnomeUNCONFIRMEDgnome-base/libglade-2.6.4: please split the python dependency2013-01-01 23:07:29
398961Ebuildsnet-imUNCONFIRMEDnet-im/pidgin-2.10.1: please separate dbus-python dependency into a USE-flag2013-01-01 23:11:04
399139EbuildspythonUNCONFIRMEDapp-admin/eselect-python - Can't select python without man page2012-01-17 14:56:48
399417ServerpythonUNCONFIRMED2013-02-07 19:28:02
399491Core systembase-systemUNCONFIRMEDsys-devel/automake-1.11.2-r1 - fails py-compile-basic.test py-compile-basic2.test py-compile-basedir2012-02-06 11:51:29
400585ApplicationsvimUNCONFIRMEDapp-editors/vim-7.3: broken unicode while copy/paste with X PRIMARY and CLIPBOARD2012-01-25 13:56:18
400843Prefix SupportprefixUNCONFIRMEDdev-python/pygtk-2.24.0-r2 fails to build on OS 10.7 with numerous errors2012-07-13 10:10:03
401009Unspecifiedmaintainer-wantedUNCONFIRMEDdev-python/pillow - a fork of (dev-python/)imaging2012-01-27 21:14:38
401651Core - DependenciespythonUNCONFIRMEDdev-lang/python 3.1.4-r3 and 2.7.2-r3 sys-libs/readline is conditional on ncurses?2012-02-01 06:29:39
402027EbuildspythonUNCONFIRMEDdev-python/django-1.3.1 with dev-python/psycopg-2.4.2 fails app/project tests2012-04-28 20:35:29
402047EbuildspythonUNCONFIRMEDdev-python/git-python-0.3.2_rc1 should RDEPEND on dev-python/gitdb2012-02-25 11:43:58
402659DevelopmentpythonUNCONFIRMEDdev-python/pydb-1.26-r1 - ImportError: No module named fns2012-04-24 16:19:54
403407ApplicationspythonUNCONFIRMEDdev-python/rst2pdf - Add SVG support (IUSE=svg)2012-02-15 16:25:10
403667Ebuildsmaintainer-wantedUNCONFIRMEDapp-vim/ropevim-0.3_rc0 - vim plugin for using rope python refactoring library2012-02-14 21:15:54
404063DevelopmentpythonUNCONFIRMEDVersion bump: =dev-python/kinterbasdb-3.3.02012-03-09 08:44:10
404427HardenedhardenedUNCONFIRMEDdev-python/cvxopt-1.1.4-r1 test suite triggers ssp2012-02-18 17:56:36
404505Prefix SupportprefixUNCONFIRMEDPython 2.7.2 uses C99 'round' symbol2012-02-21 07:41:46
405183ApplicationspythonUNCONFIRMEDdev-python/reportlab should not depend on media-fonts/ttf-bitstream-vera2012-02-22 18:19:40
405549LibrarysrinclanUNCONFIRMEDdev-python/pywebkitgtk-1.1.8 crashes at start when using Pax/Hardened2012-06-10 01:24:13
405707Applicationsx11UNCONFIRMED=x11-apps/xdpyinfo-1.3.0 automagic dependency with x11-libs/libXinerama2012-02-27 00:04:12
405899Applicationsqmail-bugsUNCONFIRMEDnet-mail/queue-repair - /usr/bin/queue-repair.py: AttributeError: 'dict_keys' object has no attribut2012-02-27 01:35:46
405945Ebuildsmaintainer-wantedUNCONFIRMEDNew ebuild: app-misc/pycarddav - a simple way of accessing a CardDAV resource, mainly for use with m2012-10-14 18:19:44
406855EbuildsjsbronderUNCONFIRMEDsys-cluster/ganglia: Install gmetad-python.2013-02-15 17:46:20
407201Ebuildsmaintainer-wantedUNCONFIRMEDdev-python/lcdproc - Python LCDd client library2012-03-07 23:18:46
407483ApplicationscjkUNCONFIRMEDapp-i18n/ibus-pinyin with dev-lang/lua-5.2.0 - ./.libs/libpylua.a(libpylua_la-lua-plugin.o): In func2012-03-09 15:19:06
407589Ebuildsmaintainer-wantedUNCONFIRMEDdev-python/factory_boy : A versatile test fixtures replacement2012-03-12 12:07:45
407681ApplicationspythonUNCONFIRMEDmedia-sound/quodlibet-2.3.92-r1 segfaults when dev-lang/python-2.7.2-r3 is compiled with the hardene2012-10-06 17:14:29
407783Ebuildscorvus-gentooUNCONFIRMEDsys-fs/safecopy version bump to 1.72012-03-18 10:43:13
407813EbuildspythonUNCONFIRMEDPlease stabilize dev-python/fabric-1.2.22012-11-09 18:32:51
408013Ebuildsmaintainer-wantedUNCONFIRMEDdev-python/netzob - Network protocol modelization by reverse engineering2012-05-09 15:21:42
408147UnspecifiedpythonUNCONFIRMEDapp-admin/eselect-python with FEATURES="nomac nodoc" - eselect python does not set man page (...)2012-03-14 19:23:10
408215Ebuildsmaintainer-wantedUNCONFIRMEDdev-util/line_profiler-1.0_beta3: Profile individual lines (not only function calls) of python sourc2012-03-15 01:28:00
408217Ebuildsmaintainer-wantedUNCONFIRMEDdev-python/meliae-0.4.0: Profile python's memory footprint2012-03-15 01:15:55
408221Ebuildsmaintainer-wantedUNCONFIRMEDdev-python/SquareMap-1.0.1_beta3: Hierarchic data-visualisation control for wxPython2012-03-15 01:15:37
408225Ebuildsmaintainer-wantedUNCONFIRMEDdev-python/runsnakerun-2.0.2_alpha1: GUI to display python profile dumps from cProfile, python-profi2012-03-15 01:15:15
409867EbuildsjmbsvicettoUNCONFIRMEDnet-misc/vde-2.3.2 version bump including Python support2012-06-08 13:16:39
410079Ebuildsmaintainer-wantedUNCONFIRMEDnew ebuild: app-office/pyroom2012-03-29 01:31:21
410427Applicationsmedia-tvUNCONFIRMEDmedia-tv/freevo-1.9.0 needs dev-python/gdata for the youtube plugin2012-04-02 02:30:30
410981ToolsdolsenUNCONFIRMEDapp-portage/etc-proposals with dev-lang/python-2.7[-berkdb] - raise error, "db type could not be det2012-04-09 20:36:29
411271ApplicationshannoUNCONFIRMEDnet-im/python-otr-0.2.1.1 SRC_URI has changed2012-04-10 13:34:22
411275EbuildshannoUNCONFIRMEDnet-im/python-otr-1.0.0_beta6 version bump2012-10-27 11:06:09
411805DevelopmentrubyUNCONFIRMEDdev-lang/ruby-1.9.3_p125 - openssl_missing.h:71:6: error: conflicting types for ‘HMAC_CTX_copy’2012-04-14 21:28:46
412767Core systemclusterUNCONFIRMEDsys-block/lio-utils-9999 - python_pkg_setup() not called2012-06-18 20:39:15
413325Applicationsx11UNCONFIRMEDx11-apps/xdpyinfo-1.3.0 has automagic dependency on x11-libs/libXxf86dga2012-04-24 16:02:19
413393UnspecifiedpythonUNCONFIRMEDdev-lang/python[tk] should depend on dev-tcltk/tix2012-04-25 00:28:33
413515DevelopmentsciUNCONFIRMEDsci-libs/scipy - import failures due to missing symbols in clapack.so2013-02-07 13:44:35
413863DevelopmentpythonUNCONFIRMEDdev-lang/python-3.2.3 - improve cross compilation2012-12-17 14:57:26
414447LibraryproaudioUNCONFIRMEDmedia-libs/lv2core-3.0 (with python 3) - ./waf: SyntaxError: invalid syntax2012-12-08 20:52:16
415929Serverqmail-bugsUNCONFIRMEDnet-mail/queue-repair should depend on dev-lang/python:2.*2012-05-15 15:06:41
415989Librarymaintainer-wantedUNCONFIRMEDdev-python/prettytable-python-0.6 - Python interface to print pretty tabular data2012-12-12 10:10:18
416269Prefix SupportprefixUNCONFIRMEDdev-python/reportlab-2.5-r1 fails to build : libart.h : No such file or directory2012-05-23 15:49:39
417429ApplicationssoundUNCONFIRMEDmedia-sound/jack-3.1.1 - src_install(): SyntaxError: ('invalid syntax', ('/usr/lib64/python2.7/site-2013-01-27 12:28:16
418007DevelopmentmaksbotanUNCONFIRMEDdev-python/scrapy-0.14.4 fails in setup while parsing urlparse_monkeypatches.py2012-06-14 16:40:49
420271ApplicationspythonUNCONFIRMED=dev-python/twisted-11.0.0: fails test wrt twisted.test.test_udp.Server2012-06-11 10:59:36
420771GNOMEgnomeUNCONFIRMEDgnome-base/gvfs-1.12.3 (and apps using it, e.g. Nautilus) corrupt files on copy. Caused by prelink?2012-07-24 08:26:50
421687Keywording and StabilizationpythonUNCONFIRMEDdev-python/pylint-0.25.1 - please stabilize2012-06-18 18:27:14
423151Ebuildslu_zeroUNCONFIRMEDapp-emulation/qemu-user-1.1.0 requires python2 >= 2.42012-06-27 21:02:40
423405Gamesmaintainer-wantedUNCONFIRMEDM64Py (new ebuild)2012-06-26 10:59:38
423817DevelopmentflameeyesUNCONFIRMEDdev-util/dwarves-1.9: ostra-cg cannot find python module ostra: ImportError: No module named ostra2012-06-27 18:54:10
423953Ebuildsmaintainer-wantedUNCONFIRMED[science overlay] dev-python/pyhdf-0.8.3 ebuild2012-06-28 12:14:27
424357EbuildsnirbheekUNCONFIRMEDdev-python/pypy-1.9-r1: There is NOT at least 4 gibibytes RAM2012-12-16 10:05:41
424365EbuildsnirbheekUNCONFIRMEDdev-python/pypy-1.9-r1: AssertionError: must come from an argument to the function, got <-88;esp>2012-07-03 14:41:31
424812EbuildsgraphicsUNCONFIRMEDmedia-gfx/cairosvg should depend on dev-python/cssselect2012-07-06 04:28:24
425152ApplicationspythonUNCONFIRMEDdev-python/genshi-0.6: ebuild does not expose speedups c module2012-07-27 20:44:20
425332Ebuildsnet-dialupUNCONFIRMEDnet-dialup/capisuite-0.4.5 doesn't compile with python 3.* as active python interpreter2012-07-09 11:37:10
425758EbuildsroxUNCONFIRMEDrox-base/rox-lib - Deprecation Warning: Usage of python_mod_optimize() in packages not support......2012-07-18 09:48:32
425810EbuildscedkUNCONFIRMEDdev-python/suds fails to build when user only has python-32012-07-11 16:39:57
426194ApplicationspythonUNCONFIRMEDapp-admin/eselect-python: python wrapper breaks OpenELEC build2012-07-12 00:36:25
427162Ebuildsmaintainer-wantedUNCONFIRMEDdev-python/django-admin-tools-0.4.1 - a collection of tools for the django administration interface2012-12-12 12:25:24
427244DevelopmentpythonUNCONFIRMEDdev-python/networkx 1.7 - Syntax errors / warnings in Python modules for CPython 3.2: File "/usr/lib2013-01-22 11:57:15
427296Ebuildsmaintainer-wantedUNCONFIRMEDdev-python/django-tables2-0.11.0 - Table/data-grid framework for Django2012-12-12 11:30:43
427728Ebuildsmaintainer-wantedUNCONFIRMEDNew: dev-python/django-classy-tags-0.3.4.1 - Class based template tags for Django2012-12-12 11:41:28
427730Ebuildsmaintainer-wantedUNCONFIRMEDNew: dev-python/django-mptt-0.4.2 - Utilities for implementing a modified pre-order traversal tree i2012-12-12 11:46:23
427734Ebuildsmaintainer-wantedUNCONFIRMEDNew: dev-python/django-sekizai-0.4.2 - Django Template Blocks with extra functionality2012-12-12 11:51:41
427738Ebuildsmaintainer-wantedUNCONFIRMEDNew: dev-python/django-cms-2.3 - A Django application for managing hierarchical pages of content2012-12-12 12:04:20
427744Ebuildsmaintainer-wantedUNCONFIRMEDdev-python/django-dajaxice-0.2 - Easy to use AJAX library for django2012-12-12 12:09:22
427746Ebuildsmaintainer-wantedUNCONFIRMEDdev-python/django-dajax-0.8.4 - Easy to use library to create asynchronous presentation logic with d2012-12-12 12:17:56
427754Ebuildsmaintainer-wantedUNCONFIRMEDdev-python/django-tinymce-1.5.1_beta2 - TinyMCE integration for Django2012-12-12 12:32:51
427762Ebuildsmaintainer-wantedUNCONFIRMEDNew: dev-python/django-grappelli-2.4.0 - A grid-based alternative/extension to the Django administra2012-07-24 14:52:05
427764Ebuildsmaintainer-wantedUNCONFIRMEDNew: dev-python/django-filebrowser-3.5.0 - File management in the Django admin interface2012-12-13 06:57:02
427770Ebuildsmaintainer-wantedUNCONFIRMEDNew: dev-python/django-publisher-0.0.3 - Django external publishing app2012-12-13 07:01:05
427960EbuildspythonUNCONFIRMEDdev-python/tox-1.4 - pkg_resources.DistributionNotFound: py>=1.4.92012-07-25 01:38:14
428170EbuildspythonUNCONFIRMEDdev-python/ipython 0.10.2 should depend on dev-lang/python[threads]2012-07-26 17:48:33
428396EbuildspythonUNCONFIRMEDdev-python/m2crypto-0.21.1 - swig: ../sysdeps/unix/sysv/linux/getpagesize.c:32: __getpagesize: Asser2012-07-29 22:10:36
428462EbuildsaballierUNCONFIRMEDmedia-sound/a2jmidid should [R]DEPEND on dev-lang/python-2.72012-07-30 12:57:07
429372EbuildsnirbheekUNCONFIRMEDdev-python/pypy-1.9-r1 FEATURES=sandbox - Fatal error during initialization: out of memory2012-08-02 11:53:03
429462Core systembase-systemUNCONFIRMEDnet-misc/rsync - add --copy-devices support2012-08-02 11:50:17
431058Eclasses and ProfilespythonUNCONFIRMEDdev-util/gdbus-codegen-2.32.4 - /usr/portage/eclass/python-distutils-ng.eclass: line 206: syntax err2012-08-12 16:45:06
431388ApplicationspythonUNCONFIRMEDdev-python/ipython-0.13 -AttributeError: 'StoreMagics' object has no attribute 'db'2012-08-14 15:08:54
431522ApplicationsgstreamerUNCONFIRMEDmedia-video/flumotion: fails to build with python3* as system interpreter2012-12-28 00:22:54
431608Keywording and StabilizationpythonUNCONFIRMEDStabilize dev-python/virtualenvwrapper2013-01-04 01:17:32
431788EbuildspythonUNCONFIRMEDdev-python/ipython-0.13 does not correctly calculate USE dependencies2012-08-18 22:14:28
432206ApplicationsbluenessUNCONFIRMEDnet-misc/arm with dev-lang/python:3.2 - SyntaxError: invalid syntax in print "TorCtl successfully in2013-01-15 13:00:59
433003LibrarypythonUNCONFIRMEDdev-libs/libxml2 - File "/usr/lib/python2.7/xml/sax/__init__.py", line 93, in make_parser raise 2012-09-09 04:48:34
433175ApplicationspythonUNCONFIRMEDdev-lang/python-2.7.3-r2: Exception AttributeError: AttributeError("'_DummyThread' object has no att2012-09-03 18:23:18
433944KDEqtUNCONFIRMEDdev-python/PyQt4 does not install phonon-module2013-01-02 12:49:56
434716DevelopmentpythonUNCONFIRMEDdev-lang/python:2.7 - POSIX_SEMAPHORES_NOT_ENABLED 1 in /usr/include/python2.7/pyconfig.h2012-09-11 15:18:37
434722UnspecifiedhannoUNCONFIRMEDnet-mail/mailman-2.1.14 uses python_mod_cleanup() incorrectly2012-09-11 15:14:21
434900Ebuildspavel.stratil-junUNCONFIRMEDsys-apps/timer_entropyd-0.2 silently changed behavior2012-09-13 14:16:28
435270LibraryproaudioUNCONFIRMEDmedia-libs/aubio-0.3.2-r1 - SyntaxError: ('invalid syntax', ('/usr/lib64/python2.7/site-packages/aub2012-09-17 11:44:31
435516Applicationsgnome-accessibilityUNCONFIRMEDapp-accessibility/accerciser-3.4.1 - /usr/lib/python2.7/site-packages/accerciser/plugin/base_plugin.2012-09-21 19:29:04
436100LibrarysciUNCONFIRMEDsci-libs/scipy 0.9.0-r1 with media-libs/qhull-2012.1-r1 - scipy/spatial/qhull.c:206:25: fatal error:2013-02-03 13:03:23
436218EbuildsclusterUNCONFIRMEDnet-misc/pssh with dev-lang/python-3.2 - pssh --help: ImportError: No module named version2013-01-04 06:31:50
436346LibrarypythonUNCONFIRMEDdev-python/llfuse-0.37.1 - .../work/llfuse-0.37.1/distribute-0.6.12-py3.2.egg/setuptools/command/eas2012-09-27 22:00:38
436814EbuildspythonUNCONFIRMEDsys-block/targetcli should depend on dev-python/urwid2012-11-10 12:32:07
437214Prefix SupportprefixUNCONFIRMEDdev-python/PyQt4-4.9.4-r1 fails to emerge2013-01-17 05:38:43
437738ApplicationspythonUNCONFIRMEDdev-python/pycurl-7.19.0-r1000 crashes python interpreter when calling reset too many times on a pyc2012-10-09 20:08:53
438576DevelopmentpythonUNCONFIRMEDdev-python/pyenchant-1.6.5 doesn't build with Python3.32012-12-09 14:13:26
438578DevelopmentaidecoeUNCONFIRMEDdev-python/pyro-4.14 fails to build with Python3.32012-12-26 12:48:10
438986EbuildschutzpahUNCONFIRMEDapp-admin/salt-0.10.0 - error: file '.../work/impl_python3_2/salt-0.10.0/scripts/salt-master' does n2012-10-21 14:26:16
439640Ebuildsmaintainer-wantedUNCONFIRMEDdev-python/twilio-3.4.1: Python bindings for twilio2012-10-26 16:10:05
439662EbuildspythonUNCONFIRMED=dev-lang/python-2.7.3-r2 pydoc-2.7 init script should drop need net2012-10-26 16:14:27
439982ApplicationshwoarangUNCONFIRMEDgnome-extra/nautilus-dropbox-1.4.0 - /usr/bin/rst2man.py dropbox.txt > dropbox.1 /// TypeError: 'str2012-11-04 10:56:31
441652Ebuildsmaintainer-wantedUNCONFIRMEDdev-python/pybird-1.0.8 - class for talking to bird bgp daemon2012-11-04 18:50:37
441778DevelopmentvoyageurUNCONFIRMEDsys-devel/clang-3.1 ICE's when a type with multiple copy-ctors is in a union2012-11-04 23:13:59
442168ApplicationsproaudioUNCONFIRMEDmedia-sound/patchage - Build failure when python-3 is set as active version2012-12-23 21:12:37
442272LibrarypythonUNCONFIRMEDdev-python/pylint-0.26.0 merges with python 2.6 but not 2.72012-12-05 23:58:15
442614EbuildssoundUNCONFIRMEDmedia-sound/trommler-3.8 - Fails when python3 is set.2012-11-11 11:10:35
442992Prefix SupportprefixUNCONFIRMED2012-12-08 09:11:17
443498LibrarydilfridgeUNCONFIRMEDmedia-libs/opencv - python/src2/cv2.cpp:1: /usr/include/python2.7/pyport.h:849:2: ??????: #error "LO2013-02-04 22:23:56
443510EbuildspythonUNCONFIRMEDdev-lang/python should install helper file for sys-devel/gdb2012-11-16 16:07:09
443556EbuildsvoyageurUNCONFIRMEDsys-devel/clang-3.1 - Updated ebuild with +python and +doc2012-11-17 09:03:06
443804EbuildssystemdUNCONFIRMEDsys-apps/systemd should install python-systemd bindings2012-11-19 09:42:48
443886UnspecifiedpythonUNCONFIRMEDdev-python/traits dev-python/chaco dev-python/pyface USE=doc - ACCESS DENIED mkdir: /root/.config/o2012-11-19 10:44:55
444104ApplicationssciUNCONFIRMEDsci-libs/scipy-0.11.0 - numpy.distutils.system_info.BlasNotFoundError2012-12-06 15:49:39
444946Ebuildsmaintainer-wantedUNCONFIRMEDdev-python/txscheduling-1.1 - A scheduling plugin for Twisted2013-02-17 16:25:45
445614Ebuildsmaintainer-wantedUNCONFIRMEDapp-editors/retext - New package. - Qt-based text-editor for Markdown written in Python2013-01-02 12:40:40
446016LibrarypythonUNCONFIRMEDdev-python/python-gnutls-1.2.4 does not support >=net-libs/gnutls-32012-12-05 01:13:29
446024Ebuildsmaintainer-wantedUNCONFIRMEDdev-python/python-sipsimple-0.31.1 - SDK for easy development of SIP multimedia end-points2012-12-16 23:53:59
446028Ebuildsmaintainer-wantedUNCONFIRMEDdev-python/python-backports-1.0.1 - Backported python features2012-12-06 08:27:46
446192Ebuildsmaintainer-wantedUNCONFIRMEDdev-python/python-eventlib-0.1.1 - Coroutine-based networking library2012-12-06 08:27:46
446194Ebuildsmaintainer-wantedUNCONFIRMEDdev-python/python-msrplib-0.15.0 - Client library for MSRP protocol and its relay extension (RFC 4972012-12-06 08:27:46
446198Ebuildsmaintainer-wantedUNCONFIRMEDdev-python/python-xcaplib-1.0.17 - Client for managing full or partial XML documents on XCAP servers2012-12-06 21:23:53
446275KDEkdeUNCONFIRMEDpython ABI deps support for system-config-printer-kde and printer-applet2012-12-11 14:07:52
446326Core systemhardened-kernelUNCONFIRMED=sys-kernel/hardened-sources-3.6.8 - unable to handle kernel NULL pointer dereference - vsftpd copy_2013-01-22 13:36:00
447264UnspecifiedpythonUNCONFIRMEDdev-lang/python - QA Notice: USE Flag 'hardened' not in IUSE2012-12-15 15:50:35
447396ServerxmwUNCONFIRMEDapp-admin/bcfg2-1.2.3: missing RDEPEND on dev-python/nose2012-12-15 20:27:44
447466ApplicationsbazaarUNCONFIRMEDdev-vcs/bzr-gtk-0.103.0: USE="-nautilus" does not remove /usr/share/nautilus-python/extensions/nauti2012-12-27 23:41:30
447502LibrarysciUNCONFIRMEDdev-python/numpy-1.6.2 - FAIL: test_pareto (test_random.TestRandomDist)2013-01-05 08:15:18
447556Mac OSXprefixUNCONFIRMEDdev-python/virtualenv-1.8.4 emerge failed with error virtualenv-3.3 already exists2013-01-19 18:48:58
447714EbuildspythonUNCONFIRMEDdev-lang/python should have epatch_user2012-12-18 15:46:32
448110DevelopmentsciUNCONFIRMEDdev-python/rpy-2.2.6-r1 fails test testInterruptR - AssertionError: True is not false2013-01-23 17:03:53
448138Coredev-portageUNCONFIRMEDsys-apps/portage no longer works with dev-lang/python-2.52012-12-22 07:22:48
448208EbuildsvoyageurUNCONFIRMEDsys-devel/{llvm,clang} support for C++11 (both), doxygen docs and python (clang) USE flags2013-02-02 22:02:57
448818DevelopmentnirbheekUNCONFIRMEDdev-python/pypy USE=jit does no pax-marking2012-12-27 14:29:36
448892DevelopmentgnomeUNCONFIRMEDdev-python/evolution-python-2.32.0 : Only should be included directly2013-01-10 17:31:37
448896EbuildsgnomeUNCONFIRMEDdev-python/pygobject-3.4.2-r1 (and others): py-compile coming from 2012-12-28 19:03:04
448910Applicationsqmail-bugsUNCONFIRMEDmail-mta/netqmail-1.06 - Force python version to 2.x. - pkg_postinst - SyntaxError: invalid token "02012-12-28 13:08:59
449512Third-Party ToolsdolsenUNCONFIRMEDapp-portage/porthole with python3 - File "/usr/lib/portage/pym/portage/__init__.py", line 224, in __2013-02-10 22:16:25
449716ApplicationsaballierUNCONFIRMEDnet-nntp/hellanzb.0.13-r8 - hellanzb.py: ImportError: cannot import name _NO_FILENO2013-01-02 10:57:50
449720Core systemferringbUNCONFIRMEDsys-apps/pkgcore-0.8.6: SyntaxError during compilation of Python modules for Python 3.22013-01-02 10:12:25
450022ServerdjcUNCONFIRMEDwww-apache/mod_wsgi lacks a way to specify which python version to use2013-01-05 17:09:38
450084Keywording and StabilizationpythonUNCONFIRMEDPlease stabilize =dev-python/virtualenv-clone-0.2.42013-01-05 17:04:31
450086Keywording and StabilizationpythonUNCONFIRMEDPlease stabilize =dev-python/stevedore-0.62013-01-05 17:04:57
450246LibrarygnomeUNCONFIRMEDdev-python/pygtk-2.24.0 - memory leak in _wrap_pango_cairo_create_layout2013-01-05 16:55:14
450340GNOMEgnomeUNCONFIRMEDgnome-extra/hamster-applet-2.32.1 possibly has wrong RESTRICT_PYTHON_ABIS2013-01-06 22:38:36
450384FreeBSDbsdUNCONFIRMEDdev-python/python-ldap for ~x86-fbsd2013-01-05 13:42:07
450392Librarynet-p2pUNCONFIRMEDnet-libs/gupnp-igd-0.2.2 fails to build with USE_PYTHON="... 2.7-pypy-1.9"2013-01-05 17:56:48
450526Applicationsmedia-videoUNCONFIRMEDmedia-video/tovid-0.34_p20120123 - Please rebuild dev-python/pypy:1.9 with the following USE flags e2013-01-07 11:52:42
450886DevelopmentsciUNCONFIRMEDdev-python/numpy-1.6.2 with dev-lang/icc - blas_*_info: libraries mkl,vml,guide not found in [libd2013-01-08 14:09:21
450910LibrarysciUNCONFIRMEDsci-libs/scipy-0.11.0 doesn't build if Python3.3 is present2013-01-14 17:24:03
450944Ebuildsmaintainer-wantedUNCONFIRMEDdev-python/flake8-9999 - code checking using pep8 and pyflakes2013-01-08 20:08:22
451246ApplicationslackUNCONFIRMEDnet-misc/pymazon should RDEPEND on qt4? ( dev-python/PyQt4[X] )2013-01-11 16:25:43
451990LibraryemacsUNCONFIRMEDapp-emacs/python-mode-6.1.0 should install autopair2013-01-15 12:34:04
451996ApplicationsdjcUNCONFIRMEDdev-vcs/hgsubversion-1.4: compilation failure with Python 2.52013-01-15 12:37:58
452178Core systemvapierUNCONFIRMEDapp-misc/pax-utils: w/python3: lddtree.py passes unicode buffers to pyelftools which expects byte bu2013-01-19 16:49:01
452546LibrarychutzpahUNCONFIRMEDdev-python/cov-core should not RDEPEND on dev-python/pytest2013-01-16 16:14:02
452622LibrarysciUNCONFIRMEDdev-python/pytables needs to be recompiled for the exact sci-libs/hdf5 version.2013-01-18 20:03:31
452656ApplicationslackUNCONFIRMEDx11-plugins/screenlets-0.1.2 does not work with python32013-01-18 10:16:15
452910Core systemsystemdUNCONFIRMEDsys-apps/systemd-196[python] needs dev-python/pygobject:3 - ImportError: No module named gi.reposito2013-01-20 17:07:04
453270LibraryalexxyUNCONFIRMEDdev-python/configshell: snapshot request2013-01-21 12:27:59
453272LibraryalexxyUNCONFIRMEDdev-python/rtslib snapshot request2013-01-21 12:28:47
453800Eclasses and ProfilespythonUNCONFIRMEDpython.eclass: dev-python/cython fails to install in environment that contains coreutils on Gentoo/F2013-01-29 23:58:29
453954DevelopmentpythonUNCONFIRMEDdev-python/psycopg - add python 3.3 support2013-01-26 15:33:56
454176DevelopmentpythonUNCONFIRMEDdev-lang/python - LONG_BIT error cross-building from 64-bit to 32-bit2013-01-26 18:17:25
454254Librarysci-mathematicsUNCONFIRMEDdev-python/cvxopt with dev-util/pkgconfig-0.28 - ?2013-02-11 19:55:23
454562ApplicationsroxUNCONFIRMEDrox-extra/archive - deprecation warning about python_mod_cleanup()2013-01-29 19:23:09
455104DevelopmentpythonUNCONFIRMEDdev-python/nose-1.2.1_p2012 fails tests (fails to parse coverage output)2013-02-06 10:00:25
455162DevelopmentssuominenUNCONFIRMEDdev-util/catfish-0.4.0.2 needs dev-python/pygobject:3 in RDEPEND - Error: The required module gi.rep2013-02-04 02:33:15
455210DevelopmentpythonUNCONFIRMEDdev-lang/python-3.2.3 fails to build native Parser/pgen while crosscompiling2013-02-04 19:42:53
455226Prefix SupportprefixUNCONFIRMEDprefix has python3_2 enabled but no python:3.2 ebuilds2013-02-03 02:45:11
455276DevelopmentvapierUNCONFIRMEDdev-cpp/gmock-1.6.9 with python3 fails to execute test suite2013-02-05 11:28:28
455282LibrarytitanofoldUNCONFIRMEDdev-libs/libpqxx-4.0.1 with python 3.x - TypeError: 'str' does not support the buffer interface2013-02-19 08:19:43
456310ApplicationswiredUNCONFIRMEDwww-client/uzbl - /usr/bin/uzbl-browser should specify python version in shebang2013-02-09 16:34:47
456796Keywording and Stabilizationnet-imUNCONFIRMEDnet-im/pyicq-t: sparc keyword request2013-02-11 17:00:43
456846ApplicationscardoeUNCONFIRMEDapp-emulation/libvirt-1.0.2-r1 has broken python bindings2013-02-12 22:17:07
456918UnspecifiedfbisseyUNCONFIRMED[sage-on-gentoo overlay] dev-python/pexpect-2.4-r1 - slot conflict between sage-on-gentoo and gentoo2013-02-12 16:08:33
456994Ebuildsmaintainer-wantedUNCONFIRMEDdev-python/polib - a library to manipulate gettext catalogs file2013-02-13 10:22:11
457528Applicationsx11UNCONFIRMED[x11 overlay] x11-libs/xpyb-9999 with python3 - checking for python include dir... File ""2013-02-15 15:34:34
457600ApplicationsprometheanfireUNCONFIRMEDsys-cluster/swift-1.7.6 has runtime dependency for xattr>=0.4, but I have pyxattr 0.5.02013-02-15 18:34:52
457676DevelopmentpythonUNCONFIRMEDdev-python/pymad-0.6 madmodule.so is segfaulting as soon as it is invoked2013-02-15 17:17:34
457798ApplicationsbillieUNCONFIRMEDapp-portage/pfl-2.3-r2: cron-script doesn't run since 'python2' is not supported.2013-02-20 18:57:15
458256ApplicationsprometheanfireUNCONFIRMEDmedia-sound/spotify-0.8.8.323-r1 spotify-dbus.py isn't python 3.2 compatible2013-02-19 14:22:25
458278DevelopmentqtUNCONFIRMEDdev-util/eric-5.2.7 - RuntimeError: the sip module implements API v9.0 to v9.1 but the PyKDE4.kdeui 2013-02-21 12:24:07
458280GNOMEgnomeUNCONFIRMEDdev-python/pygtk-2.24.0-r3 installing postrm warning: Unable to establish symlink2013-02-21 03:06:11


back



Support us on Content Nation

New Packages

- as rdf newsfeed
- as rss newsfeed
- as Atom newsfeed
2025-03-28
aspell-et - 0.1.21.1-r1
Ebuild name:

app-dicts/aspell-et-0.1.21.1-r1

Description

Aspell () language dictionary

Added to portage

2025-03-28

aspell-fa - 0.11.0-r1
Ebuild name:

app-dicts/aspell-fa-0.11.0-r1

Description

Aspell () language dictionary

Added to portage

2025-03-28

awscli - 1.38.22
Ebuild name:

app-admin/awscli-1.38.22

Description

Universal Command Line Environment for AWS

Added to portage

2025-03-28

bind - 9.20.7
Ebuild name:

net-dns/bind-9.20.7

Description

Berkeley Internet Name Domain - Name Server

Added to portage

2025-03-28

bind-tools - 9.18.0-r1
Ebuild name:

net-dns/bind-tools-9.18.0-r1

Description

bind tools dig, nslookup, host, nsupdate, dnssec-keygen

Added to portage

2025-03-28

boto3 - 1.37.22
Ebuild name:

dev-python/boto3-1.37.22

Description

The AWS SDK for Python

Added to portage

2025-03-28

botocore - 1.37.22
Ebuild name:

dev-python/botocore-1.37.22

Description

Low-level, data-driven core of boto 3

Added to portage

2025-03-28

dash - 2.17.1
Ebuild name:

sci-visualization/dash-2.17.1

Description

Python framework for building ML & data science web apps

Added to portage

2025-03-28

datasets - 3.0.2
Ebuild name:

sci-ml/datasets-3.0.2

Description

Access and share datasets for Audio, Computer Vision, and NLP tasks

Added to portage

2025-03-28

downloader-cli - 0.3.4-r1
Ebuild name:

net-misc/downloader-cli-0.3.4-r1

Description

Simple downloader with an customizable progressbar

Added to portage

2025-03-28

expat - 2.7.1
Ebuild name:

dev-libs/expat-2.7.1

Description

Stream-oriented XML parser library

Added to portage

2025-03-28

firefox-bin - 128.8.1
Ebuild name:

www-client/firefox-bin-128.8.1

Description

Firefox Web Browser

Added to portage

2025-03-28

firefox-bin - 136.0.4
Ebuild name:

www-client/firefox-bin-136.0.4

Description

Firefox Web Browser

Added to portage

2025-03-28

freedm - 0.13.0
Ebuild name:

games-fps/freedm-0.13.0

Description

A 32-level game designed for competitive deathmatch play

Added to portage

2025-03-28

freedm-data - 0.13.0
Ebuild name:

games-fps/freedm-data-0.13.0

Description

Game resources for FreeDM

Added to portage

2025-03-28

freedoom - 0.13.0
Ebuild name:

games-fps/freedoom-0.13.0

Description

A complete free-content single-player focused game based on the Doom engi

Added to portage

2025-03-28

freedoom-data - 0.13.0
Ebuild name:

games-fps/freedoom-data-0.13.0

Description

Game resources for Freedoom Phase 1+2

Added to portage

2025-03-28

fsautocomplete - 0.77.5
Ebuild name:

dev-dotnet/fsautocomplete-0.77.5

Description

F language server using the Language Server Protocol

Added to portage

2025-03-28

gherkin-official - 32.0.1
Ebuild name:

dev-python/gherkin-official-32.0.1

Description

Gherkin parser/compiler for Python

Added to portage

2025-03-28

gnome-shell-extension-bing-wallpaper - 51
Ebuild name:

gnome-extra/gnome-shell-extension-bing-wallpaper-51

Description

Change your wallpaper daily to the bing.com bac

Added to portage

2025-03-28

gnome-shell-extension-dash-to-panel - 68
Ebuild name:

gnome-extra/gnome-shell-extension-dash-to-panel-68

Description

An icon taskbar for the Gnome Shell

Added to portage

2025-03-28

httparty - 0.23.0
Ebuild name:

dev-ruby/httparty-0.23.0

Description

Makes http fun Also, makes consuming restful web services dead easy

Added to portage

2025-03-28

incus - 6.0.3-r1
Ebuild name:

app-containers/incus-6.0.3-r1

Description

Modern, secure and powerful system container and virtual machine mana

Added to portage

2025-03-28

incus - 6.10.1-r1
Ebuild name:

app-containers/incus-6.10.1-r1

Description

Modern, secure and powerful system container and virtual machine man

Added to portage

2025-03-28

linux-apfs-rw - 0.3.13
Ebuild name:

sys-fs/linux-apfs-rw-0.3.13

Description

APFS module for linux, with experimental write support

Added to portage

2025-03-28

mond - 0.11.2
Ebuild name:

dev-lang/mond-0.11.2

Description

Mond is a scripting language for .NET Core

Added to portage

2025-03-28

qtox - 1.18.3-r1
Ebuild name:

net-im/qtox-1.18.3-r1

Description

Instant messaging client using the encrypted p2p Tox protocol

Added to portage

2025-03-28

radicale - 3.5.0
Ebuild name:

www-apps/radicale-3.5.0

Description

A simple CalDAV calendar server

Added to portage

2025-03-28

razer-cli - 2.2.1-r2
Ebuild name:

sys-apps/razer-cli-2.2.1-r2

Description

Command line interface for controlling Razer devices on Linux

Added to portage

2025-03-28

razercommander - 1.2.1.2-r3
Ebuild name:

sys-apps/razercommander-1.2.1.2-r3

Description

GTK contol center for managing Razer peripherals on Linux

Added to portage

2025-03-28

swtpm - 0.10.0-r1
Ebuild name:

app-crypt/swtpm-0.10.0-r1

Description

Libtpms-based TPM emulator

Added to portage

2025-03-28

vivaldi - 7.2.3621.71
Ebuild name:

www-client/vivaldi-7.2.3621.71

Description

A browser for our friends

Added to portage

2025-03-28

vivaldi-snapshot - 7.2.3641.3
Ebuild name:

www-client/vivaldi-snapshot-7.2.3641.3

Description

A browser for our friends

Added to portage

2025-03-28

word_cloud - 1.9.4
Ebuild name:

media-gfx/word_cloud-1.9.4

Description

A little word cloud generator in Python

Added to portage

2025-03-28

youtube-search-python - 1.6.6-r2
Ebuild name:

dev-python/youtube-search-python-1.6.6-r2

Description

Get YouTube video information using link WITHOUT YouTube

Added to portage

2025-03-28

yt-dlp - 2025.03.27
Ebuild name:

net-misc/yt-dlp-2025.03.27

Description

youtube-dl fork with additional features and fixes

Added to portage

2025-03-28

2025-03-27
0xtools - 2.0.3-r4
Ebuild name:

dev-util/0xtools-2.0.3-r4

Description

Always-on profiling for production systems

Added to portage

2025-03-27

absl-py - 2.2.1
Ebuild name:

dev-python/absl-py-2.2.1

Description

Abseil Python Common Libraries

Added to portage

2025-03-27

aspell-el - 0.08.0-r1
Ebuild name:

app-dicts/aspell-el-0.08.0-r1

Description

Aspell () language dictionary

Added to portage

2025-03-27

aspell-en - 2020.12.07.0-r1
Ebuild name:

app-dicts/aspell-en-2020.12.07.0-r1

Description

Aspell () language dictionary

Added to portage

2025-03-27

aspell-eo - 2.1.20000225.2-r1
Ebuild name:

app-dicts/aspell-eo-2.1.20000225.2-r1

Description

Aspell () language dictionary

Added to portage

2025-03-27

aspell-es - 1.11.2-r1
Ebuild name:

app-dicts/aspell-es-1.11.2-r1

Description

Aspell () language dictionary

Added to portage

2025-03-27

aspell-et - 0.1.21.1-r1
Ebuild name:

app-dicts/aspell-et-0.1.21.1-r1

Description

Aspell () language dictionary

Added to portage

2025-03-27

awscli - 1.38.21
Ebuild name:

app-admin/awscli-1.38.21

Description

Universal Command Line Environment for AWS

Added to portage

2025-03-27

bareos - 23.1.3
Ebuild name:

app-backup/bareos-23.1.3

Description

Featureful client/server network backup suite

Added to portage

2025-03-27

bareos - 23.1.3
Ebuild name:

dev-python/bareos-23.1.3

Description

python bindings for bareos network backup suite

Added to portage

2025-03-27

bareos - 24.0.1-r1
Ebuild name:

app-backup/bareos-24.0.1-r1

Description

Featureful client/server network backup suite

Added to portage

2025-03-27

bareos - 24.0.2
Ebuild name:

app-backup/bareos-24.0.2

Description

Featureful client/server network backup suite

Added to portage

2025-03-27

bareos - 24.0.2
Ebuild name:

dev-python/bareos-24.0.2

Description

python bindings for bareos network backup suite

Added to portage

2025-03-27

bareos-webui - 23.1.3
Ebuild name:

www-apps/bareos-webui-23.1.3

Description

Featureful client/server network backup suite

Added to portage

2025-03-27

bareos-webui - 24.0.2
Ebuild name:

www-apps/bareos-webui-24.0.2

Description

Featureful client/server network backup suite

Added to portage

2025-03-27

blazesym_c - 0.1.1
Ebuild name:

dev-libs/blazesym_c-0.1.1

Description

C bindings for blazesym, a library for address symbolization and related

Added to portage

2025-03-27

boto3 - 1.37.21
Ebuild name:

dev-python/boto3-1.37.21

Description

The AWS SDK for Python

Added to portage

2025-03-27

botocore - 1.37.21
Ebuild name:

dev-python/botocore-1.37.21

Description

Low-level, data-driven core of boto 3

Added to portage

2025-03-27

bpftrace - 0.23.0
Ebuild name:

dev-debug/bpftrace-0.23.0

Description

High-level tracing language for eBPF

Added to portage

2025-03-27

btrfs-progs - 6.14
Ebuild name:

sys-fs/btrfs-progs-6.14

Description

Btrfs filesystem utilities

Added to portage

2025-03-27

btrfsutil - 6.14
Ebuild name:

dev-python/btrfsutil-6.14

Description

Library for managing Btrfs filesystems

Added to portage

2025-03-27

c-blosc2 - 2.17.1
Ebuild name:

dev-libs/c-blosc2-2.17.1

Description

Blocking, shuffling and lossless compression library

Added to portage

2025-03-27

chrome-binary-plugins - 135.0.7049.41_beta
Ebuild name:

www-plugins/chrome-binary-plugins-135.0.7049.41_beta

Description

Binary plugins from Google Chrome for use in C

Added to portage

2025-03-27

chromium - 135.0.7049.41
Ebuild name:

www-client/chromium-135.0.7049.41

Description

Open-source version of Google Chrome web browser

Added to portage

2025-03-27

cmake - 4.0.0
Ebuild name:

dev-build/cmake-4.0.0

Description

Cross platform Make

Added to portage

2025-03-27

dnscrypt-proxy - 2.1.8
Ebuild name:

net-dns/dnscrypt-proxy-2.1.8

Description

Flexible DNS proxy, with support for encrypted DNS protocols

Added to portage

2025-03-27

dnsdist - 1.9.8-r1
Ebuild name:

net-dns/dnsdist-1.9.8-r1

Description

A highly DNS-, DoS- and abuse-aware loadbalancer

Added to portage

2025-03-27

dtrx - 8.5.3-r2
Ebuild name:

app-arch/dtrx-8.5.3-r2

Description

Do The Right eXtraction - extracts archives of different formats

Added to portage

2025-03-27

firefox - 136.0.3
Ebuild name:

www-client/firefox-136.0.3

Description

Firefox Web Browser

Added to portage

2025-03-27

gambit - 1.0.6
Ebuild name:

games-board/gambit-1.0.6

Description

Qt-based chess application + engine

Added to portage

2025-03-27

gcompris - 25.0-r1
Ebuild name:

games-kids/gcompris-25.0-r1

Description

Full featured educational application for children from 2 to 10

Added to portage

2025-03-27

golangci-lint - 2.0.2
Ebuild name:

dev-go/golangci-lint-2.0.2

Description

Fast linters runner for Go

Added to portage

2025-03-27

google-api-python-client - 2.166.0
Ebuild name:

dev-python/google-api-python-client-2.166.0

Description

Google API Client for Python

Added to portage

2025-03-27

google-chrome-beta - 135.0.7049.41
Ebuild name:

www-client/google-chrome-beta-135.0.7049.41

Description

The web browser from Google

Added to portage

2025-03-27

googleapis-common-protos-types - 1.19.0
Ebuild name:

dev-ruby/googleapis-common-protos-types-1.19.0

Description

Common protocol buffer types used by Google APIs

Added to portage

2025-03-27

griffe - 1.6.3
Ebuild name:

dev-python/griffe-1.6.3

Description

Signature generator for Python programs

Added to portage

2025-03-27

hepmc - 3.3.1
Ebuild name:

sci-physics/hepmc-3.3.1

Description

Event Record for Monte Carlo Generators

Added to portage

2025-03-27

huggingface_hub - 0.27.1
Ebuild name:

sci-ml/huggingface_hub-0.27.1

Description

a client library to interact with the Hugging Face Hub

Added to portage

2025-03-27

inline-snapshot - 0.20.10
Ebuild name:

dev-python/inline-snapshot-0.20.10

Description

Create and update inline snapshots in your Python tests

Added to portage

2025-03-27

kasts - 24.12.3-r1
Ebuild name:

media-sound/kasts-24.12.3-r1

Description

Convergent podcast application for desktop and mobile

Added to portage

2025-03-27

kclock - 24.12.3-r1
Ebuild name:

kde-misc/kclock-24.12.3-r1

Description

Convergent clock application for Plasma

Added to portage

2025-03-27

legacy-cgi - 2.6.3
Ebuild name:

dev-python/legacy-cgi-2.6.3

Description

Fork of the standard library cgi and cgitb modules (deprecated)

Added to portage

2025-03-27

libreoffice - 25.2.2.2
Ebuild name:

app-office/libreoffice-25.2.2.2

Description

A full office productivity suite

Added to portage

2025-03-27

libreoffice-l10n - 25.2.2.2
Ebuild name:

app-office/libreoffice-l10n-25.2.2.2

Description

Translations for the Libreoffice suite

Added to portage

2025-03-27

libxml2 - 2.13.7
Ebuild name:

dev-libs/libxml2-2.13.7

Description

XML C parser and toolkit

Added to portage

2025-03-27

logger - 1.7.0
Ebuild name:

dev-ruby/logger-1.7.0

Description

Provides a simple logging utility for outputting messages

Added to portage

2025-03-27

lzma - 19.00-r1
Ebuild name:

app-arch/lzma-19.00-r1

Description

LZMA Stream Compressor from the SDK

Added to portage

2025-03-27

microsoft-edge-dev - 136.0.3209.2
Ebuild name:

www-client/microsoft-edge-dev-136.0.3209.2

Description

The web browser from Microsoft

Added to portage

2025-03-27

mupdf - 1.25.2-r1
Ebuild name:

app-text/mupdf-1.25.2-r1

Description

A lightweight PDF viewer and toolkit written in portable C

Added to portage

2025-03-27

nvidia-drivers - 570.123.07
Ebuild name:

x11-drivers/nvidia-drivers-570.123.07

Description

NVIDIA Accelerated Graphics Driver

Added to portage

2025-03-27

opera - 117.0.5408.154
Ebuild name:

www-client/opera-117.0.5408.154

Description

A fast and secure web browser

Added to portage

2025-03-27

opera-beta - 118.0.5461.18
Ebuild name:

www-client/opera-beta-118.0.5461.18

Description

A fast and secure web browser

Added to portage

2025-03-27

opera-developer - 119.0.5482.0
Ebuild name:

www-client/opera-developer-119.0.5482.0

Description

A fast and secure web browser

Added to portage

2025-03-27

planarity - 4.0.0.0
Ebuild name:

sci-mathematics/planarity-4.0.0.0

Description

The edge addition planarity suite of graph algorithms

Added to portage

2025-03-27

polyglot - 2.0.4_p20210322
Ebuild name:

games-board/polyglot-2.0.4_p20210322

Description

Protocol adapter to run UCI chess engines under xboard

Added to portage

2025-03-27

pydantic-core - 2.33.0
Ebuild name:

dev-python/pydantic-core-2.33.0

Description

Core validation logic for pydantic written in Rust

Added to portage

2025-03-27

rfc3161-client - 1.0.1
Ebuild name:

dev-python/rfc3161-client-1.0.1

Description

An Opinionated Python RFC3161 Client

Added to portage

2025-03-27

ristretto - 0.13.4
Ebuild name:

media-gfx/ristretto-0.13.4

Description

A fast and lightweight picture viewer for Xfce

Added to portage

2025-03-27

rpds-py - 0.24.0
Ebuild name:

dev-python/rpds-py-0.24.0

Description

Python bindings to Rust's persistent data structures (rpds)

Added to portage

2025-03-27

scap-driver - 0.20.0
Ebuild name:

dev-debug/scap-driver-0.20.0

Description

Kernel module for dev-debug/sysdig

Added to portage

2025-03-27

screenkey - 1.5_p20230109-r2
Ebuild name:

x11-misc/screenkey-1.5_p20230109-r2

Description

A screencast tool to display your keys inspired by Screenflick

Added to portage

2025-03-27

slixmpp - 1.10.0
Ebuild name:

dev-python/slixmpp-1.10.0

Description

Python 3 library for XMPP

Added to portage

2025-03-27

spyder - 6.0.5
Ebuild name:

dev-python/spyder-6.0.5

Description

The Scientific Python Development Environment

Added to portage

2025-03-27

spyder-kernels - 3.0.3
Ebuild name:

dev-python/spyder-kernels-3.0.3

Description

Kernels used by spyder on its ipython console

Added to portage

2025-03-27

synapse - 1.127.1
Ebuild name:

net-im/synapse-1.127.1

Description

Reference implementation of Matrix homeserver

Added to portage

2025-03-27

sysdig - 0.40.1
Ebuild name:

dev-debug/sysdig-0.40.1

Description

A system exploration and troubleshooting tool

Added to portage

2025-03-27

system-monitoring-center - 2.26.0-r1
Ebuild name:

sys-apps/system-monitoring-center-2.26.0-r1

Description

Multi-featured system monitor GUI written in Python

Added to portage

2025-03-27

tbb - 2022.1.0
Ebuild name:

dev-cpp/tbb-2022.1.0

Description

High level abstract threading library

Added to portage

2025-03-27

unzip - 6.0_p29
Ebuild name:

app-arch/unzip-6.0_p29

Description

unzipper for pkzip-compressed files

Added to portage

2025-03-27

ut2004 - 3369.3-r4
Ebuild name:

games-fps/ut2004-3369.3-r4

Description

Editor's Choice Edition plus Mega Pack for the well-known first-person s

Added to portage

2025-03-27

ut2004-ded - 3369.3-r3
Ebuild name:

games-server/ut2004-ded-3369.3-r3

Description

Unreal Tournament 2004 Linux Dedicated Server

Added to portage

2025-03-27

xfce4-terminal - 1.1.5
Ebuild name:

x11-terms/xfce4-terminal-1.1.5

Description

A terminal emulator for the Xfce desktop environment

Added to portage

2025-03-27

rdf newsfeed | rss newsfeed | Atom newsfeed
- Powered by LeopardCMS - Running on Gentoo -
Copyright 2004-2020 Sascha Nitsch Unternehmensberatung GmbH
Valid XHTML1.1 : Valid CSS : buttonmaker
- Level Triple-A Conformance to Web Content Accessibility Guidelines 1.0 -
- Copyright and legal notices -
Time to create this page: 19.2 ms