from small one page howto to huge articles all in one place

search text in:




Other .linuxhowtos.org sites: www.linuxhowtos.org
toolsntoys.linuxhowtos.org



Last additions:
How to make X listen on port 6000

How to make X listen on port 6000

words:

34

views:

88604

userrating:

average rating: 1.2 (52 votes) (1=very good 6=terrible)


May, 25th 2007:
April, 26th 2007:
Apr, 10th. 2007:
Druckversion . pdf icon
You are here: Portage


Details of virtual/mpi:

Description: Virtual for Message Passing Interface (MPI) v2.0 implementation

available versions:

releasesalphaamd64armhppaia64mipsppcppc64ppc macoss390shsparcx86USE-Flagsdependenciesebuild warnings
mpi-2.0-r8 ~++~--~+---~+cxx
fortran
romio
threads
nullmpi
show
show
Legend:
+ stable
~ testing
- not available
some ebuild warning depend on specific use-flags or architectures, all ebuild-warnings are shown.

Known bugs:
bug IDcomponentassigned tostatusdescriptionlast change
368473Applicationssci-biologyUNCONFIRMEDsci-biology/hmmer-3.0 fails to build with "mpi.c:27:23: error: impl_dummy.: No such file or director2011-06-21 09:31:43
370063DevelopmentembeddedUNCONFIRMEDsys-devel/crossdev: settings masked via arch profiles are not considered with cross-compilers2012-03-08 21:08:25
370761Ebuildsmaintainer-neededUNCONFIRMEDwww-apache/mod_auth_imap2 patch to fix compilation2013-01-04 14:14:29
371009DevelopmentpythonUNCONFIRMEDdev-lang/python-2.7.1-r1 fails to cross compile on mipsel-r3000-linux-uclibc2011-10-02 21:07:28
371601Prefix SupportprefixUNCONFIRMEDmedia-libs/gegl fails to compile2012-06-23 20:46:50
373347Applicationsnet-dialupUNCONFIRMEDnet-dialup/radiusclient fail to cross-compile2011-07-01 19:11:18
373365Applicationsnet-dialupUNCONFIRMEDnet-dialup/radiusclient-ng fail to cross-compile2011-07-01 19:11:38
373369Applicationsnet-dialupUNCONFIRMEDnet-dialup/freeradius-client fail to cross-compile2011-07-03 16:45:23
373387ApplicationsgraphicsUNCONFIRMEDmedia-gfx/hugin-2011.0.0 fail to compile; ld cannot find -lwx_gtk2_gl-2.82012-03-26 20:18:36
373865ApplicationsnetmonUNCONFIRMEDnet-analyzer/tcptraceroute cross compiling fix2011-07-05 00:10:15
373891EbuildsramerethUNCONFIRMEDnet-misc/stunnel build fails: #error OpenSSL library compiled without thread support2012-12-25 04:27:10
373923LibraryjsbronderUNCONFIRMEDsys-cluster/openmpi-1.5.3-r1: mpirun hangs or fails with Segmentation faults2012-02-06 19:20:57
373979EbuildspatrickUNCONFIRMEDapp-emulation/virtualbox-modules-4.0.10 does not compile if KBUILD_OUTPUT != KERNEL_DIR2012-09-11 09:29:19
374043ApplicationsgstreamerUNCONFIRMEDmedia-plugins/gst-plugins-ffmpeg-0.10.11-r1 does not compile on x86 with mstackrealign CFLAG and gcc2011-07-10 10:04:50
374085ApplicationsnetmonUNCONFIRMEDnet-analyzer/tcptrace cross compilation fix2011-07-08 19:12:28
374505ApplicationsbluenessUNCONFIRMEDdev-util/gperf-3.0.4: compile error collect2: ld returned 1 exit status2012-02-04 01:23:02
374667Applicationsnet-dialupUNCONFIRMEDnet-dialup/rp-pppoe fail to cross compile2011-07-10 18:06:14
375117Libraryjmfo1982UNCONFIRMEDIf i686-pc-linux-gnu-windres is present, configure process detects it and attempts to cross-compile2011-12-12 16:27:25
376643ApplicationstommyUNCONFIRMEDdev-libs/libtommath-0.42.0 cross compilation fix2013-01-26 23:25:03
377079ApplicationsmmokrejsUNCONFIRMEDsci-biology/GBrowse-2.39 fails to compile2011-08-02 20:22:32
378557Librarymedia-videoUNCONFIRMEDmedia-libs/libvpx-0.9.7: Compile failure with debug USE flag - "No rule to make target libvpx_g.so, 2012-09-15 05:01:43
378645DevelopmentperlUNCONFIRMEDdev-perl/math-pari ignores profile, and fails when compiling on2011-08-20 17:10:38
378711Applicationsmaintainer-neededUNCONFIRMEDdev-libs/dietlibc-0.33_pre20110403 - allow to install in proper place when cross-compiling2013-01-03 20:15:43
380301Applicationspolynomial-cUNCONFIRMEDapp-emulation/virtualbox-4.1.2 crashes when compiling with -O2 option2012-02-01 09:06:12
380957OtheraltUNCONFIRMEDdev-libs/newt: failed to compile on Mac OSX2011-09-13 15:59:04
380959OtheraltUNCONFIRMEDapp-arch/dpkg: failed to compile on Mac OSX2011-10-08 16:59:55
381105Prefix SupportprefixUNCONFIRMEDdev-lang/nasm-2.09.10: failed to compile in prefix/linux-amd642011-08-30 04:04:34
383055EbuildsnetmonUNCONFIRMEDnet-analyzer/rrdtool[ruby] - fails to compile2011-09-16 22:56:02
383605Core systemalsa-bugsUNCONFIRMEDmedia-libs/alsa-lib-1.0.23 crash when compiled with sys-devel/gcc-4.4.5 / -O32011-09-20 16:11:19
383669Applicationspolynomial-cUNCONFIRMEDapp-emulation/virtualbox-4.1.2: fails to compile due to Java name clash2011-12-21 14:52:14
384311ApplicationsgregkhUNCONFIRMEDnet-misc/bti add patch to allow compilation on non-GNU systems2012-09-23 09:36:41
384401OtheraltUNCONFIRMEDapp-text/texlive-core-2011-r4: failed to compile on prefix/Mac OSX2011-09-25 06:48:07
384617EbuildschainsawUNCONFIRMEDapp-emulation/dynamips fails to compile (w/ can't find a register in class 'GENERAL_REGS')2011-10-31 10:29:49
385219Applicationsx11UNCONFIRMED[x11 overlay] x11-drivers/xf86-input-synaptics-9999 compile fails2011-10-02 18:49:08
385401ApplicationslxnayUNCONFIRMEDapp-admin/packagekit-base-0.6.18 compile error on using python3 as default2012-05-12 22:10:25
385513Developmentmysql-bugsUNCONFIRMEDdev-db/mariadb-5.1.50: failed to compile x86-libs with multilib-overlay enabled2011-10-30 04:20:27
385775Applicationsmaintainer-neededUNCONFIRMEDdev-libs/apr-util-1.3.11 cross compilation fix (libtool related)2013-01-01 20:20:51
385779ApplicationspatrickUNCONFIRMEDapp-admin/apache-tools-2.2.21 cross-compilation fix (libtool related)2013-02-16 13:32:00
385783ApplicationspatrickUNCONFIRMEDwww-servers/apache-2.2.21 cross-compilation fix (libtool related)2013-02-16 13:33:00
385897ApplicationsgraphicsUNCONFIRMEDmedia-gfx/enblend-4.0 fails compilation with use="+image-cache"2011-10-07 00:52:55
389783Ebuildscommon-lispUNCONFIRMEDdev-lisp/clozurecl-1.7 fails to build (unquoted SVN_REVISION in generated compiler commands)2011-11-08 19:59:04
390665FreeBSDbsdUNCONFIRMEDdev-libs/openssl-1.0.0 fails to compile on sparc-fbsd2012-03-19 06:50:59
391675EbuildsproaudioUNCONFIRMEDmedia-plugins/swh-plugins - make x86 extensions optional at compile time2012-07-04 13:47:31
391839HardenedhardenedUNCONFIRMEDcompiling external module which is using file_operations fails2011-11-25 08:09:59
392261UnspecifiedhannoUNCONFIRMEDapp-emulation/dosemu -fno-pic causes build failure when using hardened compiler with PIE2012-12-23 17:38:30
392719Developmentphp-bugsUNCONFIRMEDdev-lang/php does not compile with alternative ROOT2012-03-02 12:58:20
392979Prefix SupportprefixUNCONFIRMEDmedia-gfx/fontforge-20110222-r1 fails to compile on x86-macos2012-05-31 12:28:59
393057FreeBSDbsdUNCONFIRMEDsys-freebsd/freebsd-lib-9.0 fails to compile on sparc-fbsd2011-12-03 18:20:02
393373UnspecifiedvoyageurUNCONFIRMEDx11-libs/qt-gui-4.7.4-r1 fails to compile with sys-devel/dragonegg-3.02012-09-28 13:05:52
393377UnspecifiedvoyageurUNCONFIRMEDx11-libs/pixman-0.24.0 fails to compile with sys-devel/dragonegg-3.02012-09-28 13:05:51
393379EbuildsvoyageurUNCONFIRMEDx11-libs/qt-qt3support-4.7.4 fails to compile with sys-devel/dragonegg-3.02012-09-28 13:05:51
393381EbuildsvoyageurUNCONFIRMEDx11-libs/qt-webkit-4.7.4 fails to compile with sys-devel/dragonegg-3.02012-09-28 13:05:52
393383EbuildsvoyageurUNCONFIRMEDsys-devel/llvm-3.0 fails to compile with sys-devel/dragonegg-3.02012-09-28 13:05:52
393385EbuildsvoyageurUNCONFIRMEDmedia-libs/phonon-vlc-0.4.1 fails to compile with sys-devel/dragonegg-3.02012-09-28 13:05:51
393389KDEvoyageurUNCONFIRMED[kde overlay] kde-base/kdelibs-9999 fails to compile with sys-devel/dragonegg-3.02012-09-28 13:05:51
393391KDEvoyageurUNCONFIRMED[kde overlay] kde-base/katepart-9999 fails to compile with sys-devel/dragonegg-3.02012-09-28 13:05:52
393489EbuildsvoyageurUNCONFIRMEDapp-office/libreoffice-3.5.0.0 fails to compile with sys-devel/dragonegg-3.02012-09-28 13:05:51
397329ApplicationsrubyUNCONFIRMEDdev-lang/ruby-1.9.3_p0 does not compile2012-01-03 21:33:00
399491Core systembase-systemUNCONFIRMEDsys-devel/automake-1.11.2-r1 - fails py-compile-basic.test py-compile-basic2.test py-compile-basedir2012-02-06 11:51:29
400547DevelopmentvoyageurUNCONFIRMEDdev-libs/STLport-5.2.1 does not compile using clang++ due to error in stlport/stl/_locale.h2012-01-25 13:51:23
401669Core systemhardened-kernelUNCONFIRMEDsys-kernel/hardened-sources-2.6.32-r89: Compilation broken on ia642012-02-27 01:07:20
402493ApplicationsadaUNCONFIRMEDdev-ada/adasockets-1.8.4.7 - gnatmake: "listener.adb" compilation error2012-02-07 17:45:08
403551OtheraltUNCONFIRMEDCompilation of gcc-4.5.3-r1 fails with "configure: error: Link tests are not allowed after GCC_NO_EX2012-02-14 10:57:13
405649Ebuildssci-geosciencesUNCONFIRMEDsci-geosciences/openstreetmap-icons-20110601 does not compile2012-03-16 09:50:52
406541ApplicationsmozillaUNCONFIRMEDmail-client/thunderbird-10.0.1-r1 and www-client/firefox-10.0.1-r1 - checking whether the C compiler2012-03-06 13:50:15
406891ApplicationsfontsUNCONFIRMEDmedia-libs/freetype-1.4_pre20080316-r2 compile failure: make[2]: execvp: ../libtool: Permission deni2012-03-05 20:19:14
407099Project-specific documentationembeddedUNCONFIRMEDIncorrect mount options and binfmt_misc mask for "Compiling with qemu-user chroot" secion2012-03-06 17:22:43
407155UnspecifiedjsbronderUNCONFIRMEDsys-cluster/openmpi - Rmpi fails to install under dev-lang/R-2.14.2 due to undefined symbol: mca_bas2012-05-11 12:13:24
407681ApplicationspythonUNCONFIRMEDmedia-sound/quodlibet-2.3.92-r1 segfaults when dev-lang/python-2.7.2-r3 is compiled with the hardene2012-10-06 17:14:29
409583GNOMEfreedesktop-bugsUNCONFIRMEDapp-misc/tracker-9999 fails to compile with sys-devel/gettext-0.182012-04-02 12:35:18
410553UnspecifiedswaponUNCONFIRMEDx11-drivers/xf86-video-virtualbox / app-emulation/virtualbox-guest-additions fail to cross-compile2012-04-03 15:23:22
412909EbuildsembeddedUNCONFIRMEDx11/libxcb: xcb-proto should be RDEPEND instead of DEPEND or cross compiling fail2012-05-10 03:29:04
413167Prefix SupportprefixUNCONFIRMEDsys-fs/fuse-2.9.0: emerge failed at compile phase.2012-04-22 23:17:14
413863DevelopmentpythonUNCONFIRMEDdev-lang/python-3.2.3 - improve cross compilation2012-12-17 14:57:26
414967Core systemtoolchainUNCONFIRMEDsys-devel/gcc-4.6.3 in dev-lang/gforth-0.7.0 - ./engine.c:460:1: internal compiler error: in simplif2012-06-28 17:14:55
415705EbuildsmozillaUNCONFIRMEDdev-libs/nspr-4.9: native-nsinstall: cannot access nspr-config (error installations by cross compila2013-01-05 13:03:46
416587LibraryhannoUNCONFIRMEDmedia-libs/gegl-0.2.0: fails to compile with USE="introspection"2012-11-17 12:46:15
417129Applicationsidl0rUNCONFIRMEDnet-dns/bind-tools-9.8.1[ssl] hardcodes OpenSSL path checks which breaks cross-compiling/etc...2013-02-08 06:12:18
417711ApplicationsgraphicsUNCONFIRMEDmedia-gfx/graphviz-2.26.3-r4 + distcc - iffe: x86_64-pc-linux-gnu-gcc : not a C compiler: should not2012-06-05 19:48:49
418209Core systemtoolchainUNCONFIRMEDcross-armv7m-none-eabi/gcc-4.5.3 stage1 cross-compiler fails2012-11-06 07:23:57
419055GamesgamesUNCONFIRMEDgames-emulation:mednafen-0.9.21 does not compile2012-06-01 20:48:36
419515FreeBSDbsdUNCONFIRMED[keywordreq] dev-util/catalyst and deps compile on amd64-fbsd2012-06-19 23:44:29
421077JavajavaUNCONFIRMEDdev-java/icedtea-7.2.2 compilation fails with Unrecognised option: -XX:-PrintVMOptions2012-10-18 16:15:26
421623DevelopmenthaskellUNCONFIRMEDdev-lang/ghc-7.4.1-r1: unable to compile with portage because it results in a segmentation fault.2012-06-19 16:29:37
422535Prefix SupportprefixUNCONFIRMEDdev-lisp/sbcl-1.0.55-r1: Fail to compile on x64 OS X due to missing binary2012-06-21 05:23:34
422695GNOMEgnomeUNCONFIRMEDmail-client/evolution-3.2.3-r1 fails to compile with USE flag clutter2012-06-20 19:07:36
425332Ebuildsnet-dialupUNCONFIRMEDnet-dialup/capisuite-0.4.5 doesn't compile with python 3.* as active python interpreter2012-07-09 11:37:10
426472Ebuildsmedia-videoUNCONFIRMEDmedia-plugins/live-2012.06.26: QA: compile: please use append-cppflags for preprocessor flags2012-07-18 15:11:05
427430FreeBSDbsdUNCONFIRMEDWhen using latest clang-3.1-r5, sys-freebsd/boot0-9.0/9.1_beta1 will fail to compile2012-11-25 11:39:35
427748Core systemdev-portageUNCONFIRMEDsys-apps/portage-2.2.0_alpha120 crashing when compile fails2012-07-23 18:57:51
427808EbuildsvoyageurUNCONFIRMEDx11-base/xorg-server-1.12.3 crashing at start-up when compiled with sys-devel/clang2012-12-31 12:32:19
427932JavajavaUNCONFIRMED[java-overlay] dev-java/j3d-core-1.5.1: compile phase fails with image resolution errors2012-07-24 19:35:50
428174Libraryx11UNCONFIRMEDmedia-libs/mesa-8.1_rc1_pre20120724 USE=r600-llvm-compiler - R600RegisterInfo.td:4762:27997: error: 2012-12-08 03:34:08
429442EbuildsprintingUNCONFIRMEDapp-text/ghostscript-gpl - disable endian check when cross-compiling2012-08-02 13:07:09
429564ApplicationsangelosUNCONFIRMEDgnome-extra/docky-2.1.4 compile error with mono 2.11.12012-09-11 06:58:49
429626CatalystcatalystUNCONFIRMEDdev-util/catalyst-2.0.10.1: get_libdir() return an empty value when cross compiling2012-08-13 13:01:10
430274EbuildspatrickUNCONFIRMEDwww-servers/apache-2.2.22-r1: modules aren't compiled with -fPIC2013-02-16 13:34:26
430996EbuildsradioUNCONFIRMEDnet-wireless/gnuradio-3.6.1-r1 does not byte-compile grc_gnuradio package2012-08-12 11:35:18
431036ApplicationspchristUNCONFIRMEDdev-lisp/sbcl fails to compile (when the build system is testing "sb-posix")2012-08-30 18:50:48
431986ApplicationsgraphicsUNCONFIRMEDmedia-gfx/luminance-hdr-2.3.0 - crash when loading any hdr file if compiled with -march=core22012-08-20 12:08:47
432106DevelopmentradhermitUNCONFIRMEDdev-libs/protobuf-2.4.0a fails to crosscompile: …/protoc: cannot execute binary file2013-01-01 20:30:56
432296Developmentmaintainer-neededUNCONFIRMEDdev-libs/apr-1.4.5 fails to crosscompile: configure: error: cannot run test program while cross comp2013-01-03 18:43:02
432300Core systemtoolchainUNCONFIRMEDsys-devel/gcc-4.5.3-r2 fails to crosscompile: gcc-4.5.3/libstdc++-v3/src/atomic.cc:91:62: error: inv2012-08-22 14:43:31
432410FreeBSDamd64-fbsdUNCONFIRMED[keywordreq] some packages compile and works on amd64-fbsd2012-11-09 11:06:06
432980Applicationscommon-lispUNCONFIRMEDdev-lisp/sbcl-1.0.55-r1 fails to compile with "The value 18446744073 is not of type (UNSIGNED-BYTE 32012-08-29 09:14:51
433056Core systemtoolchainUNCONFIRMEDsys-devel/gcc-4.7.1 fails to crosscompile with cross-powerpc64-unknown-linux-gnu/gcc-4.6.3: cc1: err2012-10-03 01:27:13
433375Applicationsmedia-videoUNCONFIRMEDmedia-video/cinelerra ignores LDFLAGS, causing multilib compile failure2012-11-20 12:23:36
433972Prefix SupportprefixUNCONFIRMEDapp-text/tree-1.6.0-r1: failed to compile on Mac OSX Mountain Lion2012-10-10 01:23:24
434222JavajavaUNCONFIRMEDdev-java/ant-ivy-2.0.0 compilation failed2012-09-07 15:04:44
434908Core systemtoolchainUNCONFIRMEDsys-devel/gcc-4.6.3: ICE in .../work/qemu-kvm-1.1.1/target-i386/op_helper.c:3650:1: internal compile2013-01-04 21:00:13
435410Applicationsbase-systemUNCONFIRMEDapp-arch/zip-3.0: bzip2 flag broken, unicode flag broken, cross compilation broken2013-02-16 13:20:59
435742Applicationsphp-bugsUNCONFIRMEDdev-php/igbinary-1.1.1-r1 with dev-lang/php[threads] compilation fails with: apc_serializer.h:57:5: 2012-09-21 16:43:14
436636JavatoolchainUNCONFIRMEDsys-devel/gcc-{4.5,4.6,4.7?}: gcj fails to compile java source code on ia64 (hardened) - Exception i2012-12-14 08:15:05
438188Developmentcommon-lispUNCONFIRMEDdev-lisp/clisp-2.48-r1 - fails to compile with ENOMEM, although there is plenty left2013-01-01 04:00:02
438702Core systemldap-bugsUNCONFIRMEDsys-auth/nss_ldap-265 encodes wrong libc version in library name if compiling for $ROOT2012-10-17 13:23:33
440660Eclasses and ProfilesadaUNCONFIRMEDgnatbuild.eclass: /etc/ada/primary_compilers: No such file or directory2012-10-31 21:52:05
442326ApplicationsqemuUNCONFIRMEDsys-firmware/sgabios-0.1_pre8 - Compile phase failure - ld: i386:x86-64 architecture of input file `2012-11-08 10:43:27
442420ApplicationsdilfridgeUNCONFIRMEDmedia-libs/opencv-2.4.3 with USE=cuda : /opt/cuda/bin/nvcc compiles in /tmp which results in "No spa2013-02-04 21:24:25
442958DevelopmentvoyageurUNCONFIRMEDsys-devel/llvm fails to cross compile2012-11-13 16:20:28
442984KDEkdeUNCONFIRMEDapp-office/calligra-l10n-2.5.3 does not compile.2012-11-15 14:52:36
444544EbuildshaskellUNCONFIRMED[haskell overlay] dev-haskell/accelerate-cuda passes CFLAGS into non-gcc compiler2012-11-24 17:29:02
445120LibrarypatrickUNCONFIRMEDsys-libs/tdb-1.2.10 - Compilatin phase failed - [Errno 2] No such file or directory: '/var/tmp/porta2012-12-08 15:46:16
445154ApplicationsmozillaUNCONFIRMEDwww-client/firefox-17.0-r1[-libnotify] and mail-client/thunderbird-17.0-r1[-libnotify] always compil2012-12-17 15:23:57
446172Core systempam-bugsUNCONFIRMEDsys-libs/pam-1.1.5 fails to cross-compile because flex is not installed in the target2013-01-09 09:31:35
446184Applicationsnet-p2pUNCONFIRMEDnet-libs/libtorrent-0.13.2: fails to cross compile2012-12-06 05:02:50
446186Applicationsnet-p2pUNCONFIRMEDnet-p2p/rtorrent-0.9.2: bad configure check prevents cross-compilation2012-12-06 05:03:19
446190ServersambaUNCONFIRMEDnet-fs/samba-3.5.19: cross compile fixes2012-12-06 05:03:46
446796ApplicationsprefixUNCONFIRMEDapp-misc/pax-utils: src_install tries to compile stuff2013-01-02 17:41:59
446866UnspecifiedmozillaUNCONFIRMEDdev-libs/nspr-4.9.2 - checking whether the C compiler (gcc -Os -pipe -march=armv6j -mfpu=vfp -mfloat2013-01-05 13:03:54
446968Applicationsmaintainer-neededUNCONFIRMEDnet-misc/netkit-telnetd-0.17-r10 - Use native gcc instead of CC (cross compile issue)2013-02-16 13:35:19
447408DevelopmentvoyageurUNCONFIRMEDsys-devel/llvm-3.1r2 - X86ELFWriterInfo.cpp:85:1: interner Compiler-Fehler: Speicherzugriffsfehler2012-12-22 12:30:47
447702Core systemhardened-kernelUNCONFIRMEDsys-kernel/hardened-sources-3.7.0 fails to crosscompile for Ski-Simulator: include/linux/gfp.h:295:22012-12-19 09:10:48
447708Core systemtoolchainUNCONFIRMEDsys-devel/gcc-4.7.2 fails to crosscompile for mingw64: options.c:952:3: error: ‘HAVE_GAS_ALIGNED_COM2013-02-18 16:35:04
447826Core systembluenessUNCONFIRMEDsys-kernel/hardened-sources-2.6.32-r143 fails to compile for ia64: include/linux/random.h:91:19: err2013-01-18 23:15:20
448016Ebuildsmaintainer-wantedUNCONFIRMEDapp-misc/hardening-wrapper - New package. - Compiler wrapper to enable security hardening flags2012-12-26 21:51:22
448062ApplicationswilliamhUNCONFIRMEDapp-accessibility/speech-dispatcher-0.7.1-r1 src_compile(): mv: cannot stat '.deps/spd_audio.Tpo': N2013-01-01 12:02:28
448124DevelopmenttoolchainUNCONFIRMEDsys-devel-gcc-4.5.3: internal compiler error on sci-biology/ncbi-tools++-9.0.0/work/ncbi_cxx--9_0_0/2012-12-26 17:28:43
448348Core systemjlecUNCONFIRMEDsys-fs/aufs-util-3.6 fails to crosscompile: ./ver: ./ver: cannot execute binary file2012-12-25 16:14:13
448352Core systemnet-mailUNCONFIRMEDdev-libs/cyrus-sasl-2.1.25-r3 fails to crosscompile: ./makemd5: ./makemd5: cannot execute binary fil2012-12-25 18:07:35
448354Core systemrobbat2UNCONFIRMEDsys-fs/lvm2-2.02.97-r1 fails to crosscompile: configure: error: thin_check not found in path2013-01-19 16:12:30
448624genkernelgenkernelUNCONFIRMEDlast step of compile_kernel() does not respect ${KERNEL_OUTPUTDIR} in genkernel-3.4.452012-12-26 01:26:22
448896EbuildsgnomeUNCONFIRMEDdev-python/pygobject-3.4.2-r1 (and others): py-compile coming from 2012-12-28 19:03:04
449526Applicationsnet-imUNCONFIRMEDnet-im/pidgin-2.10.6 fails to compile with USE="eds" and gnome-extra/evolution-data-server-3.62013-02-12 16:15:52
449720Core systemferringbUNCONFIRMEDsys-apps/pkgcore-0.8.6: SyntaxError during compilation of Python modules for Python 3.22013-01-02 10:12:25
450260GNOMEgnomeUNCONFIRMEDnet-im/empathy-3.6.2-r2 fails to compile2013-01-04 21:31:54
450528Serverldap-bugsUNCONFIRMEDnet-nds/openldap-2.4.30: configure: error: crossing compiling: use --with-yielding_select=yes|no|man2013-01-07 11:32:59
451056DevelopmentjsbronderUNCONFIRMEDsys-cluster/mpich2-1.2.1_p1-r1 fails to crosscompile: configure: error: Unable to determine Fortran 2013-01-09 15:17:48
451456LibraryqtUNCONFIRMED[qt overlay] Qt5 packages try to link against already installed versions during recompilation2013-02-14 11:59:11
451996ApplicationsdjcUNCONFIRMEDdev-vcs/hgsubversion-1.4: compilation failure with Python 2.52013-01-15 12:37:58
452622LibrarysciUNCONFIRMEDdev-python/pytables needs to be recompiled for the exact sci-libs/hdf5 version.2013-01-18 20:03:31
454354Applicationsidella4UNCONFIRMEDapp-emulation/xen-tools-4.2.1 - Fails to compile with KeyError: '.text.asm.out/../src/smp.c.68'2013-02-01 21:20:22
454568Librarymedia-videoUNCONFIRMEDmedia-libs/mlt-0.8.8 - luma.c:92:11: erreur interne du compilateur: dans build2_stat, à tree.c:38032013-02-01 10:14:17
455210DevelopmentpythonUNCONFIRMEDdev-lang/python-3.2.3 fails to build native Parser/pgen while crosscompiling2013-02-04 19:42:53
455238LibraryprintingUNCONFIRMEDmedia-libs/vigra-1.7.1-r1 failed (compile phase): ImportError: No module named nose2013-02-05 01:00:18
456172ApplicationstommyUNCONFIRMEDdev-vcs/subversion-(1.7.* ?) needs dev-db/sqlite:3 to be compiled with threadsafe2013-02-11 11:20:24
456256Librarymaintainer-neededUNCONFIRMEDdev-libs/libical fails when cross compiling2013-02-12 02:26:18
456792LibrarycppUNCONFIRMEDdev-libs/boost-1.52.0-r5 fails to compile with custom /etc/site-config.jam: could not find main targ2013-02-12 22:13:10
456820Developmentphp-bugsUNCONFIRMEDdev-lang/php-5.3.21-r2 fails to compile with USE="ssl"2013-02-12 08:54:30
456932JavajavaUNCONFIRMEDERROR: dev-java/netbeans-javafx-7.2 failed (compile phase)2013-02-13 20:19:37
456984ServerjsbronderUNCONFIRMEDsys-cluster/mpich2-1.5 should not DEPEND on sys-apps/hwloc2013-02-14 15:14:18
457570ApplicationstoveUNCONFIRMEDapp-shells/zsh fails to compile with ncurses[tinfo]2013-02-14 19:59:26
457810Core systemjlecUNCONFIRMEDsys-fs/aufs3-3_p20130207 with USE="inotify" and sys-kernel/hardened-sources-3.7.5 doesn't compile - 2013-02-17 09:10:21
458020Core systemtoolchainUNCONFIRMED[toolchain overlay] sys-libs/glibc-2.6.1 does not compile with up to date gcc and binutils (via cros2013-02-18 04:43:58
458186ApplicationsreavertmUNCONFIRMED=dev-util/ddd-3.3.12-r3: fails to compile with ncurses[tinfo]2013-02-19 20:20:58
458426EbuildskernelUNCONFIRMED=sys-kernel/gentoo-sources-3.8.0 fails to compile: invalid operands to binary == (have ‘kuid_t’ and 2013-02-20 11:26:46
458550Applicationsbug-wranglersUNCONFIRMEDmedia-libs/mesa-9.1_rc2 cannot compile2013-02-21 08:35:33
458554Applicationsbug-wranglersUNCONFIRMEDlibarchive-3.0.4-r1 and libarchive-3.1.1 fail compile when using gcc i686-pc-linux-gnu-4.5.4 but not2013-02-21 09:28:12


back



Support us on Content Nation

New Packages

- as rdf newsfeed
- as rss newsfeed
- as Atom newsfeed
2026-09-22
atpublic - 8.0.1
Ebuild name:

dev-python/atpublic-8.0.1

Description

A decorator to populate __all__ and the module globals

Added to portage

2026-09-22

aws-c-common - 1.0.1
Ebuild name:

dev-libs/aws-c-common-1.0.1

Description

Core c99 package for AWS SDK for C

Added to portage

2026-09-22

aws-c-s3 - 1.1.3
Ebuild name:

dev-libs/aws-c-s3-1.1.3

Description

AWS C S3 async library

Added to portage

2026-09-22

awscli - 2.36.50
Ebuild name:

app-admin/awscli-2.36.50

Description

Universal Command Line Environment for AWS

Added to portage

2026-09-22

boto3 - 1.43.99
Ebuild name:

dev-python/boto3-1.43.99

Description

The AWS SDK for Python

Added to portage

2026-09-22

botocore - 1.43.99
Ebuild name:

dev-python/botocore-1.43.99

Description

Low-level, data-driven core of boto 3

Added to portage

2026-09-22

breathe - 5.0.0
Ebuild name:

dev-python/breathe-5.0.0

Description

Sphinx Doxygen renderer

Added to portage

2026-09-22

discord - 1.0.159
Ebuild name:

net-im/discord-1.0.159

Description

All-in-one voice and text chat for gamers

Added to portage

2026-09-22

dist-kernel - 6.12.111
Ebuild name:

virtual/dist-kernel-6.12.111

Description

Virtual to depend on any Distribution Kernel

Added to portage

2026-09-22

dist-kernel - 6.18.53
Ebuild name:

virtual/dist-kernel-6.18.53

Description

Virtual to depend on any Distribution Kernel

Added to portage

2026-09-22

dist-kernel - 7.2.7
Ebuild name:

virtual/dist-kernel-7.2.7

Description

Virtual to depend on any Distribution Kernel

Added to portage

2026-09-22

gamescope - 3.16.29
Ebuild name:

gui-wm/gamescope-3.16.29

Description

Efficient micro-compositor for running games

Added to portage

2026-09-22

gentoo-kernel - 6.12.111
Ebuild name:

sys-kernel/gentoo-kernel-6.12.111

Description

Linux kernel built with Gentoo patches

Added to portage

2026-09-22

gentoo-kernel - 6.18.53
Ebuild name:

sys-kernel/gentoo-kernel-6.18.53

Description

Linux kernel built with Gentoo patches

Added to portage

2026-09-22

gentoo-kernel - 7.2.7
Ebuild name:

sys-kernel/gentoo-kernel-7.2.7

Description

Linux kernel built with Gentoo patches

Added to portage

2026-09-22

gentoo-kernel-bin - 6.12.111
Ebuild name:

sys-kernel/gentoo-kernel-bin-6.12.111

Description

Pre-built Linux kernel with Gentoo patches

Added to portage

2026-09-22

gentoo-kernel-bin - 6.18.53
Ebuild name:

sys-kernel/gentoo-kernel-bin-6.18.53

Description

Pre-built Linux kernel with Gentoo patches

Added to portage

2026-09-22

gentoo-kernel-bin - 7.2.7
Ebuild name:

sys-kernel/gentoo-kernel-bin-7.2.7

Description

Pre-built Linux kernel with Gentoo patches

Added to portage

2026-09-22

gentoo-kernel-modprep - 6.12.111
Ebuild name:

sys-kernel/gentoo-kernel-modprep-6.12.111

Description

Minimal subset of gentoo-kernel-bin for building modules,

Added to portage

2026-09-22

gentoo-kernel-modprep - 6.18.53
Ebuild name:

sys-kernel/gentoo-kernel-modprep-6.18.53

Description

Minimal subset of gentoo-kernel-bin for building modules,

Added to portage

2026-09-22

gentoo-kernel-modprep - 7.2.7
Ebuild name:

sys-kernel/gentoo-kernel-modprep-7.2.7

Description

Minimal subset of gentoo-kernel-bin for building modules, fo

Added to portage

2026-09-22

grub - 2.16
Ebuild name:

sys-boot/grub-2.16

Description

GNU GRUB boot loader

Added to portage

2026-09-22

howm - 1.5.0
Ebuild name:

app-emacs/howm-1.5.0

Description

Note-taking tool on Emacs

Added to portage

2026-09-22

jupyterlab - 4.5.11
Ebuild name:

dev-python/jupyterlab-4.5.11

Description

JupyterLab computational environment

Added to portage

2026-09-22

jupyterlab - 4.6.4
Ebuild name:

dev-python/jupyterlab-4.6.4

Description

JupyterLab computational environment

Added to portage

2026-09-22

kdav - 6.30.0-r1
Ebuild name:

kde-frameworks/kdav-6.30.0-r1

Description

DAV protocol implemention with KJobs

Added to portage

2026-09-22

kdeplasma-addons - 6.7.5-r1
Ebuild name:

kde-plasma/kdeplasma-addons-6.7.5-r1

Description

Extra Plasma applets and engines

Added to portage

2026-09-22

krdp - 6.7.5-r1
Ebuild name:

kde-plasma/krdp-6.7.5-r1

Description

Library and examples for creating an RDP server

Added to portage

2026-09-22

kwin - 6.7.5-r1
Ebuild name:

kde-plasma/kwin-6.7.5-r1

Description

Flexible, composited Window Manager for windowing systems on Linux

Added to portage

2026-09-22

kwin-x11 - 6.7.5-r1
Ebuild name:

kde-plasma/kwin-x11-6.7.5-r1

Description

Flexible, composited X window manager

Added to portage

2026-09-22

lazy-loader - 0.6
Ebuild name:

dev-python/lazy-loader-0.6

Description

Populate library namespace without incurring immediate import costs

Added to portage

2026-09-22

lgogdownloader - 3.19
Ebuild name:

games-util/lgogdownloader-3.19

Description

Unofficial GOG.com downloader for Linux

Added to portage

2026-09-22

mariadb-connector-c - 3.4.9-r2
Ebuild name:

dev-db/mariadb-connector-c-3.4.9-r2

Description

C client library for MariaDB/MySQL

Added to portage

2026-09-22

multidict - 6.9.1
Ebuild name:

dev-python/multidict-6.9.1

Description

multidict implementation

Added to portage

2026-09-22

networkx - 3.7
Ebuild name:

dev-python/networkx-3.7

Description

Python tools to manipulate graphs and complex networks

Added to portage

2026-09-22

notebook - 7.6.3
Ebuild name:

dev-python/notebook-7.6.3

Description

Jupyter Interactive Notebook

Added to portage

2026-09-22

plasma-workspace - 6.7.5-r1
Ebuild name:

kde-plasma/plasma-workspace-6.7.5-r1

Description

KDE Plasma workspace

Added to portage

2026-09-22

platformdirs - 4.11.12
Ebuild name:

dev-python/platformdirs-4.11.12

Description

A small Python module for determining appropriate platform-specific

Added to portage

2026-09-22

postfix - 3.12_pre20260921
Ebuild name:

mail-mta/postfix-3.12_pre20260921

Description

A fast and secure drop-in replacement for sendmail

Added to portage

2026-09-22

powerdevil - 6.7.5-r2
Ebuild name:

kde-plasma/powerdevil-6.7.5-r2

Description

Power management for KDE Plasma Shell

Added to portage

2026-09-22

tifffile - 2026.9.20
Ebuild name:

dev-python/tifffile-2026.9.20

Description

Read and write TIFF files

Added to portage

2026-09-22

trove-classifiers - 2026.9.21.13
Ebuild name:

dev-python/trove-classifiers-2026.9.21.13

Description

Canonical source for classifiers on PyPI (pypi.org)

Added to portage

2026-09-22

vanilla-kernel - 6.12.111
Ebuild name:

sys-kernel/vanilla-kernel-6.12.111

Description

Linux kernel built from vanilla upstream sources

Added to portage

2026-09-22

vanilla-kernel - 6.18.53
Ebuild name:

sys-kernel/vanilla-kernel-6.18.53

Description

Linux kernel built from vanilla upstream sources

Added to portage

2026-09-22

vanilla-kernel - 7.2.7
Ebuild name:

sys-kernel/vanilla-kernel-7.2.7

Description

Linux kernel built from vanilla upstream sources

Added to portage

2026-09-22

virtualenv - 21.9.1
Ebuild name:

dev-python/virtualenv-21.9.1

Description

Virtual Python Environment builder

Added to portage

2026-09-22

watchfiles - 1.3.0
Ebuild name:

dev-python/watchfiles-1.3.0

Description

Simple, modern file watching and code reload in Python

Added to portage

2026-09-22

webkit-gtk - 2.54.0-r410
Ebuild name:

net-libs/webkit-gtk-2.54.0-r410

Description

Open source web browser engine

Added to portage

2026-09-22

webkit-gtk - 2.54.0-r600
Ebuild name:

net-libs/webkit-gtk-2.54.0-r600

Description

Open source web browser engine

Added to portage

2026-09-22

2026-09-21
calligra - 26.08.1
Ebuild name:

app-office/calligra-26.08.1

Description

KDE Office Suite

Added to portage

2026-09-21

ddcutil - 2.2.7
Ebuild name:

app-misc/ddcutil-2.2.7

Description

Program for querying and changing monitor settings

Added to portage

2026-09-21

dos2unix - 7.5.7
Ebuild name:

app-text/dos2unix-7.5.7

Description

Convert DOS or MAC text files to UNIX format or vice versa

Added to portage

2026-09-21

ffmpeg - 8.1.3
Ebuild name:

media-video/ffmpeg-8.1.3

Description

Complete solution to record/convert/stream audio and video

Added to portage

2026-09-21

ffmpeg-compat - 8.1.3
Ebuild name:

media-video/ffmpeg-compat-8.1.3

Description

Complete solution to record/convert/stream audio and video

Added to portage

2026-09-21

fzf - 0.74.4
Ebuild name:

app-shells/fzf-0.74.4

Description

General-purpose command-line fuzzy finder, written in Golang

Added to portage

2026-09-21

gcc - 17.0.0_p20260920
Ebuild name:

sys-devel/gcc-17.0.0_p20260920

Description

The GNU Compiler Collection

Added to portage

2026-09-21

geekbench - 7.1.0
Ebuild name:

app-benchmarks/geekbench-7.1.0

Description

A Cross-Platform Benchmark for Android, iOS, Linux, MacOS and Window

Added to portage

2026-09-21

geekbench-ai - 1.8.0
Ebuild name:

app-benchmarks/geekbench-ai-1.8.0

Description

A Cross-Platform AI Benchmark for Android, iOS, Linux, MacOS and

Added to portage

2026-09-21

gemato - 20.15
Ebuild name:

app-portage/gemato-20.15

Description

Stand-alone Manifest generation & verification tool

Added to portage

2026-09-21

gentoo-sources - 6.12.111
Ebuild name:

sys-kernel/gentoo-sources-6.12.111

Description

Full sources including the Gentoo patchset for the . kernel tree

Added to portage

2026-09-21

gentoo-sources - 6.18.53
Ebuild name:

sys-kernel/gentoo-sources-6.18.53

Description

Full sources including the Gentoo patchset for the . kernel tree

Added to portage

2026-09-21

gentoo-sources - 7.2.7
Ebuild name:

sys-kernel/gentoo-sources-7.2.7

Description

Full sources including the Gentoo patchset for the . kernel tree

Added to portage

2026-09-21

git-sources - 7.3_rc4
Ebuild name:

sys-kernel/git-sources-7.3_rc4

Description

The very latest -git version of the Linux kernel

Added to portage

2026-09-21

gzip - 1.15
Ebuild name:

app-arch/gzip-1.15

Description

Standard GNU compressor

Added to portage

2026-09-21

hatchling - 1.32.4
Ebuild name:

dev-python/hatchling-1.32.4

Description

Modern, extensible Python build backend

Added to portage

2026-09-21

html5-parser - 0.5.0
Ebuild name:

dev-python/html5-parser-0.5.0

Description

Fast C based HTML 5 parsing for python

Added to portage

2026-09-21

inkscape - 1.4.4-r1
Ebuild name:

media-gfx/inkscape-1.4.4-r1

Description

SVG based generic vector-drawing program

Added to portage

2026-09-21

intel-graphics-compiler - 2.41.9
Ebuild name:

dev-util/intel-graphics-compiler-2.41.9

Description

LLVM-based OpenCL compiler for OpenCL targetting Intel Gen

Added to portage

2026-09-21

jdupes - 1.31.2
Ebuild name:

app-misc/jdupes-1.31.2

Description

Identify duplicate files on the filesystem

Added to portage

2026-09-21

kitty - 0.49.0
Ebuild name:

x11-terms/kitty-0.49.0

Description

Fast, feature-rich, GPU-based terminal

Added to portage

2026-09-21

kitty-shell-integration - 0.49.0
Ebuild name:

x11-terms/kitty-shell-integration-0.49.0

Description

Shell integration scripts for kitty, a GPU-based terminal

Added to portage

2026-09-21

kitty-terminfo - 0.49.0
Ebuild name:

x11-terms/kitty-terminfo-0.49.0

Description

Terminfo for kitty, a GPU-based terminal emulator

Added to portage

2026-09-21

knowit - 0.7.0
Ebuild name:

dev-python/knowit-0.7.0

Description

Know better your media files

Added to portage

2026-09-21

lowdown - 3.2.1
Ebuild name:

app-text/lowdown-3.2.1

Description

Markdown translator producing HTML5, roff documents in the ms and man format

Added to portage

2026-09-21

md4c - 0.6.0
Ebuild name:

dev-libs/md4c-0.6.0

Description

C Markdown parser. Fast, SAX-like interface, CommonMark Compliant

Added to portage

2026-09-21

nodejs - 26.9.0
Ebuild name:

net-libs/nodejs-26.9.0

Description

A JavaScript runtime built on Chrome's V8 JavaScript engine

Added to portage

2026-09-21

ollama - 0.34.2
Ebuild name:

sci-ml/ollama-0.34.2

Description

Get up and running with Llama 3, Mistral, Gemma, and other language models

Added to portage

2026-09-21

pahole - 1.32
Ebuild name:

dev-util/pahole-1.32

Description

pahole (Poke-a-Hole) and other DWARF utilities

Added to portage

2026-09-21

poetry - 2.5.1
Ebuild name:

dev-python/poetry-2.5.1

Description

A frontend for poetry - a python dependency management and packaging tool

Added to portage

2026-09-21

poppler - 26.09.0
Ebuild name:

app-text/poppler-26.09.0

Description

PDF rendering library based on the xpdf-3.0 code base

Added to portage

2026-09-21

pyparsing - 3.3.3
Ebuild name:

dev-python/pyparsing-3.3.3

Description

Easy-to-use Python module for text parsing

Added to portage

2026-09-21

pypiserver - 2.4.2
Ebuild name:

dev-python/pypiserver-2.4.2

Description

Minimal PyPI server

Added to portage

2026-09-21

pypy - 3.11.8.0.0
Ebuild name:

dev-lang/pypy-3.11.8.0.0

Description

A fast, compliant alternative implementation of the Python () language

Added to portage

2026-09-21

pypy3-exe - 3.11.8.0.0
Ebuild name:

dev-lang/pypy3-exe-3.11.8.0.0

Description

PyPy3.11 executable (build from source)

Added to portage

2026-09-21

pypy3-exe-bin - 3.11.8.0.0
Ebuild name:

dev-lang/pypy3-exe-bin-3.11.8.0.0

Description

PyPy3.11 executable (pre-built version)

Added to portage

2026-09-21

qtile - 0.37.1
Ebuild name:

x11-wm/qtile-0.37.1

Description

A full-featured, hackable tiling window manager written in Python

Added to portage

2026-09-21

scribus - 1.7.4_pre20260918
Ebuild name:

app-office/scribus-1.7.4_pre20260918

Description

Desktop publishing (DTP) and layout program

Added to portage

2026-09-21

simdjson - 4.6.11
Ebuild name:

dev-libs/simdjson-4.6.11

Description

SIMD accelerated C++ JSON library

Added to portage

2026-09-21

systemd-utils - 255.18
Ebuild name:

sys-apps/systemd-utils-255.18

Description

Utilities split out from systemd for OpenRC users

Added to portage

2026-09-21

tmux - 3.7c
Ebuild name:

app-misc/tmux-3.7c

Description

Terminal multiplexer

Added to portage

2026-09-21

uutils-coreutils - 0.12.0
Ebuild name:

sys-apps/uutils-coreutils-0.12.0

Description

GNU coreutils rewritten in Rust

Added to portage

2026-09-21

vanilla-sources - 6.12.111
Ebuild name:

sys-kernel/vanilla-sources-6.12.111

Description

Full sources for the Linux kernel

Added to portage

2026-09-21

vanilla-sources - 6.18.53
Ebuild name:

sys-kernel/vanilla-sources-6.18.53

Description

Full sources for the Linux kernel

Added to portage

2026-09-21

vanilla-sources - 7.2.7
Ebuild name:

sys-kernel/vanilla-sources-7.2.7

Description

Full sources for the Linux kernel

Added to portage

2026-09-21

vector - 1.9.0
Ebuild name:

dev-python/vector-1.9.0

Description

Vector classes and utilities

Added to portage

2026-09-21

wcd - 6.0.7
Ebuild name:

app-misc/wcd-6.0.7

Description

Wherever Change Directory

Added to portage

2026-09-21

wdiff - 1.2.3
Ebuild name:

app-text/wdiff-1.2.3

Description

Create a diff disregarding formatting

Added to portage

2026-09-21

rdf newsfeed | rss newsfeed | Atom newsfeed
Copyright 2004-2025 Sascha Nitsch Unternehmensberatung GmbH
- Copyright and legal notices -
Time to create this page: 31.2 ms