from small one page howto to huge articles all in one place

search text in:




Other .linuxhowtos.org sites: www.linuxhowtos.org
toolsntoys.linuxhowtos.org



Last additions:
How to make X listen on port 6000

How to make X listen on port 6000

words:

34

views:

89157

userrating:

average rating: 1.2 (52 votes) (1=very good 6=terrible)


May, 25th 2007:
April, 26th 2007:
Apr, 10th. 2007:
Druckversion . pdf icon
You are here: Portage


Details of sys-libs/db:

Description: Oracle Berkeley DB
Homepage:
https://www.oracle.com/technetwork/database/database-technologies/berkeleydb/overview/index.html

available versions:

releasesalphaamd64armhppaia64mipsppcppc64ppc macoss390shsparcx86USE-Flagsdependenciesebuild warnings
db-6.0.35-r5 ~~~~-~~~-~-~~doc
cxx
tcl
test
show
show
db-6.0.35-r4 ~~~~-~~~-~-~~doc
cxx
tcl
test
show
show
db-5.3.28-r9 ~++~--++-~-~+doc
cxx
tcl
test
show
show
db-5.3.28-r11 ~++~--++-~-~+doc
cxx
tcl
test
show
show
db-5.3.28-r10 ~++~--++-~-~+doc
cxx
tcl
test
show
show
db-4.8.30-r9 ~++~-~++-~-~+doc
cxx
tcl
test
show
show
db-4.8.30-r8 ~++~-~++-~-~+doc
cxx
tcl
test
show
show
Legend:
+ stable
~ testing
- not available
some ebuild warning depend on specific use-flags or architectures, all ebuild-warnings are shown.

Known bugs:
bug IDcomponentassigned tostatusdescriptionlast change
365589HardenedhardenedUNCONFIRMEDdev-db/mysql: Doesn't starting.2012-02-02 03:06:50
366509Applicationsrobbat2UNCONFIRMEDdev-db/libdbi-drivers-0.8.3: uses incorrect query for listing tables on PostgreSQL database2011-05-12 18:58:07
366763ApplicationssgmlUNCONFIRMEDapp-text/asciidoc-8.6.4 should RDEPEND on app-text/dblatex2012-03-25 20:53:34
367375EbuildsnetmonUNCONFIRMEDnet-analyzer/ndoutils-1.4_beta9: "db/" directory from source code is not installed to system2012-02-09 10:57:19
370703Applicationsmysql-bugsUNCONFIRMEDdev-db/myodbc-5.1.6 - emerge --config fails: odbcinst: SQLWritePrivateProfileString failed with Gene2011-06-10 02:05:40
374535Prefix SupportprefixUNCONFIRMEDsandbox-2.4 can't find libc2011-07-09 14:15:22
375673Ebuildsmaintainer-wantedUNCONFIRMED[ebuild] dev-db/mydumper-{0.2.3,0.5.1} (New Package)2011-11-02 16:48:35
375837EbuildsperlUNCONFIRMEDmail-filter/spamassassin-3.3.2 fails to build (Sandbox violation)2011-10-11 15:56:38
376455DevelopmenttoolchainUNCONFIRMEDsys-devel/gdb-7.2 build broken by CFLAGS='-finline-functions -ftracer'2011-07-26 17:59:11
379001LibrarygnomeUNCONFIRMEDsys-libs/ldb-1.1.4 fails on portage-multilib because of waflib module's python support2013-01-01 18:40:16
379531Ebuildsmaintainer-wantedUNCONFIRMEDbibdb-0.1.2_pre.ebuild(New Package)2011-08-21 17:30:12
380341Applicationsapp-backupUNCONFIRMEDapp-backup/cdbkup-1.0-r1: make jobserver unavailable2011-08-25 14:00:21
380857Applicationsapp-dictsUNCONFIRMEDapp-dicts/duali-data-0.1b -doins: stemsdb does not exist2011-10-23 14:29:09
383639Unspecifiedrobbat2UNCONFIRMEDdev-db/libdbi-drivers-0.8.3 USE=doc - ?2011-09-29 22:37:06
384581Mac OSXprefixUNCONFIRMEDapp-editors/emacs-23.3-r2: emerge failed with error unexec: my_endbss_static is not in section __bss2011-10-31 03:04:33
385147Applicationsfreedesktop-bugsUNCONFIRMEDsys-apps/dbus-* crash via xfce4-panel2011-10-16 11:54:02
385513Developmentmysql-bugsUNCONFIRMEDdev-db/mariadb-5.1.50: failed to compile x86-libs with multilib-overlay enabled2011-10-30 04:20:27
390429ApplicationswltUNCONFIRMEDdev-db/firebird-2.0.3.12981.0-r6: buffer overflow with kernel 3.0.62012-06-02 07:33:59
390571CoreqaUNCONFIRMEDdev-perl/CDDB_get 2.27 - environment: line 345: pushd: /var/tmp/portage/dev-perl/CDDB_get-2.27/work/2011-11-22 19:19:25
391165JavajavaUNCONFIRMEDNew package: dev-java/sqlite-jdbc2011-11-20 22:16:24
392349VulnerabilitiessecurityUNCONFIRMEDsys-devel/gdb Loads untrusted files with possible arbitrary code execution (CVE-2011-4355)2011-12-30 07:19:51
392681Core systemclusterUNCONFIRMEDsys-devel/distcc[avahi] init script needs to depend on dbus for zeroconf2013-02-03 13:13:16
396125EbuildsbluenessUNCONFIRMEDapp-admin/webalizer-2.21.02 geodb does not work2013-01-13 14:44:27
396615Core systemtoolchainUNCONFIRMEDsys-devel/gdb: /usr/lib/libinproctrace.so plugin triggers missing SONAME QA warning2011-12-31 20:16:42
397355ServersambaUNCONFIRMEDnet-fs/samba cluster flags wrong config file /etc/ctdb/functions2012-01-16 23:57:57
398961Ebuildsnet-imUNCONFIRMEDnet-im/pidgin-2.10.1: please separate dbus-python dependency into a USE-flag2013-01-01 23:11:04
399123ApplicationssambaUNCONFIRMEDdev-db/ctdb requires sys-libs/tdb built with USE=tools2012-01-17 04:15:51
399739Libraryrobbat2UNCONFIRMEDdev-db/libdbi-drivers-0.8.3 fails to return column information for empty sqlite3 table2012-10-26 16:54:27
402047EbuildspythonUNCONFIRMEDdev-python/git-python-0.3.2_rc1 should RDEPEND on dev-python/gitdb2012-02-25 11:43:58
402493ApplicationsadaUNCONFIRMEDdev-ada/adasockets-1.8.4.7 - gnatmake: "listener.adb" compilation error2012-02-07 17:45:08
402659DevelopmentpythonUNCONFIRMEDdev-python/pydb-1.26-r1 - ImportError: No module named fns2012-04-24 16:19:54
403327PrintingprintingUNCONFIRMEDnet-print/foomatic-db-ppds-4.0.20120117-r1: Missing NickName and ModelName in /usr/share/cups/model/2012-02-14 21:13:08
403459Applicationsnet-mailUNCONFIRMEDnet-mail/perdition-1.18 - options.h:42:14: error: conflicting types for ‘gdbm_version’2012-12-04 18:16:40
404063DevelopmentpythonUNCONFIRMEDVersion bump: =dev-python/kinterbasdb-3.3.02012-03-09 08:44:10
404141EbuildsdjcUNCONFIRMEDdev-db/couchdb-9999: add live ebuild2012-02-16 16:27:47
407597DevmanualqaUNCONFIRMEDhardblockers and versioned slot deps missing under general-concepts/dependencies2013-01-01 18:38:03
410713Ebuildsmaintainer-wantedUNCONFIRMEDdev-db/cppdb - an SQL connectivity library for platform and database independent connectivity2012-06-28 17:50:44
410727ApplicationsgnustepUNCONFIRMEDgnustep-base/gnustep-back-xlib-0.18.0 - sandbox violation in /root/var by plmerge libgnustep-back-012012-05-02 06:36:52
410829Applicationsmr_bones_UNCONFIRMEDapp-admin/syslog-ng use "dbi" use flag instead of "sql"2012-04-05 02:44:56
410981ToolsdolsenUNCONFIRMEDapp-portage/etc-proposals with dev-lang/python-2.7[-berkdb] - raise error, "db type could not be det2012-04-09 20:36:29
412581Installation Handbookr0bertzUNCONFIRMED[zh_cn] two problems in Chinese handbook2012-06-30 17:52:43
413451Ebuildsweb-appsUNCONFIRMEDwww-apps/mantisbt uses system adodb, breaks Mantis' SOAP API2013-02-16 14:07:26
416553Ebuildsmysql-bugsUNCONFIRMEDdev-db/mysql++ version bump 3.1.02013-02-14 15:02:05
418353Ebuildsmaintainer-wantedUNCONFIRMEDdev-php/pecl-dbase - DBASE support removed from PHP 5.32012-05-31 14:59:48
419529Applicationsbase-systemUNCONFIRMEDsys-libs/db-4.8.30 fails tests with no space left on device2012-06-04 10:55:39
420095Applicationsrobbat2UNCONFIRMEDsci-mathematics/glpk-4.47 USE=mysql with dev-db/mariadb:5.5 - /usr/include/mysql/m_string.h:177:14: 2012-12-12 19:59:28
420245DevelopmentperlUNCONFIRMEDdev-perl/DBD-mysql-4.021 version bump2012-06-08 16:58:51
420337Core systembase-systemUNCONFIRMEDsys-libs/db-{5.2.42,5.3.21} version bump2012-06-09 14:09:24
420451JavajavaUNCONFIRMEDdev-java/jnr-netdb:0: Use dev-java/jnr-ffi:0.5 instead of dev-java/jaffl2012-06-10 00:57:49
420623PrintingprintingUNCONFIRMEDnet-print/foo2zjs-99999999 fails emerge with permission denied, access attempt outside the sandbox2013-01-27 23:07:16
421289ApplicationsultrabugUNCONFIRMEDdev-db/mongodb-2.0.6: Add support for USE="ssl"2012-12-23 14:34:12
421665SandboxsandboxUNCONFIRMEDsys-apps/busybox-1.20.1 fails with sandboxing enabled2012-11-26 17:24:29
421741Developmentrobbat2UNCONFIRMEDdev-vcs/git-1.7.3.4-r1: test t7508-status.sh failed with FEATURES="sandbox -userpriv"2012-06-19 15:11:50
424161ApplicationswltUNCONFIRMEDdev-db/firebird ebuild should not remove MSG_NOSIGNAL flag on x862012-07-03 13:51:46
425106Core systembase-systemUNCONFIRMEDsys-libs/db-4.8.30 FEATURES="test" - tests are not run : You must have USE=tcl to run the sys-libs/d2012-07-10 14:09:54
425124SandboxsandboxUNCONFIRMEDdev-vcs/git - git clone freezes when run in a sandbox2012-08-23 08:40:01
425132Ebuildsmaintainer-wantedUNCONFIRMEDdev-db/riak - "the most powerful open-source, distributed database you'll ever put into production."2012-07-08 14:09:00
425524SandboxtoolchainUNCONFIRMED[ICE/4.6] sys-apps/sandbox build segfaults on hardened systems2012-11-17 19:16:55
427348ApplicationsvoyageurUNCONFIRMED=dev-db/sqlite-3.7.13 fails test with clang-3.1-r42012-07-21 14:07:01
427936Ebuildsnet-p2pUNCONFIRMEDmedia-libs/gupnp-dlna-0.6.6 USE=introspection - sandbox violation in /dev/dri/card0 by gst-plugin-sc2013-02-05 18:34:08
428724Core systemhannoUNCONFIRMEDsys-auth/pam_mount-2.13: man: invalid option -- 'l', ERROR: ld.so: object 'libsandbox.so' from LD_PR2012-07-31 00:10:12
429372EbuildsnirbheekUNCONFIRMEDdev-python/pypy-1.9-r1 FEATURES=sandbox - Fatal error during initialization: out of memory2012-08-02 11:53:03
431000Applicationsmysql-bugsUNCONFIRMEDdev-db/mysql-5.1.62-r1 - make[1]: *** No rule to make target `../mysys/libmysys.la', needed by `fact2012-08-21 17:31:46
431058Eclasses and ProfilespythonUNCONFIRMEDdev-util/gdbus-codegen-2.32.4 - /usr/portage/eclass/python-distutils-ng.eclass: line 206: syntax err2012-08-12 16:45:06
431388ApplicationspythonUNCONFIRMEDdev-python/ipython-0.13 -AttributeError: 'StoreMagics' object has no attribute 'db'2012-08-14 15:08:54
431638SandboxsandboxUNCONFIRMEDsys-apps/sandbox-2.6 sometimes sends QA warnings to tty2012-08-16 19:44:12
432020Core systemtoolchainUNCONFIRMEDsys-libs/glibc-2.15-r2: /var/db/services.db causes infinite loop in getaddrinfo()2012-12-30 21:01:03
433004Applicationsmaintainer-neededUNCONFIRMEDapp-office/mdbtools version upgrade 0.7 now on git2012-08-28 10:48:54
433994Servermysql-bugsUNCONFIRMEDdev-db/mysql-5.1.62-r1 stack smashing detected in mysqld2012-09-05 17:17:06
434180Core systemtoolchainUNCONFIRMEDsys-devel/gcc sandbox violation in /usr/include/DONE (dev-db/oracle-instantclient-basic creates a li2012-12-25 08:33:27
434528ApplicationssoundUNCONFIRMEDmedia-sound/dagrab fails with buffer overflow detected when using cddb2012-09-10 11:44:45
434744Ebuildsmaintainer-wantedUNCONFIRMEDdev-db/mysql-cluster-7.2.8 - a high availability and high performance alternative to regular mysql2012-10-14 09:35:05
435328Ebuildsmaintainer-wantedUNCONFIRMEDdev-db/mysql-udf-preg (New Package)2012-09-17 18:04:23
435390Applicationsphp-bugsUNCONFIRMEDdev-lang/php-5.4.7 - .../work/sapis-build/cli/ext/dba/dba_cdb.c:59:2: error: unknown type name 'uint2012-09-18 13:59:57
435690Applicationsmysql-bugsUNCONFIRMEDdev-db/mysql-5.1.62-r1 - Makefile:186: *** missing separator. Stop.2013-02-04 23:51:03
436596Applicationsandrej.filipcicUNCONFIRMEDnet-fs/openafs-1.6.1-r1: parallel build failure - In file included from db_dump.c:31:0: database.h:12012-09-29 15:38:55
436978Applicationsmysql-bugsUNCONFIRMEDdev-db/mysql-5.6 version bump2013-02-07 05:41:47
438302Ebuildsmaintainer-wantedUNCONFIRMEDdev-db/mysql-mmm - Multi-Master Replication Manager for MySQL2012-10-15 11:04:50
438730Core systemkernel-miscUNCONFIRMEDSandbox violations when emerging kernel modules from /etc/kernel/postinst.d hook against a kernel bu2012-11-05 03:29:40
439408Ebuildsmaintainer-wantedUNCONFIRMEDdev-db/rockmongo-1.1.5 - Web-based administration for Mongo database in PHP2013-02-07 14:35:09
439574SandboxsandboxUNCONFIRMEDsys-apps/sandbox-2.6 - sys-apps/coreutils-8.20 - (null)*(null) ../../sandbox-2.6/libsandbox/libsandb2012-12-21 23:38:54
442158Installation Handbookdocs-teamUNCONFIRMEDhandbook chapter numbering2012-11-07 13:12:47
442322Ebuildsmysql-bugsUNCONFIRMEDdev-db/myodbc-5.1.6 - Build fails against dev-db/mysql-5.5.28 - error: too many arguments to functio2013-02-09 20:29:48
442346Applicationsmysql-bugsUNCONFIRMEDdev-db/mysql-5.5.28 - InnoDB: Assertion failure in thread 140230384047936 in file trx0rseg.c line 332012-11-08 22:04:30
442390Applicationsmysql-bugsUNCONFIRMEDdev-db/mysql-5.5.28 - mysql_config includes -lprobes_mysql in its output, missing lib causes package2012-11-15 22:19:14
442534Ebuildsmaintainer-wantedUNCONFIRMEDapp-admin/puppetdb-1.0.2 ebuild request2012-11-10 22:53:28
442616DevelopmentdjcUNCONFIRMEDdev-db/couchdb - /usr/lib/couchdb/bin/couchjs needs pax-mark mr on PaX-enabled systems.2013-01-12 18:34:44
442662Ebuildsmysql-bugsUNCONFIRMEDdev-db/mysql-connector-c++ - Output from mysql_config is parsed in in ugly way.2012-11-19 15:55:25
443510EbuildspythonUNCONFIRMEDdev-lang/python should install helper file for sys-devel/gdb2012-11-16 16:07:09
443898ServerhwoarangUNCONFIRMED>=net-ftp/vsftpd-3.0.0: 500 OOPS: priv_sock_get_cmd with seccomp_sandbox=YES (default)2012-11-19 10:55:09
444054Servermysql-bugsUNCONFIRMEDdev-db/mysql-5.1.66 crashes in replication setup2012-11-21 11:39:44
444368Applicationsweb-appsUNCONFIRMEDwww-apps/lxr fails with current dev-db/mysql. Bump version to 1.0.0?2012-11-23 16:04:59
445120LibrarypatrickUNCONFIRMEDsys-libs/tdb-1.2.10 - Compilatin phase failed - [Errno 2] No such file or directory: '/var/tmp/porta2012-12-08 15:46:16
445132Core systemtoolchainUNCONFIRMEDsys-devel/gdb-7.5: build fails w/-ftracer on amd64: linux-x86-low.c:2939: Error: symbol 'start_i386_2012-11-29 19:36:23
445186Installation Handbookdocs-teamUNCONFIRMEDA link to the online list of local USE flags is missing in the installation handbook2012-11-29 12:18:57
445626Installation Handbookdocs-teamUNCONFIRMEDSwap amount in handbook needs a discussion2012-12-02 15:31:04
445824Applicationssci-geosciencesUNCONFIRMEDsci-libs/shapelib-1.3.0-r1 with perl-gcpan/DBD-XBase - file collision in /usr/bin/dbfdump2012-12-04 15:31:13
446200Prefix SupportprefixUNCONFIRMED~x86-linux prefix: emerge --config =dev-db/mysql-5.5.28 fails2013-01-31 15:13:09
446974Ebuildsmaintainer-wantedUNCONFIRMEDdev-libs/libpreludedb, app-admin/prelude-manager, net-analyzer/prewikka resurrection request2012-12-27 21:31:08
447288Ebuildsmaintainer-wantedUNCONFIRMED=dev-db/sqlncli-11.0.1790.0 - New package. - Microsoft® SQL Server® ODBC Driver 1.0 for Linux2013-02-19 20:07:16
447774Core systempatrickUNCONFIRMEDsys-libs/tdb-1.2.11: tdb.h uses mode_t but does not include relevant system header2012-12-19 02:24:08
447970Core systemsandboxUNCONFIRMEDsys-apps/sandbox makes autoconf's getcwd long path test take hours2013-01-31 14:19:12
448626Developmentdev-toolsUNCONFIRMEDdev-util/findbugs-2.0.2 version bump2012-12-26 03:10:32
448914Ebuildsrobbat2UNCONFIRMEDdev-db/libdbi-drivers needs a local description of bindist USE-flag2012-12-27 19:52:27
448918EbuildsswegenerUNCONFIRMEDdev-db/opendbx needs a local description of bindist USE-flag2012-12-27 20:13:18
449308LibraryenlightenmentUNCONFIRMEDdev-libs/e_dbus-1.7.4 USE=udev depends on sys-power/upower sys-fs/udisks, should be USE=ukit2013-01-20 13:31:49
449776Serverldap-bugsUNCONFIRMEDnet-nds/openldap - add support for slapd-mdb backend2013-01-03 00:24:21
449780ApplicationssoundUNCONFIRMEDmedia-sound/exaile should support USE=dbus2013-01-03 00:19:45
449784EbuildstexUNCONFIRMEDdjview-4.9.ebuild requires dbus as hard dependency2013-02-16 14:02:36
450386DevelopmentkdeUNCONFIRMEDdev-util/cmake: FindBLAS patch doesn't correctly use pkg-config results and may fail2013-01-08 12:36:44
450714Core systemtoolchainUNCONFIRMEDsys-libs/glibc-2.16.0: /usr/include/bits/stdlib-ldbl.h:35:1: error: 'qecvt' undeclared here (not in 2013-01-20 01:23:38
451174DevelopmentwltUNCONFIRMEDdev-db/firebird-2.1.3.18185.0 - Unable to complete network request to host "localhost". Error readin2013-01-10 12:51:53
451544ApplicationsmozillaUNCONFIRMEDwww-client/firefox-18.0 fails to build without dbus flag2013-01-13 02:21:35
451622Core systembase-systemUNCONFIRMEDsys-apps/man-db-2.6.3-r1[nls]: Translated manpages will not be installed if app-text/po4a is not ins2013-01-15 12:05:38
453088ApplicationskdeUNCONFIRMEDmedia-sound/amarok-2.7.0: sandbox access violation2013-02-14 11:48:25
453480Applicationsmysql-bugsUNCONFIRMEDdev-db/mysql-5.1.66 - emerge --config fails after change of datadir in my.cnf2013-01-22 19:11:18
453778Ebuildsnet-fsUNCONFIRMEDnet-fs/autofs - sandbox violation in `mount -s' touching /run/mount2013-02-16 13:20:27
454368Otherdocs-teamUNCONFIRMED[fa] handbook/hb-net-functions.xml2013-01-28 03:07:00
454370Otherdocs-teamUNCONFIRMED[fa] handbook/hb-net-management.xml2013-01-28 03:11:50
454462Core systemsystemdUNCONFIRMEDsys-apps/dbus-1.6.8-r1[systemd] <--> sys-apps/systemd circular dependency2013-02-03 10:59:34
454648LibrarypatrickUNCONFIRMEDdev-libs/leveldb should install memenv library2013-02-03 17:27:05
455134Applicationsgnome-officeUNCONFIRMEDapp=office/gnucash with dev-db/libdbi - "The library "libdbi" installed on your system doesn't corre2013-02-12 19:39:30
455156Developmentphp-bugsUNCONFIRMEDdev-php/PEAR-MDB2 + drivers version bump2013-02-04 02:31:17
455164[RU]docs-teamUNCONFIRMEDHPPA Handbook translation2013-02-02 16:03:46
455234KDEkdeUNCONFIRMEDkmix: dbuscontrolwrapper.cpp:(.text+0x169): undefined reference to `vtable for DBusControlWrapper'2013-02-03 07:06:26
455428ApplicationsmozillaUNCONFIRMEDwww-client/firefox-18.0.1 should depend on >=dev-db/sqlite-3.7.14.12013-02-05 12:14:48
455478ApplicationslxdeUNCONFIRMEDlxde-base/lxdm-0.4.1-r5 - How can I stop it from creating "/.dbus"?2013-02-04 19:38:47
455498ApplicationshaubiUNCONFIRMEDdev-db/tora-2.1.4 version bump2013-02-21 10:45:19
455832ApplicationsmozillaUNCONFIRMEDmail-client/thunderbird-bin-17.0.2 should RDEPEND on dev-libs/dbus-glib2013-02-06 13:57:55
456024ApplicationsnikoliUNCONFIRMEDmedia-sound/clementine 1.1.1 crashes with 0 size .mood file when moodbar is enabled in the playlist2013-02-07 14:14:11
456110Applicationsmedia-videoUNCONFIRMED[multimedia overlay] mpv-9999 --disable-tv-bsdbt848 and --disable-radio-bsdbt848 does not exist anym2013-02-09 15:41:09
456172ApplicationstommyUNCONFIRMEDdev-vcs/subversion-(1.7.* ?) needs dev-db/sqlite:3 to be compiled with threadsafe2013-02-11 11:20:24
456694LibraryhaubiUNCONFIRMEDdev-db/oracle-instantclient-sqlplus-11.2.0.3: sqlpus binary needs paxctl -c on hardened ~amd642013-02-19 20:33:27
456790DevelopmentneurogeekUNCONFIRMEDdev-db/unixODBC-2.3.1: please add --enable-iconv-char-{utf8,utf16le}2013-02-11 17:12:48
457546Ebuildsmaintainer-wantedUNCONFIRMEDNew ebuild: dev-db/torndb-0.1 - A lightweight wrapper around MySQLdb. Originally part of the Tornado2013-02-14 15:34:22
457668Otherdocs-teamUNCONFIRMED[fa] handbook/hb-net-modules.xml2013-02-15 08:30:33
457670Otherdocs-teamUNCONFIRMED[fa] handbook/hb-net-start.xml2013-02-15 08:34:05
457672Otherdocs-teamUNCONFIRMED[FA] handbook/hb-net-wireless.xml2013-02-15 08:37:25
457694ApplicationsultrabugUNCONFIRMED>=dev-db/mongodb-2.0.7 does not build and install libmongoclient.so anymore2013-02-15 17:20:16
457932Installation Handbookdocs-teamUNCONFIRMEDWord 'flash' in ARM-bootloader handbook2013-02-20 02:11:10
457958Keywording and Stabilizationpgsql-bugsUNCONFIRMEDdev-db/postgis-2.0.1 stable request2013-02-17 17:00:06
457960Keywording and StabilizationjavaUNCONFIRMEDdev-java/jdbc-postgresql-9.1_p902 stable request2013-02-17 17:38:38
458152Ebuildsmaintainer-wantedUNCONFIRMEDdev-db/odb-2.2.0 - C++ Object-Relational Mapping (ORM) implemented as a gcc plugin2013-02-19 22:42:42
458256ApplicationsprometheanfireUNCONFIRMEDmedia-sound/spotify-0.8.8.323-r1 spotify-dbus.py isn't python 3.2 compatible2013-02-19 14:22:25
458336Ebuildsmaintainer-wantedUNCONFIRMEDdev-db/libodb - ODB common runtime library (dev-db/odb dependency)2013-02-19 22:12:23
458342Ebuildsmaintainer-wantedUNCONFIRMEDdev-db/libcutl - a C++ utility library (dependency of dev-db/odb)2013-02-19 22:11:50
458346Ebuildsmaintainer-wantedUNCONFIRMEDdev-db/libodb-boost - ODB boost support library (dependency of dev-db/odb)2013-02-19 22:10:48
458348Ebuildsmaintainer-wantedUNCONFIRMEDdev-db/libodb-pgsql - acess a PostgreSQL database using ODB (dependency of dev-db/odb)2013-02-19 22:09:23
458352Ebuildsmaintainer-wantedUNCONFIRMEDdev-db/libodb-mssql - access a Microsoft SQL Server using ODB (dependency of dev-db/odb)2013-02-19 22:10:18
458356Ebuildsmaintainer-wantedUNCONFIRMEDdev-db/libodb-oracle - access an Oracle server with ODB (dependency of dev-db/odb)2013-02-19 20:47:53
458364Ebuildsmaintainer-wantedUNCONFIRMEDdev-db/libodb-mysql - access a MySQL or MariaDB database (dependency of dev-db/odb)2013-02-20 13:24:27
458366Ebuildsmaintainer-wantedUNCONFIRMEDdev-db/libodb-qt - ODB Qt support library (dependency of dev-db/odb)2013-02-20 13:24:27
458370Ebuildsmaintainer-wantedUNCONFIRMEDdev-db/libodb-sqlite - access a SQLite database using ODB (dependency of dev-db/odb)2013-02-20 13:24:27
458376Ebuildsmaintainer-wantedUNCONFIRMEDdev-db/odb-examples - Programming examples for use with ODB (dependency of dev-db/odb)2013-02-20 13:24:27
458514ApplicationsxboxUNCONFIRMEDmedia-tv/xbmc USE=airplay should depend on net-dns/avahi[dbus] and media-libs/libshairport2013-02-21 12:39:06


back



Support us on Content Nation

New Packages

- as rdf newsfeed
- as rss newsfeed
- as Atom newsfeed
2026-10-13
aioquic - 1.6.1
Ebuild name:

dev-python/aioquic-1.6.1

Description

An implementation of QUIC and HTTP/3

Added to portage

2026-10-13

ast-serialize - 0.13.0
Ebuild name:

dev-python/ast-serialize-0.13.0

Description

Python bindings for mypy AST serialization

Added to portage

2026-10-13

async-lru - 2.4.0
Ebuild name:

dev-python/async-lru-2.4.0

Description

Simple lru_cache for asyncio

Added to portage

2026-10-13

atpublic - 9.0.0
Ebuild name:

dev-python/atpublic-9.0.0

Description

A decorator to populate __all__ and the module globals

Added to portage

2026-10-13

aws-sam-translator - 1.115.0
Ebuild name:

dev-python/aws-sam-translator-1.115.0

Description

A library that transform SAM templates into AWS CloudFormatio

Added to portage

2026-10-13

awscli - 2.37.13
Ebuild name:

app-admin/awscli-2.37.13

Description

Universal Command Line Environment for AWS

Added to portage

2026-10-13

bas - 2.7
Ebuild name:

dev-lang/bas-2.7

Description

An interpreter for the classic dialect of the programming language BASIC

Added to portage

2026-10-13

bitcoin-core - 32.0_rc4
Ebuild name:

net-p2p/bitcoin-core-32.0_rc4

Description

Reference implementation of the Bitcoin cryptocurrency

Added to portage

2026-10-13

boto3 - 1.43.112
Ebuild name:

dev-python/boto3-1.43.112

Description

The AWS SDK for Python

Added to portage

2026-10-13

botocore - 1.43.112
Ebuild name:

dev-python/botocore-1.43.112

Description

Low-level, data-driven core of boto 3

Added to portage

2026-10-13

bpf-toolchain - 16.2.0_p1
Ebuild name:

sys-devel/bpf-toolchain-16.2.0_p1

Description

All-in-one bpf toolchain for building DTrace and systemd without

Added to portage

2026-10-13

cargo-nextest - 0.9.148
Ebuild name:

dev-util/cargo-nextest-0.9.148

Description

Next-generation test runner for Rust

Added to portage

2026-10-13

closure-compiler-bin - 20261005
Ebuild name:

dev-lang/closure-compiler-bin-20261005

Description

JavaScript optimizing compiler

Added to portage

2026-10-13

cmd2 - 4.3.0
Ebuild name:

dev-python/cmd2-4.3.0

Description

Extra features for standard library's cmd module

Added to portage

2026-10-13

cpp-httplib - 0.60.1
Ebuild name:

dev-cpp/cpp-httplib-0.60.1

Description

C++ HTTP/HTTPS server and client library

Added to portage

2026-10-13

easyeffects - 8.3.0
Ebuild name:

media-sound/easyeffects-8.3.0

Description

Limiter, auto volume and many other plugins for PipeWire applications

Added to portage

2026-10-13

flufl-lock - 10.0.0
Ebuild name:

dev-python/flufl-lock-10.0.0

Description

NFS-safe file locking with timeouts for POSIX systems

Added to portage

2026-10-13

freerdp - 3.32.2
Ebuild name:

net-misc/freerdp-3.32.2

Description

Free implementation of the Remote Desktop Protocol

Added to portage

2026-10-13

git-delete-merged-branches - 7.7.0
Ebuild name:

dev-vcs/git-delete-merged-branches-7.7.0

Description

Command-line tool to delete merged Git branches

Added to portage

2026-10-13

gobject-introspection - 1.86.0-r1
Ebuild name:

dev-libs/gobject-introspection-1.86.0-r1

Description

Introspection system for GObject-based libraries

Added to portage

2026-10-13

google-auth - 2.62.0
Ebuild name:

dev-python/google-auth-2.62.0

Description

Google Authentication Library

Added to portage

2026-10-13

haskell-mode - 17.4
Ebuild name:

app-emacs/haskell-mode-17.4

Description

Mode for editing (and running) Haskell programs in Emacs

Added to portage

2026-10-13

ijson - 3.6.0
Ebuild name:

dev-python/ijson-3.6.0

Description

Iterative JSON parser with a Pythonic interface

Added to portage

2026-10-13

installer - 1.1.0
Ebuild name:

dev-python/installer-1.1.0

Description

A library for installing Python wheels

Added to portage

2026-10-13

javacc - 8.1.0
Ebuild name:

dev-java/javacc-8.1.0

Description

Core module of JavaCC

Added to portage

2026-10-13

javacc-java - 8.1.0
Ebuild name:

dev-java/javacc-java-8.1.0

Description

Java code generator module of JavaCC

Added to portage

2026-10-13

jedi - 0.20.1
Ebuild name:

dev-python/jedi-0.20.1

Description

Autocompletion library for Python

Added to portage

2026-10-13

jemalloc - 5.4.0
Ebuild name:

dev-libs/jemalloc-5.4.0

Description

Jemalloc is a general-purpose scalable concurrent allocator

Added to portage

2026-10-13

jj - 0.46.0
Ebuild name:

dev-vcs/jj-0.46.0

Description

Jujutsu - an experimental version control system

Added to portage

2026-10-13

kup - 0.10.0
Ebuild name:

kde-plasma/kup-0.10.0

Description

Backup scheduler for the Plasma desktop

Added to portage

2026-10-13

lsp-plugins - 1.2.35
Ebuild name:

media-libs/lsp-plugins-1.2.35

Description

Linux Studio Plugins

Added to portage

2026-10-13

mycli - 2.29.4
Ebuild name:

dev-db/mycli-2.29.4

Description

CLI for MySQL Database with auto-completion and syntax highlighting

Added to portage

2026-10-13

nodejs - 26.11.1-r1
Ebuild name:

net-libs/nodejs-26.11.1-r1

Description

A JavaScript runtime built on Chrome's V8 JavaScript engine

Added to portage

2026-10-13

opal-utils - 7.1
Ebuild name:

sys-apps/opal-utils-7.1

Description

OPAL firmware utilities

Added to portage

2026-10-13

opentmux - 0.1
Ebuild name:

app-misc/opentmux-0.1

Description

Terminal multiplexer, slop-free fork of app-misc/tmux

Added to portage

2026-10-13

opentmux - 9999
Ebuild name:

app-misc/opentmux-9999

Description

Terminal multiplexer, slop-free fork of app-misc/tmux

Added to portage

2026-10-13

pekwm - 0.4.4
Ebuild name:

x11-wm/pekwm-0.4.4

Description

Lightweight window manager initially based on aewm++

Added to portage

2026-10-13

pre-commit - 4.7.0
Ebuild name:

dev-vcs/pre-commit-4.7.0

Description

A framework for managing and maintaining multi-language Git pre-commit hoo

Added to portage

2026-10-13

pytest-check - 3.0.1
Ebuild name:

dev-python/pytest-check-3.0.1

Description

pytest plugin that allows multiple failures per test

Added to portage

2026-10-13

radicale - 3.8.3
Ebuild name:

www-apps/radicale-3.8.3

Description

A simple CalDAV calendar server

Added to portage

2026-10-13

ruff - 0.17.0
Ebuild name:

dev-util/ruff-0.17.0

Description

An extremely fast Python linter, written in Rust

Added to portage

2026-10-13

simdjson - 5.0.4
Ebuild name:

dev-libs/simdjson-5.0.4

Description

SIMD accelerated C++ JSON library

Added to portage

2026-10-13

tokenizers - 0.23.3
Ebuild name:

sci-ml/tokenizers-0.23.3

Description

Implementation of today's most used tokenizers

Added to portage

2026-10-13

tomcat - 10.1.61
Ebuild name:

www-servers/tomcat-10.1.61

Description

Tomcat Servlet-6.0/JSP-3.1/EL-5.0/WebSocket-2.1/JASPIC-3.0 Container

Added to portage

2026-10-13

tomcat - 11.0.27
Ebuild name:

www-servers/tomcat-11.0.27

Description

Tomcat Servlet-6.1/JSP-4.0/EL-6.0/WebSocket-2.2/JASPIC-3.1 Container

Added to portage

2026-10-13

tomcat - 9.0.123
Ebuild name:

www-servers/tomcat-9.0.123

Description

Tomcat Servlet-4.0/JSP-2.3/EL-3.0/WebSocket-1.1/JASPIC-1.1 Container

Added to portage

2026-10-13

tree-sitter-erlang - 0.21.0
Ebuild name:

dev-libs/tree-sitter-erlang-0.21.0

Description

Erlang programming language grammar for Tree-sitter

Added to portage

2026-10-13

truststore - 0.10.5
Ebuild name:

dev-python/truststore-0.10.5

Description

Verify certificates using native system trust stores

Added to portage

2026-10-13

wsjtx_improved - 3.2.0_p20260908
Ebuild name:

media-radio/wsjtx_improved-3.2.0_p20260908

Description

Weak signal ham radio communication with improvements

Added to portage

2026-10-13

yq - 4.4.5
Ebuild name:

app-misc/yq-4.4.5

Description

Command-line YAML processor - jq wrapper for YAML documents

Added to portage

2026-10-13

2026-10-12
aioquic - 1.5.0
Ebuild name:

dev-python/aioquic-1.5.0

Description

An implementation of QUIC and HTTP/3

Added to portage

2026-10-12

ansible-compat - 26.10.0
Ebuild name:

dev-python/ansible-compat-26.10.0

Description

Contains functions that facilitate working with various versions

Added to portage

2026-10-12

aws-sdk-cpp - 1.11.909
Ebuild name:

dev-cpp/aws-sdk-cpp-1.11.909

Description

AWS SDK for C++

Added to portage

2026-10-12

beartype - 0.23.1
Ebuild name:

dev-python/beartype-0.23.1

Description

Unbearably fast runtime type checking in pure Python

Added to portage

2026-10-12

bitarray - 3.12.1
Ebuild name:

dev-python/bitarray-3.12.1

Description

Efficient arrays of booleans -- C extension

Added to portage

2026-10-12

bracex - 3.1
Ebuild name:

dev-python/bracex-3.1

Description

Bash style brace expansion for Python

Added to portage

2026-10-12

btrfs-assistant - 2.3.2
Ebuild name:

app-admin/btrfs-assistant-2.3.2

Description

GUI management tool to make managing a Btrfs filesystem easier

Added to portage

2026-10-12

cen64-jg - 0.4.1
Ebuild name:

games-emulation/cen64-jg-0.4.1

Description

Jolly Good fork of CEN64

Added to portage

2026-10-12

cen64-jg - 9999
Ebuild name:

games-emulation/cen64-jg-9999

Description

Jolly Good fork of CEN64

Added to portage

2026-10-12

dealii - 9.7.1-r1
Ebuild name:

sci-libs/dealii-9.7.1-r1

Description

Solving partial differential equations with the finite element method

Added to portage

2026-10-12

dealii - 9.8.0-r1
Ebuild name:

sci-libs/dealii-9.8.0-r1

Description

Solving partial differential equations with the finite element method

Added to portage

2026-10-12

dist-kernel - 6.18.56
Ebuild name:

virtual/dist-kernel-6.18.56

Description

Virtual to depend on any Distribution Kernel

Added to portage

2026-10-12

dist-kernel - 7.2.10
Ebuild name:

virtual/dist-kernel-7.2.10

Description

Virtual to depend on any Distribution Kernel

Added to portage

2026-10-12

docker - 29.9.0
Ebuild name:

app-containers/docker-29.9.0

Description

The core functions you need to create Docker images and run Docker con

Added to portage

2026-10-12

docker-cli - 29.9.0
Ebuild name:

app-containers/docker-cli-29.9.0

Description

the command line binary for docker

Added to portage

2026-10-12

doxygen - 1.17.0-r1
Ebuild name:

app-text/doxygen-1.17.0-r1

Description

Documentation system for most programming languages

Added to portage

2026-10-12

doxygen - 1.18.0-r1
Ebuild name:

app-text/doxygen-1.18.0-r1

Description

Documentation system for most programming languages

Added to portage

2026-10-12

duckdb - 1.5.6
Ebuild name:

dev-db/duckdb-1.5.6

Description

high-performance analytical database system

Added to portage

2026-10-12

filelock - 4.1.1
Ebuild name:

dev-python/filelock-4.1.1

Description

A platform independent file lock for Python

Added to portage

2026-10-12

firefox-bin - 158.0
Ebuild name:

www-client/firefox-bin-158.0

Description

Firefox Web Browser

Added to portage

2026-10-12

gcc - 14.4.1_p20261008
Ebuild name:

sys-devel/gcc-14.4.1_p20261008

Description

The GNU Compiler Collection

Added to portage

2026-10-12

gcc - 15.3.1_p20261009
Ebuild name:

sys-devel/gcc-15.3.1_p20261009

Description

The GNU Compiler Collection

Added to portage

2026-10-12

gcc - 16.2.1_p20261010
Ebuild name:

sys-devel/gcc-16.2.1_p20261010

Description

The GNU Compiler Collection

Added to portage

2026-10-12

gcc - 17.0.0_p20261011
Ebuild name:

sys-devel/gcc-17.0.0_p20261011

Description

The GNU Compiler Collection

Added to portage

2026-10-12

gentoo-kernel - 6.18.56
Ebuild name:

sys-kernel/gentoo-kernel-6.18.56

Description

Linux kernel built with Gentoo patches

Added to portage

2026-10-12

gentoo-kernel - 7.2.10
Ebuild name:

sys-kernel/gentoo-kernel-7.2.10

Description

Linux kernel built with Gentoo patches

Added to portage

2026-10-12

gentoo-kernel-bin - 6.18.56
Ebuild name:

sys-kernel/gentoo-kernel-bin-6.18.56

Description

Pre-built Linux kernel with Gentoo patches

Added to portage

2026-10-12

gentoo-kernel-bin - 7.2.10
Ebuild name:

sys-kernel/gentoo-kernel-bin-7.2.10

Description

Pre-built Linux kernel with Gentoo patches

Added to portage

2026-10-12

gentoo-kernel-modprep - 6.18.56
Ebuild name:

sys-kernel/gentoo-kernel-modprep-6.18.56

Description

Minimal subset of gentoo-kernel-bin for building modules,

Added to portage

2026-10-12

gentoo-kernel-modprep - 7.2.10
Ebuild name:

sys-kernel/gentoo-kernel-modprep-7.2.10

Description

Minimal subset of gentoo-kernel-bin for building modules, f

Added to portage

2026-10-12

git-sources - 7.3_rc7
Ebuild name:

sys-kernel/git-sources-7.3_rc7

Description

The very latest -git version of the Linux kernel

Added to portage

2026-10-12

go - 1.26.9
Ebuild name:

dev-lang/go-1.26.9

Description

A concurrent garbage collected and typesafe programming language

Added to portage

2026-10-12

go - 1.27.2
Ebuild name:

dev-lang/go-1.27.2

Description

A concurrent garbage collected and typesafe programming language

Added to portage

2026-10-12

haskell-mode - 17.4
Ebuild name:

app-emacs/haskell-mode-17.4

Description

Mode for editing (and running) Haskell programs in Emacs

Added to portage

2026-10-12

haskell-mode - 17.5_p20260206
Ebuild name:

app-emacs/haskell-mode-17.5_p20260206

Description

Mode for editing (and running) Haskell programs in Emacs

Added to portage

2026-10-12

hypothesis - 6.169.0
Ebuild name:

dev-python/hypothesis-6.169.0

Description

A library for property based testing

Added to portage

2026-10-12

inline-snapshot - 0.36.1
Ebuild name:

dev-python/inline-snapshot-0.36.1

Description

Create and update inline snapshots in your Python tests

Added to portage

2026-10-12

jacksum - 4.0.2
Ebuild name:

app-crypt/jacksum-4.0.2

Description

Java utility for working with checksums, CRCs, and message digests (hashes)

Added to portage

2026-10-12

jgemu - 1.0.0-r2
Ebuild name:

games-emulation/jgemu-1.0.0-r2

Description

Meta ebuild for the Jolly Good API

Added to portage

2026-10-12

jna - 5.19.1
Ebuild name:

dev-java/jna-5.19.1

Description

Java Native Access

Added to portage

2026-10-12

jsonpath-ng - 1.10.1
Ebuild name:

dev-python/jsonpath-ng-1.10.1

Description

Python JSONPath Next-Generation

Added to portage

2026-10-12

keystoneauth1 - 5.18.1
Ebuild name:

dev-python/keystoneauth1-5.18.1

Description

This package contains tools for authenticating to an OpenStack-base

Added to portage

2026-10-12

libhubbub - 9999
Ebuild name:

net-libs/libhubbub-9999

Description

HTML5 compliant parsing library, written in C

Added to portage

2026-10-12

libnsbmp - 9999
Ebuild name:

media-libs/libnsbmp-9999

Description

Decoding library for BMP and ICO image file formats, written in C

Added to portage

2026-10-12

libnsfb - 9999
Ebuild name:

dev-libs/libnsfb-9999

Description

C library for framebuffer abstraction

Added to portage

2026-10-12

libnspsl - 9999
Ebuild name:

media-libs/libnspsl-9999

Description

Public Suffix List (PSL) for the NetSurf browser

Added to portage

2026-10-12

libparserutils - 9999
Ebuild name:

dev-libs/libparserutils-9999

Description

C library for building efficient parsers

Added to portage

2026-10-12

librosprite - 9999
Ebuild name:

media-libs/librosprite-9999

Description

Framebuffer abstraction library, written in C

Added to portage

2026-10-12

libwapcaplet - 9999
Ebuild name:

dev-libs/libwapcaplet-9999

Description

string internment library, written in C

Added to portage

2026-10-12

libxmp - 4.7.4
Ebuild name:

media-libs/libxmp-4.7.4

Description

Library that renders module files to PCM data

Added to portage

2026-10-12

lollypop - 1.4.48
Ebuild name:

media-sound/lollypop-1.4.48

Description

Modern music player for GNOME

Added to portage

2026-10-12

ls-qpack - 2.6.4
Ebuild name:

dev-libs/ls-qpack-2.6.4

Description

QPACK compression library for use with HTTP/3

Added to portage

2026-10-12

ls-qpack - 2.7.0
Ebuild name:

dev-libs/ls-qpack-2.7.0

Description

QPACK compression library for use with HTTP/3

Added to portage

2026-10-12

moto - 5.2.4
Ebuild name:

dev-python/moto-5.2.4

Description

Mock library for boto

Added to portage

2026-10-12

mumps - 5.6.2-r1
Ebuild name:

sci-libs/mumps-5.6.2-r1

Description

MUltifrontal Massively Parallel sparse direct matrix Solver

Added to portage

2026-10-12

nbconvert - 7.17.2
Ebuild name:

dev-python/nbconvert-7.17.2

Description

Converting Jupyter Notebooks

Added to portage

2026-10-12

netsurf-buildsystem - 9999
Ebuild name:

dev-build/netsurf-buildsystem-9999

Description

Build system used for netsurf and its libraries

Added to portage

2026-10-12

nsgenbind - 9999
Ebuild name:

dev-libs/nsgenbind-9999

Description

Generate Javascript-to-DOM bindings from w3c webidl files

Added to portage

2026-10-12

paraview - 6.2.0
Ebuild name:

sci-visualization/paraview-6.2.0

Description

Powerful scientific data visualization application

Added to portage

2026-10-12

patiencediff - 1.0.0
Ebuild name:

dev-python/patiencediff-1.0.0

Description

Python implementation of the patiencediff algorithm

Added to portage

2026-10-12

pikepdf - 10.17.0
Ebuild name:

dev-python/pikepdf-10.17.0

Description

Python library to work with pdf files based on qpdf

Added to portage

2026-10-12

platformdirs - 4.13.0
Ebuild name:

dev-python/platformdirs-4.13.0

Description

A small Python module for determining appropriate platform-specific

Added to portage

2026-10-12

ps2eps - 1.70
Ebuild name:

app-text/ps2eps-1.70

Description

Generate Encapsulated Postscript Format files from one-page Postscript documen

Added to portage

2026-10-12

pycryptodome - 3.24.1
Ebuild name:

dev-python/pycryptodome-3.24.1

Description

A self-contained cryptographic library for Python

Added to portage

2026-10-12

pydantic - 2.14.1
Ebuild name:

dev-python/pydantic-2.14.1

Description

Data parsing and validation using Python type hints

Added to portage

2026-10-12

pyglet - 2.1.19
Ebuild name:

dev-python/pyglet-2.1.19

Description

Cross-platform windowing and multimedia library for Python

Added to portage

2026-10-12

pylint - 4.1.3
Ebuild name:

dev-python/pylint-4.1.3

Description

Python code static checker

Added to portage

2026-10-12

pylsqpack - 1.0.0
Ebuild name:

dev-python/pylsqpack-1.0.0

Description

Python wrapper for the ls-qpack QPACK library

Added to portage

2026-10-12

pypdf - 6.20.1
Ebuild name:

dev-python/pypdf-6.20.1

Description

Python library to work with PDF files

Added to portage

2026-10-12

pyrfc3339 - 2.1.1
Ebuild name:

dev-python/pyrfc3339-2.1.1

Description

Generates and parses RFC 3339 timestamps

Added to portage

2026-10-12

pyspelling - 2.13
Ebuild name:

dev-python/pyspelling-2.13

Description

Spell checker automation tool

Added to portage

2026-10-12

pytest-check - 3.0.0
Ebuild name:

dev-python/pytest-check-3.0.0

Description

pytest plugin that allows multiple failures per test

Added to portage

2026-10-12

python-utils - 4.1.1
Ebuild name:

dev-python/python-utils-4.1.1

Description

Collection of small Python functions & classes

Added to portage

2026-10-12

pyzstd - 0.20.0
Ebuild name:

dev-python/pyzstd-0.20.0

Description

Support for Zstandard (zstd) compression

Added to portage

2026-10-12

rust - 1.99.0
Ebuild name:

dev-lang/rust-1.99.0

Description

Systems programming language originally developed by Mozilla

Added to portage

2026-10-12

rust-bin - 1.99.0
Ebuild name:

dev-lang/rust-bin-1.99.0

Description

Added to portage

2026-10-12

rust-common - 1.99.0
Ebuild name:

dev-lang/rust-common-1.99.0

Description

Common files shared between multiple slots of Rust

Added to portage

2026-10-12

rust-std - 1.99.0
Ebuild name:

sys-devel/rust-std-1.99.0

Description

Rust standard library, standalone (for crossdev)

Added to portage

2026-10-12

sip - 6.17.1
Ebuild name:

dev-python/sip-6.17.1

Description

Python bindings generator for C/C++ libraries

Added to portage

2026-10-12

soupsieve - 3.0.2
Ebuild name:

dev-python/soupsieve-3.0.2

Description

A modern CSS selector implementation for BeautifulSoup

Added to portage

2026-10-12

soupsieve - 3.0.3
Ebuild name:

dev-python/soupsieve-3.0.3

Description

A modern CSS selector implementation for BeautifulSoup

Added to portage

2026-10-12

source-highlight - 9999
Ebuild name:

dev-util/source-highlight-9999

Description

Generate highlighted source code as an (x)html document

Added to portage

2026-10-12

texttable - 1.7.1
Ebuild name:

dev-python/texttable-1.7.1

Description

Module to create simple ASCII tables

Added to portage

2026-10-12

tmux - 3.8
Ebuild name:

app-misc/tmux-3.8

Description

Terminal multiplexer

Added to portage

2026-10-12

tox - 4.65.3
Ebuild name:

dev-python/tox-4.65.3

Description

virtualenv-based automation of test activities

Added to portage

2026-10-12

tox - 4.65.4
Ebuild name:

dev-python/tox-4.65.4

Description

virtualenv-based automation of test activities

Added to portage

2026-10-12

tree-sitter - 0.27.1
Ebuild name:

dev-libs/tree-sitter-0.27.1

Description

Tree-sitter is a parser generator tool and an incremental parsing libra

Added to portage

2026-10-12

tree-sitter-cli - 0.27.1
Ebuild name:

dev-util/tree-sitter-cli-0.27.1

Description

Command-line tool for creating and testing tree-sitter grammars

Added to portage

2026-10-12

trilinos - 16.2.2
Ebuild name:

sci-libs/trilinos-16.2.2

Description

Scientific library collection for large scale problems

Added to portage

2026-10-12

trilinos - 17.1.2
Ebuild name:

sci-libs/trilinos-17.1.2

Description

Scientific library collection for large scale problems

Added to portage

2026-10-12

trilinos - 17.2.1
Ebuild name:

sci-libs/trilinos-17.2.1

Description

Scientific library collection for large scale problems

Added to portage

2026-10-12

upterm - 0.37.0
Ebuild name:

app-misc/upterm-0.37.0

Description

Instant Terminal Sharing

Added to portage

2026-10-12

utidylib - 1.1.0
Ebuild name:

dev-python/utidylib-1.1.0

Description

TidyLib Python wrapper

Added to portage

2026-10-12

validators - 0.36.0
Ebuild name:

dev-python/validators-0.36.0

Description

Python Data Validation for Humans

Added to portage

2026-10-12

valkey - 6.2.0
Ebuild name:

dev-python/valkey-6.2.0

Description

Python client for Valkey forked from redis-py

Added to portage

2026-10-12

vanilla-kernel - 6.18.56
Ebuild name:

sys-kernel/vanilla-kernel-6.18.56

Description

Linux kernel built from vanilla upstream sources

Added to portage

2026-10-12

vanilla-kernel - 7.2.10
Ebuild name:

sys-kernel/vanilla-kernel-7.2.10

Description

Linux kernel built from vanilla upstream sources

Added to portage

2026-10-12

virtualenv - 21.14.7
Ebuild name:

dev-python/virtualenv-21.14.7

Description

Virtual Python Environment builder

Added to portage

2026-10-12

zedis - 0.13.0
Ebuild name:

dev-db/zedis-0.13.0

Description

Blazing-fast native Redis GUI built with Rust and GPUI

Added to portage

2026-10-12

rdf newsfeed | rss newsfeed | Atom newsfeed
Copyright 2004-2025 Sascha Nitsch Unternehmensberatung GmbH
- Copyright and legal notices -
Time to create this page: 32.2 ms