from small one page howto to huge articles all in one place
 

search text in:




Other .linuxhowtos.org sites: www.linuxhowtos.org
toolsntoys.linuxhowtos.org



Last additions:
How to make X listen on port 6000

How to make X listen on port 6000

words:

34

views:

25506

userrating:

average rating: 1.5 (4 votes) (1=very good 6=terrible)


May, 25th 2007:
April, 26th 2007:
Apr, 10th. 2007:
Druckversion . pdf icon
You are here: Portage


Details of sys-apps/ed:

Description: Your basic line editor
Homepage:
http://www.gnu.org/software/ed/

available versions:

releasesalphaamd64armhppaia64mipsppcppc64ppc macoss390shsparcx86USE-Flagsdependenciesebuild warnings
ed-1.9 ~~~~~~~~-~~~~
show
show
ed-1.8 ~~~~~~~~-~~~~
show
show
ed-1.6 +++++~++-++++
show
show
ed-1.10 ~~~~~~~~-~~~~
show
show
Legend:
+ stable
~ testing
- not available
some ebuild warning depend on specific use-flags or architectures, all ebuild-warnings are shown.

Known bugs:
bug IDcomponentassigned tostatusdescriptionlast change
417883ServerbluenessUNCONFIRMEDnet-firewall/ipsec-tools-0.8.0-r3: racoon segfaults on incoming connections if privsep is used2012-07-31 02:44:59
400763Toolstools-portageUNCONFIRMEDglsa-check list only affected versions2012-01-25 15:50:55
440380Core systembase-systemUNCONFIRMEDsys-boot/lilo: unmerging when /boot isn't mounted cleans /boot2012-11-02 08:21:22
434702ApplicationsspingUNCONFIRMEDmedia-sound/mp3splt-gtk-0.7.3: QA Notice: This package installs one or more .desktop files that do n2012-11-21 18:48:15
424633EbuildssambaUNCONFIRMEDnet-fs/samba 3 vs. 4 should be SLOTted2013-01-09 17:21:01
386037DevelopmentqtUNCONFIRMEDapp-crypt/qca-ossl-2.0.0_beta3-r2: fails to build x86-abi with portage-multilib enabled2013-01-12 22:18:36
434900Ebuildspavel.stratil-junUNCONFIRMEDsys-apps/timer_entropyd-0.2 silently changed behavior2012-09-13 14:16:28
438304Applicationsmedia-videoUNCONFIRMEDmedia-video/gtk-recordmydesktop-0.3.8-r2 - QA Notice: .desktop file do not pass validation2012-11-21 18:48:47
426472Ebuildsmedia-videoUNCONFIRMEDmedia-plugins/live-2012.06.26: QA: compile: please use append-cppflags for preprocessor flags2012-07-18 15:11:05
419573JavajavaUNCONFIRMEDdev-util/visualvm needs dev-java/icedtea, but dev-java/icedtea-bin works2012-10-12 09:41:16
457768Core systembase-systemUNCONFIRMEDeselect-sh should be pulled in by @system or virtual/shell or app-shells/* or (...)2013-02-18 05:52:51
452578DevelopmentyamakuzureUNCONFIRMED[seden overlay] dev-util/eclipse-sdk-3.7.1-r9 fails to start when 2013-01-17 09:24:25
452618DevelopmentyamakuzureUNCONFIRMED[seden overlay] dev-util/eclipse-sdk-3.7.1-r10 - Bug fixes regarding incorrectly slotted virtual/jdk2013-01-17 17:45:18
458478LibraryyngwinUNCONFIRMEDx11-libs/cairo-9999 failed because cairo-1.10.2-qt-surface.patch outdated2013-02-20 21:19:46
450254ApplicationsyamakuzureUNCONFIRMED[seden overlay] dev-util/eclipse-sdk-3.7.1-r7: slot conflicts with dev-java/swt-3.7.2:3.72013-01-09 07:27:10
455076LibraryxmwUNCONFIRMEDmedia-gfx/zbar - In file included from from /usr/include/stdio.h:937:0, from zbar/debug.h:60, zbar/s2013-02-10 16:49:05
444644ApplicationsxmwUNCONFIRMEDmedia-gfx/zbar-0.10-r1 causes gtk slot conflict when USE=gtk2012-11-25 07:52:38
435750ApplicationsxemacsUNCONFIRMEDapp-editors/xemacs-21.4.22-r2 crashes if syntax highlighting in current buffer is used2012-09-28 09:57:26
458514ApplicationsxboxUNCONFIRMEDmedia-tv/xbmc USE=airplay should depend on net-dns/avahi[dbus] and media-libs/libshairport2013-02-21 12:39:06
373281ApplicationsxemacsUNCONFIRMEDapp-editors/xemacs-21.5.31 fails to emerge, because check-features.el can not be loaded2013-02-17 11:58:08
451474ApplicationsxboxUNCONFIRMEDmedia-tv/xbmc-12.0_rc2 - xbmc freezes on exit2013-01-19 14:14:51
457588ApplicationsxboxUNCONFIRMEDmedia-tv/xbmc-11.0 with a PaX kernel - xbmc.bin: LLVM ERROR: Allocation failed when allocating new m2013-02-15 15:39:36
449508EbuildsxboxUNCONFIRMEDmedia-tv/xbmc-12.0_rc2 with media-video/libav-0.8.4 - configure: error: You need either libswresampl2013-01-19 19:49:11
366533EbuildsxakeUNCONFIRMEDUSE_EXPAND for codec USE flags - MEDIA_ENCODE and MEDIA_DECODE2011-06-10 16:30:20
458300Libraryx11UNCONFIRMED>=media-libs/mesa-9.1_rc1[xa]: libxatracker.so has undefined symbol: _ZTVN10__cxxabiv120__si_class_t2013-02-21 13:47:33
458182Libraryx11UNCONFIRMEDdev-libs/wayland-1.0.4 - No rule to make target `wl_display_connect.xml', needed by `wl_display_conn2013-02-20 15:50:05
453304Eclasses and Profilesx11UNCONFIRMEDmedia-libs/mesa - unmask USE=wayland2013-01-22 16:57:55
456028Ebuildsx11UNCONFIRMED[x11 overlay] media-libs/mesa-9999 ld fails after EGIT_COMMIT=4e42e569dd56432013-02-18 12:59:25
456220Applicationsx11UNCONFIRMEDx11-base/xorg-server on hardened - X exits fatally upon failure to enable sys_iopl2013-02-12 14:40:15
458130Libraryx11UNCONFIRMEDmedia-libs/mesa-9.0.1 files contain writable and executable sections2013-02-18 22:24:29
448098KDEx11UNCONFIRMEDx11-base/xorg-server-1.13 x11-apps/xinput - xinput --map-to-output 10 (keyboard related id) VGA1 (an2013-01-02 09:11:39
447862Applicationsx11UNCONFIRMEDx11-drivers/xf86-video-ati, x11-base/xorg-server or related components memory leak2013-01-03 13:26:06
445590Libraryx11UNCONFIRMEDmedia-libs/mesa-9.0[g3dvl,vdpau]: Segmentation fault at surface.c:366 with media-video/mplayer2012-12-08 16:33:09
444928Libraryx11UNCONFIRMEDmedia-libs/mesa-9.0.1 - ld: ../../auxiliary//libgallium.a(u_dl.o): undefined reference to symbol 'dl2012-11-27 16:36:13
444157Core systemx11UNCONFIRMEDx11-base/nouveau-drm-20121015 needs patching for kernel 3.7.x2012-11-22 12:13:33
437590Libraryx11UNCONFIRMEDmedia-libs/mesa-9.0_pre20120918: libGL error: failed to load driver: nouveau with a ATI graphic cont2012-10-24 20:57:35
441666Unspecifiedx11UNCONFIRMEDmedia-libs/mesa: Install symlinks with splitdebug2012-11-04 00:12:13
443534Applicationsx11UNCONFIRMEDx11-apps/xconsole-1.0.4 eats 100% CPU if -file option is used2012-11-16 18:57:33
434526Applicationsx11UNCONFIRMEDx11-base/xorg-server message should be updated since sets are in stable portage2012-10-26 06:41:59
437176Applicationsx11UNCONFIRMEDx11-apps/xcalc-1.0.4.1 number keys stopped working2012-10-08 20:37:46
427302Applicationsx11UNCONFIRMEDmedia-fonts/font-alias-1.0.3 : Aliases referring to xyz-iso8859-1 when font packages install xyz-iso2012-07-24 13:58:10
428174Libraryx11UNCONFIRMEDmedia-libs/mesa-8.1_rc1_pre20120724 USE=r600-llvm-compiler - R600RegisterInfo.td:4762:27997: error: 2012-12-08 03:34:08
428460Applicationsx11UNCONFIRMEDmedia-libs/mesa-8.1_rc1_pre20120724 files swrast_dri.so and i915_dri.so contains insecure RUNPATHs2013-01-31 18:48:44
428650Libraryx11UNCONFIRMEDmedia-libs/mesa-8.1_rc1_pre20120724 - libGL error: failed to authenticate magic 5 // libGL error: fa2012-11-18 08:31:42
430070Applicationsx11UNCONFIRMEDx11-base/xorg-server-1.12.99.903 - using space in media-gfx/gimp-2.8.0-r1 causes segmentation fault 2012-08-08 18:40:49
432698Libraryx11UNCONFIRMEDx11-base/xorg-server-1.12.99.905 - black is rendered as "lavender" (#ffddff)2013-01-18 22:36:00
433217Applicationsx11UNCONFIRMEDx11-drivers/xf86-video-qxl-0.0.17-r1: scrnIndex var is undeclared.2012-09-02 19:34:46
433649Libraryx11UNCONFIRMEDsys-kernel/gentoo-sources-3.5, media-libs/mesa-8.1_rc1_pre20120814: i915: render error detected - In2012-09-16 12:44:13
418161Hardenedx11UNCONFIRMEDmedia-libs/mesa-8.0.3 test causes buffer overflow2012-06-02 19:02:24
408643Unspecifiedx11UNCONFIRMEDapp-admin/eselect-mesa needs update for r600 changes in mesa2012-07-11 11:14:47
403013Applicationsx11UNCONFIRMEDmedia-libs/mesa-7.11.2 fails to build with sys-devel/llvm-99992012-02-11 03:45:34
401413Applicationsx11UNCONFIRMEDx11-apps/xdm-1.1.11-r1: elibtoolize called repeatedly2012-01-30 13:03:27
401523Applicationsx11UNCONFIRMEDx11-apps/xdm-1.1.11: does not start from within a chrooted environment if LiveDVD was booted with no2012-01-31 19:37:14
397901Applicationsx11UNCONFIRMED[x11 overlay] media-libs/glmark2-2011.08 - ../src/texture.cpp:81:48: ??????: expected type-specifier2012-01-10 16:33:32
392767Ebuildsx11UNCONFIRMEDmedia-libs/mesa: Bad string substitution in mesa-7.11.2.ebuild (when doing a prefix build with 'dri'2011-12-04 13:02:37
390931Libraryx11UNCONFIRMEDmedia-libs/mesa-7.11: /usr/lib/dri/swrast_dri.so: undefined symbol: _glapi_tls_Context2012-04-27 07:05:34
386467Applicationsx11UNCONFIRMEDmedia-libs/mesa-7.11 causes X to fail to start2011-10-11 00:34:59
384685Unspecifiedx11UNCONFIRMEDXorg fonts should warn about needing a re-login2012-07-13 08:51:01
381057Ebuildsx11UNCONFIRMEDkexec + x11-drivers/xf86-video-ati + sys-kernel/gentoo-sources-3.* + RadeonHD results in corrupted d2011-09-11 02:03:40
379827Ebuildsx11UNCONFIRMEDx11-base/xorg-server Patch for Hotkey Release Layout Switching (unofficial solution to bug on freed2012-06-06 06:40:18
377395Libraryx11UNCONFIRMED[drm:radeon_crtc_page_flip] *ERROR* failed to reserve new rbo buffer before flip2011-08-03 08:59:16
365665Ebuildsx11UNCONFIRMEDx11-base/xorg-server-1.9.5 CONFIGURE_OPTIONS are deprecated, use XORG_CONFIGURE_OPTIONS instead2011-11-19 01:13:08
369207Unspecifiedx11UNCONFIRMEDnum lock LED off after changing from VT to X112011-06-07 15:33:07
371841Libraryx11UNCONFIRMEDx11-libs/libdrm-2.4.25 assertion failure triggered by sci-astronomy/stellarium-0.10.62011-06-17 09:33:02
455956ApplicationswxwidgetsUNCONFIRMEDapp-editors/wxhexeditor-0.21 version bump2013-02-07 11:28:22
457858Core systemwschlichUNCONFIRMEDsys-fs/inotify-tools moved from SourceForge to GitHub2013-02-17 17:03:51
455080Core systemwschlichUNCONFIRMEDsys-process/fcron-3.1.1 - Files were moved without updating default selinux file context policies, p2013-02-02 17:38:34
370001EbuildswrobelUNCONFIRMED[kolab overlay] ERROR: net-mail/kolab-resource-handlers-2.1 failed (depend phase): * php-lib.ecla2011-12-31 17:37:47
400927Core systemwschlichUNCONFIRMEDsys-block/megarc-1.11-r1 needs fetch restriction2012-04-15 19:43:17
454366ServerwiredUNCONFIRMEDwww-servers/lighttpd - user/group hardcoded in init script, breaks when ran under different credenti2013-01-29 14:09:39
388425ApplicationswineUNCONFIRMEDapp-emulation/wine-1.3.30 sound not working, several apps stopped working.2012-03-22 12:19:51
428464DevelopmentwilliamhUNCONFIRMEDdev-lang/go-1.0.1 - "scanelf: Invalid ar entry" / LDFLAGS ignored2012-07-29 22:36:13
449032Serverweb-appsUNCONFIRMEDwww-apps/ampache-3.5.* needs additional dependency < dev-lang/php-5.42012-12-28 21:06:13
443910Ebuildsweb-appsUNCONFIRMEDwww-apps/dragonflycms-9.3.3.1 - download URL changed2012-11-19 11:41:01
438086Applicationsweb-appsUNCONFIRMEDwww-apps/gallery-2.3.1 - "Begin Installation" fails with "The requested URL /gallery/install/
<
2012-10-12 16:43:46
377105Applicationsweb-appsUNCONFIRMEDapp-admin/webapp-config-1.50.18: self.mkfile() dies while trying to delete a path to be created2011-08-04 02:04:41
377135Keywording and Stabilizationweb-appsUNCONFIRMEDwww-apps/mediawiki-1.16.4 works on ARM2012-11-18 10:21:22
427808EbuildsvoyageurUNCONFIRMEDx11-base/xorg-server-1.12.3 crashing at start-up when compiled with sys-devel/clang2012-12-31 12:32:19
443556EbuildsvoyageurUNCONFIRMEDsys-devel/clang-3.1 - Updated ebuild with +python and +doc2012-11-17 09:03:06
427314Core systemvoyageurUNCONFIRMEDsys-apps/sed fails test with clang-3.1-r42012-07-21 14:07:01
416691KDEvoyageurUNCONFIRMEDkde-base/nepomuk-4.8.3 fails with undefined references (dragonegg problem)2012-09-28 13:05:52
393385EbuildsvoyageurUNCONFIRMEDmedia-libs/phonon-vlc-0.4.1 fails to compile with sys-devel/dragonegg-3.02012-09-28 13:05:51
388325EbuildsvoyageurUNCONFIRMEDsys-devel/llvm-2.9-r2 shared lib linking error2012-05-12 10:54:41
448930EbuildsvoipUNCONFIRMEDmedia-libs/mediastreamer needs a local description of bindist USE-flag2013-02-16 14:09:18
448934EbuildsvoipUNCONFIRMEDmedia-plugins/mediastreamer-silk needs a local description of bindist USE-flag2012-12-27 20:27:17
387283ApplicationsvoipUNCONFIRMEDFailed to emerge net-voip/linphone-3.3.22012-10-23 16:24:00
388983EbuildsvmwareUNCONFIRMEDapp-emulation/vmware-modules-238.5 with sys-kernel/hardened-sources-3.0.4-r4 - work/vmci-only/linux/2013-01-18 22:06:24
455480ApplicationsvimUNCONFIRMEDapp-editors/vim-7.3.762 - Symlinks to gz manpages are dangling because my system uses bzip2 manpages2013-02-04 19:35:50
455914ApplicationsvimUNCONFIRMEDapp-editors/{g,}vim-7.3.806 version bump2013-02-07 03:13:05
457564ApplicationsvimUNCONFIRMEDapp-editors/vim-core-7.3.762 fails with ncurses[tinfo]2013-02-14 18:18:53
438314Ebuildsvincent.hardy.beUNCONFIRMEDapp-crypt/eid-mw - misspelled metadata2012-10-15 11:09:16
453418ApplicationsvimUNCONFIRMEDapp-editors/vim-core-7.3.762 Opened file gets modified when mapping g to some other value2013-01-22 02:03:25
448472ApplicationsvimUNCONFIRMEDapp-editors/gvim - segmentation fault when using clang_complete2012-12-25 15:39:05
440564ApplicationsvimUNCONFIRMEDapp-editors/vim-7.3.409: some elog messages should only be shown when upgrading from an old enough p2012-10-31 16:25:37
441864ApplicationsvimUNCONFIRMEDapp-editors/vim-7.3.646 vim: stack smashing attack in function - terminated2012-11-05 13:04:29
440542ApplicationsvimUNCONFIRMEDapp-editors/vim-core-7.3.409: some elog messages should only be shown when upgrading from an old eno2012-10-31 16:23:55
440414ApplicationsvimUNCONFIRMEDapp-editors/vim-7.3.409: some elog messages should only be shown right after the relevant use flag i2012-10-31 15:58:55
423137ApplicationsvimUNCONFIRMEDapp-editors/vim-7.3.409: Misleading and outdated hint on solving a problem2012-06-26 14:55:41
417921ApplicationsvimUNCONFIRMEDapp-editors/vim - bash completion fails with paths containing spaces2012-05-28 11:50:58
400585ApplicationsvimUNCONFIRMEDapp-editors/vim-7.3: broken unicode while copy/paste with X PRIMARY and CLIPBOARD2012-01-25 13:56:18
378987ApplicationsvimUNCONFIRMEDvim.eclass's unmatched useflags of perl and libperl message is outdated2011-08-13 04:29:52
374259Core systemvimUNCONFIRMEDapp-editors/vim: confirm function in .vimrc causes cpu 100% & process lockup2011-08-12 18:52:09
439164EbuildsultrabugUNCONFIRMED<=app-admin/rsyslog-5.8.12 USE=ssl undefined symbol: gcry_control2012-10-29 16:10:45
454564ApplicationsultrabugUNCONFIRMEDapp-admin/rsyslog-7.2.5 - In file included from dnscache.c:30: /usr/include/bits/sched.h:132:20: err2013-02-09 15:08:04
424189Core systemudev-bugsUNCONFIRMEDsys-fs/udev-171-r6: all modules are loaded even with rc_coldplug="NO"2013-02-08 17:46:29
445534GamestuponeUNCONFIRMEDmedia-libs/varconf-1.0.0: version bump request2012-12-02 01:59:02
416265EbuildstuponeUNCONFIRMEDVersion bump: media-libs/glm-0.9.3.32012-05-16 12:48:08
398089ApplicationstristanUNCONFIRMEDx11-misc/revelation-0.4.11-r2 USE=applet - configure:13842: error: failed to find module gnomeapplet2012-01-10 00:03:01
436458ApplicationstoveUNCONFIRMEDwww-apps/ikiwiki-3.20120725 img plugin depends on media-gfx/imagemagick[perl]2012-09-28 04:02:43
453584EbuildstoveUNCONFIRMEDapp-shells/zsh - prompt_gentoo_setup: replace globally declared variables with local variables2013-01-24 09:42:42
447436Applicationstools-portageUNCONFIRMED=app-portage/genlop-0.30.8-r2 - Use of uninitialized value in concatenation (.) or string at /usr/b2012-12-17 07:12:11
453674Third-Party Toolstools-portageUNCONFIRMEDapp-portage/ufed: Shortening/cleaning flag descriptions by eliminating "[Enables/Adds/Includes] Supp2013-01-23 13:44:40
454492Toolstools-portageUNCONFIRMEDapp-portage/gentoolkit-0.3.0.7 - eclean-dist: UnboundLocalError: local variable 'cleaner' referenced2013-01-29 17:40:16
434496Toolstools-portageUNCONFIRMEDapp-portage/gentoolkit-0.3.0.6-r3 - equery crashes on unhandled exception portage.exception.InvalidD2012-09-10 06:45:50
387213Applicationstools-portageUNCONFIRMEDapp-portage/gentoolkit-0.3.0.4-r4 - revdep-rebuild: replace "requires" with "was linked against"2011-10-18 16:20:34
414655Toolstools-portageUNCONFIRMEDapp-portage/gentoolkit - eshowkw undocumented output2012-12-25 01:56:31
382231Toolstools-portageUNCONFIRMEDapp-portage/gentoolkit-0.3.0.4 euse -i has undocumented output2011-09-19 18:28:14
372049Applicationstools-portageUNCONFIRMEDRequest for app-portage/gentoolkit to show (for a use flag) status of the flag in installed packages2012-12-25 01:55:20
454200Core systemtoolchainUNCONFIRMEDsys-libs/glibc-2.17 breaks almost all binaries - error while loading shared libraries: libgcc_s.so.12013-02-09 05:39:00
453100Core systemtoolchainUNCONFIRMEDsys-devel/binutils-2.23.1: 43 unexpected failures2013-01-21 11:57:21
450714Core systemtoolchainUNCONFIRMEDsys-libs/glibc-2.16.0: /usr/include/bits/stdlib-ldbl.h:35:1: error: 'qecvt' undeclared here (not in 2013-01-20 01:23:38
447708Core systemtoolchainUNCONFIRMEDsys-devel/gcc-4.7.2 fails to crosscompile for mingw64: options.c:952:3: error: ‘HAVE_GAS_ALIGNED_COM2013-02-18 16:35:04
436636JavatoolchainUNCONFIRMEDsys-devel/gcc-{4.5,4.6,4.7?}: gcj fails to compile java source code on ia64 (hardened) - Exception i2012-12-14 08:15:05
433778Core systemtoolchainUNCONFIRMEDsys-devel/prelink-20120628: prelink: gelf_getphdr.c:120: gelf_getphdr: Unexpected error: Resource te2012-12-25 07:40:36
426306Core systemtoolchainUNCONFIRMEDsys-libs/glibc-2.14.1-r3: tests failed2012-11-10 09:00:26
427178Core systemtoolchainUNCONFIRMEDsys-libs/glibc-2.14.1-r3 - grsec: Invalid alignment/Bus error occurred at 00000301ad4cb768 in /lib642012-11-02 18:28:59
425524SandboxtoolchainUNCONFIRMED[ICE/4.6] sys-apps/sandbox build segfaults on hardened systems2012-11-17 19:16:55
395491Core systemtoolchainUNCONFIRMEDdev-util/dejagnu-1.5 failed (test phase)2013-01-23 05:24:15
385087GCC PortingtoolchainUNCONFIRMEDsys-devel/gcc-4.4.5: gcj seem to not install needed ca-certificates (/usr/lib/security/cacerts)2012-09-24 06:08:56
456172ApplicationstommyUNCONFIRMEDdev-vcs/subversion-(1.7.* ?) needs dev-db/sqlite:3 to be compiled with threadsafe2013-02-11 11:20:24
373295UnspecifiedtoolchainUNCONFIRMEDsys-libs/glibc-2.12.2: building glibc interrupted in OpenVZ container, also tried rebuilding system2011-12-22 22:40:58
453020ApplicationstommyUNCONFIRMEDdev-vcs/subversion, please consider patch to fix paths reported for externals2013-01-19 19:26:52
452900DevelopmenttommyUNCONFIRMEDdev-vcs/subversion-1.7.7 when rubygems isn't installed for ruby18 - .../work/subversion-1.7.7/libtoo2013-01-21 11:54:22
410389ApplicationstomjbeUNCONFIRMEDmedia-radio/fldigi segfaults at start up2012-04-07 22:14:10
450662ApplicationsThyArmageddon+GentooUNCONFIRMEDmedia-video/subdownloader - /usr/bin/subdownloader: File "/usr/share/subdownloader/modules/configura2013-02-16 19:47:24
457552ApplicationstgurrUNCONFIRMEDmedia-sound/mumble should not include TTS settings when USE="-speech"2013-02-17 00:37:19
392327UnspecifiedtgurrUNCONFIRMEDmedia-sound/murmur works on ~arm2012-10-20 10:20:55
396479ApplicationstgurrUNCONFIRMEDmedia-sound/mumble-1.2.3-r1: Text-to-speech doesn't work2012-11-20 11:30:20
415423EbuildstexUNCONFIRMEDupdate moderncv (included in dev-texlive/texlive-latexextra)2013-01-09 16:50:56
399087ApplicationstexUNCONFIRMEDdev-tex/pgf-2.10: Undefined control sequence "\pgf@test"2012-01-17 04:11:17
379177DevelopmenttexUNCONFIRMEDdev-tex/pdftex-1.40.10 ttf2afm.c:(.text+0x35e1): undefined reference to `kpse_set_progname'2011-08-19 21:14:54
457994LiveCD/DVDtenUNCONFIRMEDlivedvd-amd64-multilib-20121221.iso: kernel panic when booting in kvm with "-cpu host"2013-02-18 02:55:55
458388EbuildstetrominoUNCONFIRMEDmedia-libs/libv4l-0.9.3 version bump2013-02-21 10:36:12
448144LiveCD/DVDtenUNCONFIRMEDmismatched checksum for x86 amd64 20121221 LiveDVD iso2012-12-22 03:06:11
428680LiveCD/DVDtenUNCONFIRMEDlivedvd-amd64-multilib-2012.1.iso kernel panic2012-12-16 06:02:00
370819LiveCD/DVDtenUNCONFIRMEDLiveDVD 11.0 nox option causes init respawn2011-10-26 19:03:54
417007LiveCD/DVDtenUNCONFIRMEDLIVEDVD 12.1 amd64 - screen does not work2012-05-26 22:48:51
417871LiveCD/DVDtenUNCONFIRMED12.1 amd64 livedvd sshd default configuration AllowUsers line makes usage difficult2012-07-08 17:05:19
452910Core systemsystemdUNCONFIRMEDsys-apps/systemd-196[python] needs dev-python/pygobject:3 - ImportError: No module named gi.reposito2013-01-20 17:07:04
433457Core systemsystemdUNCONFIRMEDsys-apps/systemd should not store coredumps in its journal yet2012-10-27 21:52:30
444022ApplicationssysadminUNCONFIRMEDnet-analyzer/nagios-plugins-1.4.16-r{2,3}: check_ping CRITICAL - You need more args!!!2012-11-21 09:27:19
448918EbuildsswegenerUNCONFIRMEDdev-db/opendbx needs a local description of bindist USE-flag2012-12-27 20:13:18
458018ServerswegenerUNCONFIRMEDnet-dns/pdns need more strict permissions for pdns.conf (security threat)2013-02-17 18:26:06
442092ApplicationsspingUNCONFIRMEDmedia-gfx/gimp-9999 - Portage patch failed to apply (ltmain.sh version 2.4.2)!2012-11-10 00:24:49
448112ApplicationsspingUNCONFIRMEDmedia-gfx/gimp-2.8.2-r1 has several test failures.2012-12-24 00:28:37
405549LibrarysrinclanUNCONFIRMEDdev-python/pywebkitgtk-1.1.8 crashes at start when using Pax/Hardened2012-06-10 01:24:13
455162DevelopmentssuominenUNCONFIRMEDdev-util/catfish-0.4.0.2 needs dev-python/pygobject:3 in RDEPEND - Error: The required module gi.rep2013-02-04 02:33:15
435620ApplicationsspingUNCONFIRMEDapp-portage/fetchcommandwrapper-0.7.1 has path "/etc/make.conf" hardcoded2012-09-20 14:44:27
458468ApplicationssoundUNCONFIRMEDmedia-sound/easytag-2.1.8-r1 with experimental gtk3 support2013-02-20 15:11:47
457560ApplicationssoundUNCONFIRMEDmedia-sound/lame-3.99.5 fails with ncurses[tinfo]2013-02-14 18:18:05
454322UnspecifiedsoundUNCONFIRMEDmedia-sound/lame-3.99.5 - console.o: In function `get_termcap_{string,number},apply_termcap_settings2013-01-28 18:33:17
454504ApplicationssoundUNCONFIRMED>=media-sound/mpg123-1.14.4 x32 ABI built with wrong LFS alias2013-01-29 14:56:43
453900ApplicationssoundUNCONFIRMEDmedia-sound/abcde should depend on virtual/perl-Digest-SHA2013-01-26 01:40:48
453748EbuildssoundUNCONFIRMEDmedia-libs/fmod-4.44.04 version bump2013-01-24 02:59:38
450814Keywording and StabilizationsoundUNCONFIRMEDmedia-libs/flac-1.2.1-r4 stable request2013-01-08 14:04:48
453636ApplicationssoundUNCONFIRMEDmedia-sound/abcde-2.5.4: Add USE-flag "cdio"2013-01-23 16:39:21
450074ApplicationssoundUNCONFIRMEDmedia-sound/fluidsynth - provide init script with package2013-01-04 12:03:17
449780ApplicationssoundUNCONFIRMEDmedia-sound/exaile should support USE=dbus2013-01-03 00:19:45
448466EbuildssoundUNCONFIRMEDmedia-sound/gpodder 3.4.0 version bump request2012-12-25 03:39:36
448928EbuildssoundUNCONFIRMEDmedia-libs/libaacplus needs a local description of bindist USE-flag2012-12-27 20:21:50
443600ApplicationssoundUNCONFIRMEDmedia-libs/libsndfile-1.0.25 - Fails test with SyntaxError: invalid syntax in binheader_writef_check2012-11-17 18:45:12
446940ApplicationssoundUNCONFIRMEDmedia-sound/shell-fm-0.8-r1 - Invalid HTTP: HTTP/1.0 403 Forbidden from: http://ws.audioscrobbler.2012-12-12 03:37:12
442614EbuildssoundUNCONFIRMEDmedia-sound/trommler-3.8 - Fails when python3 is set.2012-11-11 11:10:35
441884LibrarysoundUNCONFIRMEDmedia-libs/libvisual-0.4.0-r2 enables threads unconditionally2012-11-05 18:58:43
441038ApplicationssoundUNCONFIRMEDdev-libs/redland-1.0.15 QA Notice: pkg-config files with wrong LDFLAGS detected2012-11-03 16:48:32
438020EbuildssoundUNCONFIRMED=media-libs/libsndfile-1.0.25 build log not verbose2012-10-12 16:20:16
440962LibrarysoundUNCONFIRMEDmedia-libs/libclalsadrv misses soname symlink, causing aeolus to be revdep-rebuilt each time2012-11-02 17:01:02
437186LibrarysoundUNCONFIRMEDmedia-libs/libclthreads has wrong DESCRIPTION and HOMEPAGE and should be moved to different category2012-10-04 17:21:28
436528LibrarysoundUNCONFIRMEDmedia-libs/speex: Resampler stops in the middle of run with multiple channels2012-09-29 15:26:02
434528ApplicationssoundUNCONFIRMEDmedia-sound/dagrab fails with buffer overflow detected when using cddb2012-09-10 11:44:45
434416Keywording and StabilizationsoundUNCONFIRMED=media-sound/qarecord-0.5.0 stable request2012-09-09 15:50:07
433385LibrarysoundUNCONFIRMEDmedia-libs/nas-1.9.2 should depend on sys-devel/flex and sys-devel/bison (virtual/yacc?)2012-09-03 14:11:42
431562ApplicationssoundUNCONFIRMEDmedia-sound/lltag 0.14.4 executable contains wrong values2012-08-15 20:03:24
418185ApplicationssoundUNCONFIRMEDmedia-sound/xmp-3.5.0 fails to play LZMA compressed module2012-06-03 13:36:25
431066UnspecifiedsoundUNCONFIRMEDmedia-libs/libvisual - error: 'sigill_handler_sse' undeclared (first use in this function)2012-11-05 15:00:00
417429ApplicationssoundUNCONFIRMEDmedia-sound/jack-3.1.1 - src_install(): SyntaxError: ('invalid syntax', ('/usr/lib64/python2.7/site-2013-01-27 12:28:16
418065EbuildssoundUNCONFIRMEDmedialibs/libclthreads-2.4.0 doesn't create major version symlink to libclthreads.so.2.4.02012-10-04 15:44:15
418063EbuildssoundUNCONFIRMEDmedia-libs/libclxclient-3.6.1 doesn't create major version symlink to libclxclient.so.3.6.12013-01-26 17:59:37
395817ApplicationssoundUNCONFIRMEDmedia-libs/libsndfile-1.0.25: fails tests with python-32012-01-18 16:03:11
398571LibrarysoundUNCONFIRMEDmedia-sound/id3v2-0.1.12 crashes when tagging mp3 with VBR due to a bug in media-libs/id3lib-3.8.32012-01-18 07:32:41
401723ApplicationssoundUNCONFIRMEDmedia-libs/libaacplus USE=fftw causes segmentation faults - ?2012-02-01 17:47:41
415305EbuildssoundUNCONFIRMEDmedia-sound/shoutcast-server-bin - update HOMEPAGE so that pkg_nofetch() is more helpful2012-10-28 04:33:12
412217LibrarysoundUNCONFIRMEDdev-libs/redland-1.0.15 has malformed Makefile, won't emerge: "missing separator"2012-04-16 17:47:14
410333ApplicationssoundUNCONFIRMEDmedia-sound/milkytracker-0.90.85 - In member function ‘virtual bool DecompressorGZIP::decompress(con2013-01-30 18:31:25
403627ApplicationssoundUNCONFIRMEDmedia-sound/herrie-2.2 doesn't honor LINGUAS for locale files2012-02-23 21:38:44
403625ApplicationssoundUNCONFIRMEDmedia-sound/gbsplay-0.0.91 doesn't honor LINGUAS for locale files2012-02-23 21:38:44
403623ApplicationssoundUNCONFIRMEDmedia-sound/exaile-0.3.2.1 doesn't honor LINGUAS for locale files2012-02-23 21:38:44
365967EbuildssoundUNCONFIRMEDmedia-sound/qarecord-0.5.0 should install icon and desktop file2011-05-06 16:34:07
370581ApplicationssoundUNCONFIRMEDmedia-sound/freebirth-0.3.2-r1 - /bin/sh: line 1: 19963 Segmentation fault ./fusebirth > fused_2011-06-09 22:50:31
371699ApplicationssoundUNCONFIRMEDInvalid HOMEPAGE and SRC_URI for media-sound/mimd2011-06-15 16:03:39
378995LibrarysoundUNCONFIRMEDmedia-libs/faad2-2.7-r2: lrintf patch for gcc4.5 or greater2011-08-15 01:02:22
383695ApplicationssoundUNCONFIRMEDBuffer overflow in media-sound/grip-3.3.1-r22012-01-18 10:56:30
385409EbuildssoundUNCONFIRMEDmedia-libs/libclthreads-2.4.0 needs new URIs2012-05-28 22:50:46
385411EbuildssoundUNCONFIRMEDmedia-libs/libclxclient media-libs/libclthreads media-sound/aeolus need new URIs2012-05-28 23:39:40
386275ApplicationssoundUNCONFIRMEDmedia-sound/cdcd-0.6.6-r2: bring debian patches2011-10-11 00:24:16
389491ApplicationssoundUNCONFIRMEDmedia-sound/timidity++ - timidity crashes when connected to rosegarden2011-11-08 15:37:25
454062Applicationsshell-toolsUNCONFIRMEDapp-misc/byobu-5.27 - create window failed: /bin/bash no such file or directory2013-02-06 16:13:05
418567Applicationsshell-toolsUNCONFIRMEDapp-misc/byobu-5.18: create session failed: /usr/bin/byobu-shell: Too many open files2013-02-06 16:13:27
426570Applicationsshell-toolsUNCONFIRMEDapp-shells/gentoo-bashcomp extended by a completion for eshowkw2012-07-17 16:56:11
432378Applicationsshell-toolsUNCONFIRMEDapp-shells/bash-completion - hard-coded path "/sbin/modinfo" in /usr/share/bash-completion/module-in2012-11-03 18:30:08
434366Ebuildsshell-toolsUNCONFIRMEDapp-text/pastebin: malfunctions because pastebin.com has changed their API2012-09-13 22:48:44
446720VulnerabilitiessecurityUNCONFIRMED2012-12-11 12:34:11
392349VulnerabilitiessecurityUNCONFIRMEDsys-devel/gdb Loads untrusted files with possible arbitrary code execution (CVE-2011-4355)2011-12-30 07:19:51
431628Default ConfigssecurityUNCONFIRMEDinformation disclosure of the IP address of all connected users to all simple users2012-09-10 06:20:24
386987VulnerabilitiessecurityUNCONFIRMEDdev-lang/ruby malformed header vulnerabilities (CVE-2011-3624)2011-10-18 20:29:53
451524Applicationssci-mathematicsUNCONFIRMEDsci-mathematics/octave-3.6.3 - libcruft/.libs/libcruft.so: undefined reference to `_gfortran_transfe2013-02-12 03:35:50
454298Ebuildssci-mathematicsUNCONFIRMEDsci-mathematics/maxima - maxima cannot be started from wxmaxima or cantor2013-02-04 03:36:37
435906Applicationssci-mathematicsUNCONFIRMEDsci-mathematics/octave-3.6.2-r1 - .../work/octave-3.6.2/src/.libs/octave: error while loading shared2013-02-04 21:38:37
402869Unspecifiedsci-mathematicsUNCONFIRMEDmedia-fonts/jsmath-extra-dark-1.0 is missing jsMath-cmmib102012-02-29 21:13:02
444032Ebuildssci-geosciencesUNCONFIRMEDsci-geosciences/grass-6.4.2 does hardcoded GCC calls2012-11-20 14:18:52
441760Ebuildssci-geosciencesUNCONFIRMEDsci-geosciences/gpsd-3.7 - NameError: name 'gps_regress' is not defined: File "/var/tmp/portage/sc2012-11-07 02:15:55
383789Applicationssci-biologyUNCONFIRMEDsci-biology/ncbi-tools++-2010.06.15-r1: libmzXML.so: undefined reference to `ncbi::CMemberInfo::SetN2013-02-17 08:11:13
435676Applicationssci-chemistryUNCONFIRMEDsci-chemistry/ghemical-2.99.2-r2 - /usr/lib64/libSCwfn.so: undefined reference to `sc::DenFunctional2012-09-21 16:11:33
452622LibrarysciUNCONFIRMEDdev-python/pytables needs to be recompiled for the exact sci-libs/hdf5 version.2013-01-18 20:03:31
449232ApplicationssciUNCONFIRMED[science overlay] sci-libs/cholmod-2.0.1: pkg-config fails to find lapack libraries installed from s2013-01-29 19:26:55
443490ApplicationssciUNCONFIRMEDsci-misc/boinc - upstream switched to git2013-01-27 10:35:55
436100LibrarysciUNCONFIRMEDsci-libs/scipy 0.9.0-r1 with media-libs/qhull-2012.1-r1 - scipy/spatial/qhull.c:206:25: fatal error:2013-02-03 13:03:23
427028ApplicationssciUNCONFIRMED[science overlay] media-gfx/librecad-9999 fails in install phase again2012-07-19 15:39:20
419995ApplicationssciUNCONFIRMED[science overlay] media-gfx/librecad-9999 - fix for changed directory structure2012-07-19 04:53:04
413041ApplicationssciUNCONFIRMEDsci-misc/boinc fails(?) when ntpdate (/etc/init.d/ntp-client) is used to abruptly change the system 2012-04-24 20:13:47
375359ApplicationsschemeUNCONFIRMEDdev-scheme/slib ebuild scripts cannot find installed drscheme2013-02-06 06:05:35
388073ApplicationssbriesenUNCONFIRMEDmedia-gfx/iscan scan area selection selection problem with >=gcc-4.52012-08-26 02:58:08
421665SandboxsandboxUNCONFIRMEDsys-apps/busybox-1.20.1 fails with sandboxing enabled2012-11-26 17:24:29
448780DevelopmentrubyUNCONFIRMED=dev-ruby/webmock-1.7.4 - Many tests failed.2013-02-20 06:24:05
454634DevelopmentrubyUNCONFIRMEDdev-lang/ruby-1.8.7_p371 - callback.func:1:7: error: expected identifier or '(' before 'long'2013-01-30 23:00:08
458022Core systemryaoUNCONFIRMEDsys-block/iscsitarget-1.4.20.2 - 1 out of 1 hunk FAILED -- saving rejects to file kernel/conn.c.rej2013-02-17 19:02:08
427854DevelopmentrubyUNCONFIRMEDdev-ruby/rspec-core-2.10.1 USE=doc - String finished while reading (break on []) already read: ...2012-07-26 05:09:16
395929EbuildsroxUNCONFIRMEDrox-base/mime-editor-0.6: uses still python_mod_optimize()2011-12-24 20:01:06
438708ApplicationsroxUNCONFIRMED2012-10-17 14:29:58
392459EbuildsroxUNCONFIRMEDrox-base/rox-launch: usage of deprecated method in ebuild2011-12-01 20:34:52
458288Applicationsrobbat2UNCONFIRMEDsys-apps/hwinfo stack smashing detected2013-02-19 20:31:17
458262baselayoutrobbat2UNCONFIRMEDsys-fs/lvm2 Failed to find sysfs mount point when starting2013-02-20 16:20:15
451374Applicationsrobbat2UNCONFIRMEDdev-vcs/git: missing required_use for "gtk" use-flag2013-01-13 17:17:07
451478Core systemrobbat2UNCONFIRMEDsys-fs/lvm2 - /etc/init.d/lvm should support multiple volume groups - Command failed with status cod2013-01-31 02:20:00
448914Ebuildsrobbat2UNCONFIRMEDdev-db/libdbi-drivers needs a local description of bindist USE-flag2012-12-27 19:52:27
444402Serverrobbat2UNCONFIRMEDnet-misc/memcached - Malformed pid filename when running multiple instances2012-11-23 09:40:18
443634Applicationsrobbat2UNCONFIRMEDdev-vcs/git-1.8.0-r1 USE=gnome-keyring - ld: i386:x86-64 architecture of input file `git-credential-2012-11-19 10:42:29
443518Keywording and Stabilizationrobbat2UNCONFIRMEDdev-libs/libmemcached-0.50 stable request2012-11-20 07:42:08
439614GNOMErobbat2UNCONFIRMEDsys-apps/vbetool-1.1: Failed Running automake2013-02-06 22:06:33
437714Core systemrobbat2UNCONFIRMEDsys-fs/lvm2-2.02.97 init stop fails to deactivated lvs and vgs on shutdown2013-02-04 12:49:21
436062Developmentrobbat2UNCONFIRMEDapp-portage/g-cpan - perl-gcpan/RT-Extension-Nginx-0.02 - mkdir /usr/etc: Permission denied at /usr/2012-09-24 11:14:58
434186Applicationsrobbat2UNCONFIRMEDmedia-gfx/monica: HOMEPAGE and SRC_URI change2012-09-07 08:58:39
424657Applicationsrobbat2UNCONFIRMEDapp-portage/g-cpan-0.16.4-r1 uses code that is depreciated in perl-5.16.02012-07-18 05:39:50
421741Developmentrobbat2UNCONFIRMEDdev-vcs/git-1.7.3.4-r1: test t7508-status.sh failed with FEATURES="sandbox -userpriv"2012-06-19 15:11:50
408065Ebuildsrobbat2UNCONFIRMEDg-cpan -i "Image::Magick" should check for "+perl" USE flag in media-gfx/imagemagick2012-03-14 20:15:22
407627Applicationsrobbat2UNCONFIRMEDsys-power/pmtools-20110323 turbostat.c:857:2: error: PIC register clobbered by ‘ebx’ in ‘asm’2012-10-07 09:44:42
403371Applicationsrobbat2UNCONFIRMEDsys-apps/rescan-scsi-bus-1.48: line 592: [: 1.03: integer expression expected2012-02-13 17:42:59
402277Applicationsrobbat2UNCONFIRMEDnet-misc/memcached-1.4.13 version bump (1.4.11 does not build)2013-01-01 15:39:01
395209Ebuildsrobbat2UNCONFIRMEDnet-misc/memcached-1.4.10 doesn't installs systemd service file2012-12-27 21:45:17
449352Gamesrich0UNCONFIRMEDgames-rpg/eternal-lands Assertion `self' failed (runtime error)2013-01-03 00:24:17
370223Applicationsrobbat2UNCONFIRMEDg-cpan crashes on install AnyEvent::Feed2011-06-09 08:02:55
454652StagesreleaseUNCONFIRMEDcurrent stage3-amd64-nomultilib has an immediate block between sys-apps/module-init-tools and sys-ap2013-01-30 14:46:25
448788InstallCDreleaseUNCONFIRMEDAMD 64 install CD: wireless network card not detected (lenovo T61, Intel Wireless 4965) - missing fi2012-12-27 07:54:59
398295StagesreleaseUNCONFIRMEDstage3-amd64-20120105 has PAGER=/usr/bin/less set but sys-apps/less not installed2013-02-12 19:10:42
396467NetbootreleaseUNCONFIRMEDInstall gentoo via PXE (integrated squashfs.image + init patch)2012-08-24 16:17:54
370803NetbootreleaseUNCONFIRMEDgentoo.igz has very limited set of NIC drivers - this breaks netboot for machines without e1000 or 2011-06-22 18:25:31
373891EbuildsramerethUNCONFIRMEDnet-misc/stunnel build fails: #error OpenSSL library compiled without thread support2012-12-25 04:27:10
424463EbuildsrafaelmartinsUNCONFIRMEDapp-portage/g-octave please provide an updated database2012-08-03 22:03:54
399201EbuildsrafaelmartinsUNCONFIRMEDdev-lua/toluapp-1.0.93: QA Notice: shared libraries lack a SONAME2012-01-17 21:14:10
366395Keywording and StabilizationrafaelmartinsUNCONFIRMED>=dev-lang/luajit-2.0.0_beta7 needs arm and ppc testing2012-05-31 17:47:27
458222UnspecifiedqtUNCONFIRMED[qt overlay] x11-libs/qt-webkit-5.9999 - ACCESS DENIED mkdir: /usr/lib64/qt5/plugins/webkit2013-02-20 10:38:21
458266ApplicationsqtUNCONFIRMEDmedia-video/smplayer should respect LINGUAS2013-02-20 14:37:33
430348EbuildsradioUNCONFIRMEDnet-wireless/gnuradio-3.6.1-r1 USE="doc" - some documentation is installed outside /usr/share/doc/${2012-08-13 23:02:49
417875ApplicationsradhermitUNCONFIRMEDmedia-gfx/wkhtmltopdf should install man page2012-05-28 11:33:37
451456LibraryqtUNCONFIRMED[qt overlay] Qt5 packages try to link against already installed versions during recompilation2013-02-14 11:59:11
449092LibraryqtUNCONFIRMED[qt overlay] x11-libs/qt-webkit-5.0.0 fails to build: undefined reference to `JSC::JSCell::classInfo2013-02-16 10:09:49
442220ApplicationsqtUNCONFIRMEDapp-editors/focuswriter - segmentation fault in Xfce42013-01-06 15:59:32
435334Applicationsqmail-bugsUNCONFIRMEDmail-mta/netqmail-1.06 - pkg_postinst(): queue-repair failed2012-10-14 19:09:10
377939Applicationsqmail-bugsUNCONFIRMEDnet-mail/vpopmail - added PostgreSQL support and USE flag2012-04-11 04:19:05
379033Serverqmail-bugsUNCONFIRMEDmail-filter/qmail-scanner: Causing problems with RBL-checks activated spamassassin on target when se2011-08-14 02:01:12
435534ApplicationsqemuUNCONFIRMEDapp-emulation/qemu-kvm-1.1.1-r1 - manual pages are not installed2012-11-30 12:14:46
440214EbuildsqaUNCONFIRMED[tracker] packages with emerge messages that can be improved by checking the previous installed vers2013-02-14 19:45:48
407597DevmanualqaUNCONFIRMEDhardblockers and versioned slot deps missing under general-concepts/dependencies2013-01-01 18:38:03
380379DevmanualqaUNCONFIRMEDQuickstart ebuild guide is outdated re: emake2011-08-23 15:27:47
457676DevelopmentpythonUNCONFIRMEDdev-python/pymad-0.6 madmodule.so is segfaulting as soon as it is invoked2013-02-15 17:17:34
450086Keywording and StabilizationpythonUNCONFIRMEDPlease stabilize =dev-python/stevedore-0.62013-01-05 17:04:57
447264UnspecifiedpythonUNCONFIRMEDdev-lang/python - QA Notice: USE Flag 'hardened' not in IUSE2012-12-15 15:50:35
443886UnspecifiedpythonUNCONFIRMEDdev-python/traits dev-python/chaco dev-python/pyface USE=doc - ACCESS DENIED mkdir: /root/.config/o2012-11-19 10:44:55
439662EbuildspythonUNCONFIRMED=dev-lang/python-2.7.3-r2 pydoc-2.7 init script should drop need net2012-10-26 16:14:27
439724ApplicationspythonUNCONFIRMED>app-editors/leo-4.9 USE =tk is not needed anymore2012-10-26 16:26:57
434716DevelopmentpythonUNCONFIRMEDdev-lang/python:2.7 - POSIX_SEMAPHORES_NOT_ENABLED 1 in /usr/include/python2.7/pyconfig.h2012-09-11 15:18:37
420271ApplicationspythonUNCONFIRMED=dev-python/twisted-11.0.0: fails test wrt twisted.test.test_udp.Server2012-06-11 10:59:36
425152ApplicationspythonUNCONFIRMEDdev-python/genshi-0.6: ebuild does not expose speedups c module2012-07-27 20:44:20
405183ApplicationspythonUNCONFIRMEDdev-python/reportlab should not depend on media-fonts/ttf-bitstream-vera2012-02-22 18:19:40
407681ApplicationspythonUNCONFIRMEDmedia-sound/quodlibet-2.3.92-r1 segfaults when dev-lang/python-2.7.2-r3 is compiled with the hardene2012-10-06 17:14:29
402659DevelopmentpythonUNCONFIRMEDdev-python/pydb-1.26-r1 - ImportError: No module named fns2012-04-24 16:19:54
395495ApplicationspythonUNCONFIRMEDdev-lang/python-3.2.2 failed (test phase)2011-12-22 08:56:37
449494LibraryproaudioUNCONFIRMEDmedia-libs/fidlib-0.9.10 should have header control2012-12-31 18:53:03
451668ApplicationsproaudioUNCONFIRMEDmedia-sound/lash-0.5.4-r1 with sys-devel/gcc-4.7.2 - lash.c:203:19: error: storage size of ‘max_fds’2013-02-03 22:16:12
458256ApplicationsprometheanfireUNCONFIRMEDmedia-sound/spotify-0.8.8.323-r1 spotify-dbus.py isn't python 3.2 compatible2013-02-19 14:22:25
370711Serverproxy-maintUNCONFIRMEDmedia-sound/teamspeak-server-bin-3.0.0_beta30: Crashes when starting from stock init script - Virtua2012-11-18 10:17:00
442168ApplicationsproaudioUNCONFIRMEDmedia-sound/patchage - Build failure when python-3 is set as active version2012-12-23 21:12:37
435270LibraryproaudioUNCONFIRMEDmedia-libs/aubio-0.3.2-r1 - SyntaxError: ('invalid syntax', ('/usr/lib64/python2.7/site-packages/aub2012-09-17 11:44:31
440316ApplicationsproaudioUNCONFIRMEDmedia-sound/sonic-visualiser-2.0 version bump2013-01-11 12:08:59
426672EbuildsproaudioUNCONFIRMEDmedia-sound/timemachine should install a desktop file2012-07-18 15:45:01
414447LibraryproaudioUNCONFIRMEDmedia-libs/lv2core-3.0 (with python 3) - ./waf: SyntaxError: invalid syntax2012-12-08 20:52:16
417395ApplicationsproaudioUNCONFIRMEDmedia-plugins/ir_lv2 - make & install "convert4chan"-tool2012-05-24 16:48:34
426658EbuildsproaudioUNCONFIRMEDmedia-sound/phasex-0.12.0_beta3 installs desktop and icon files in wrong places2013-01-13 09:19:20
413623ApplicationsproaudioUNCONFIRMEDmedia-sound/terminatorx 3.82 and 3.84 - tX_midiin.cc:452:2: error: cannot convert ‘gzFile_s**’ to ‘g2013-01-06 04:23:20
407163LibraryproaudioUNCONFIRMEDmedia-libs/portmidi needs kernel config checks for CONFIG_SND_USB_AUDIO, CONFIG_SND_SEQUENCER2012-03-07 16:40:02
412715EbuildsproaudioUNCONFIRMEDmedia-plugins/swh-plugins: please remove obsolete DEPEND="dev-vcs/cvs"2012-04-21 17:31:26
405769ApplicationsproaudioUNCONFIRMEDmedia-libs/zita-convolver misses a soname symlink2012-06-04 13:42:26
372525ApplicationsproaudioUNCONFIRMEDmedia-sound/jack-audio-connection-kit-0.120.2 crashes with buffer overflow detected in jack_alsa.so2011-10-10 00:02:33
388549ApplicationsproaudioUNCONFIRMEDmedia-libs/lv2core-9999 - missing dependency on dev-python/rdflib2011-10-26 14:24:49
391675EbuildsproaudioUNCONFIRMEDmedia-plugins/swh-plugins - make x86 extensions optional at compile time2012-07-04 13:47:31
396211ApplicationsproaudioUNCONFIRMEDmedia-sound/ardour crashes - /usr/share/themes/Clearlooks/gtk-2.0/gtkrc:76: error: unexpected identi2012-10-06 14:26:04
397671EbuildsproaudioUNCONFIRMEDmedia-sound/vmpk add USE=doc2012-01-05 02:47:42
403471ApplicationsproaudioUNCONFIRMEDmedia-sound/rezound-0.12.3_beta-r2 - work/rezound-0.12.3beta/src/frontend_fox/../../src/PoolFile/TSt2012-02-14 18:25:30
434940PrintingprintingUNCONFIRMEDnet-print/cups-1.6.1 prints square of number of prints requested2012-09-24 16:56:30
403595ApplicationsproaudioUNCONFIRMEDmedia-sound/ardour-2.8.12 doesn't honor LINGUAS for locale files2012-02-23 21:38:44
455238LibraryprintingUNCONFIRMEDmedia-libs/vigra-1.7.1-r1 failed (compile phase): ImportError: No module named nose2013-02-05 01:00:18
440886PrintingprintingUNCONFIRMEDnet-print/cups-bjnp-1.1 - In file included from bjnp-io.c:22:0: bjnp-protocol.h:100:5: error: redefi2013-02-11 11:01:36
436500LibraryprintingUNCONFIRMEDapp-text/ghostscript-gpl with media-libs/freetype-2.4.10-r1 USE=infinality - ghostscript based appli2013-02-16 21:14:40
436314ApplicationsprintingUNCONFIRMEDdev-libs/pslib-0.4.5 underlinked - misses libm2013-01-29 07:30:26
430498PrintingprintingUNCONFIRMEDnet-print/cups-bjnp-1.0 and net-print/cups-1.6.1: Failed to read side-channel request!2012-08-09 23:40:25
420623PrintingprintingUNCONFIRMEDnet-print/foo2zjs-99999999 fails emerge with permission denied, access attempt outside the sandbox2013-01-27 23:07:16
408855PrintingprintingUNCONFIRMEDapp-text/acroread-9.4.7 with www-client/firefox-10.0.1-r1 - after closing pdf loaded in tab acroread2012-03-20 14:30:11
399741PrintingprintingUNCONFIRMEDmedia-libs/plotutils-2.6 - g_miscmi.c:26:58: fatal error: xmi.h: No such file or directory2013-02-12 05:34:31
375397PrintingprintingUNCONFIRMEDnet-print/foo2zjs-99999999: firmware not loaded into printers2012-02-19 22:07:51
455226Prefix SupportprefixUNCONFIRMEDprefix has python3_2 enabled but no python:3.2 ebuilds2013-02-03 02:45:11
450512Prefix SupportprefixUNCONFIRMEDmedia-gfx/graphite2: Undefined symbols for architecture ppc2013-02-02 15:39:11
450388Prefix SupportprefixUNCONFIRMEDsci-libs/dsdp-5.8-r2: emerge fails in make_shared_library on OS X2013-01-05 14:03:11
447348Prefix SupportprefixUNCONFIRMEDbootstrap-prefix fails on emerge 'sed'2012-12-18 16:15:59
447556Mac OSXprefixUNCONFIRMEDdev-python/virtualenv-1.8.4 emerge failed with error virtualenv-3.3 already exists2013-01-19 18:48:58
437020Prefix SupportprefixUNCONFIRMEDbootstrap-prefix failed on gcc-4.2.4 in stage 32012-10-03 15:44:28
435044Prefix SupportprefixUNCONFIRMEDbootstrap-prefix.txt fails on comilation of portage/app-editors/nano-2.3.1-r22012-10-01 14:08:25
433972Prefix SupportprefixUNCONFIRMEDapp-text/tree-1.6.0-r1: failed to compile on Mac OSX Mountain Lion2012-10-10 01:23:24
423679Prefix SupportprefixUNCONFIRMEDInvalid install_name in media-libs/opencv-2.4.02012-06-26 16:20:27
422907Prefix SupportprefixUNCONFIRMEDdev-lang/ghc-7.4.1-r1: Undefined symbols for architecture x86_64 when building in-tree ghc-pwd2012-09-28 20:27:16
419793Prefix SupportprefixUNCONFIRMEDapp-emulation/hercules-3.07: install failed due to chown root2012-08-25 06:35:42
419517Prefix SupportprefixUNCONFIRMEDdev-lang/php[gd] does not pull in media-libs/gd2012-06-03 18:42:03
416501Prefix SupportprefixUNCONFIRMEDdev-java/jffi-1.0.0 and jffi-1.0.11 failed to build: No rule to make target2012-05-18 14:04:04
416465Prefix SupportprefixUNCONFIRMEDFailed to emerge dev-libs/protobuf-2.4.1 "No suitable threading library available."2012-08-12 20:11:24
413167Prefix SupportprefixUNCONFIRMEDsys-fs/fuse-2.9.0: emerge failed at compile phase.2012-04-22 23:17:14
412773Prefix SupportprefixUNCONFIRMEDapp-editors/emacs-vcs: Includes incorrect libpng header file2012-04-22 13:12:19
402465UnspecifiedprefixUNCONFIRMEDmedia-video/avidemux-2.5.6 - work/avidemux_2.5.6/plugins/ADM_audioDevices/Sdl/ADM_deviceSDL.cpp:15:12012-02-07 23:23:49
392979Prefix SupportprefixUNCONFIRMEDmedia-gfx/fontforge-20110222-r1 fails to compile on x86-macos2012-05-31 12:28:59
395021Prefix SupportprefixUNCONFIRMEDWriting ebuilds that have different dependencies across platforms undocumented2012-03-01 16:39:16
387733Prefix SupportprefixUNCONFIRMEDmedia-video/mplayer2-9999 fails to build on MacOS X in gentoo prefix2012-05-13 21:53:31
371601Prefix SupportprefixUNCONFIRMEDmedia-libs/gegl fails to compile2012-06-23 20:46:50
381105Prefix SupportprefixUNCONFIRMEDdev-lang/nasm-2.09.10: failed to compile in prefix/linux-amd642011-08-30 04:04:34
382413Prefix SupportprefixUNCONFIRMEDx11-lib/qt-webkit fails to link against media-libs/phonon on Mac OS X (framework is missing)2011-09-09 18:29:43
384581Mac OSXprefixUNCONFIRMEDapp-editors/emacs-23.3-r2: emerge failed with error unexec: my_endbss_static is not in section __bss2011-10-31 03:04:33
448294Applicationspolynomial-cUNCONFIRMEDapp-emulation/virtualbox-4.2.6: cannot open shared object libstdc++.so.62012-12-24 10:19:17
447302Applicationspolynomial-cUNCONFIRMEDapp-emulation/virtualbox-modules-4.2.4 with gentoo-sources-3.7.0 - Header files were moved and re-or2013-02-03 19:32:07
444464Applicationspolynomial-cUNCONFIRMEDapp-emulation/virtualbox-4.1.22 - .../work/VirtualBox-4.1.22/src/VBox/Runtime/common/err/errmsg.sed 2012-12-23 18:15:49
438930Ebuildspolynomial-cUNCONFIRMEDapp-emulation/virtualbox-4.2 USE=vnc - vnc module is built but not installed2012-12-21 18:07:10
432884Ebuildspolynomial-cUNCONFIRMEDapp-emulation/virtualbox-modules: undeclared 'VM_RESERVED'2013-01-24 15:45:20
436360Applicationspolynomial-cUNCONFIRMEDwww-client/seamonkey-2.12.1 - /bin/sh: line 1: 24652 Aborted .../work/comm-release/seamonk/suite/ins2012-09-28 14:44:46
431144Applicationspolynomial-cUNCONFIRMEDnet-irc/xchat-2.8.8-r2 - saved configuration is corrupted on read or write2012-08-15 12:32:17
428124Applicationspolynomial-cUNCONFIRMEDapp-emulation/virtualbox-4.1.12: "Failed to create the VirtualBox COM object"2012-09-21 15:25:00
401823Applicationspolynomial-cUNCONFIRMEDseamonkey desktop file lists unhandled mimetype associations2012-02-16 12:48:55
395429Ebuildspolynomial-cUNCONFIRMEDapp-emulation/virtualbox-modules: need check CONFIG_HZ=value2011-12-21 02:10:58
414815PMS/EAPIpms-bugsUNCONFIRMED[Future EAPI] Support for repository dependencies in DEPEND, PDEPEND and RDEPEND and atoms passed to2013-01-12 13:12:54
367443Ebuildspolynomial-cUNCONFIRMEDapp-emulation/virtualbox-9999 sets RPATH to /opt/VirtualBox but is installed to /usr/lib/virtualbox2011-05-17 17:41:46
365643Ebuildspolynomial-cUNCONFIRMEDapp-emulation/virtualbox-additions-4.* License wrongly stated as PUEL2012-07-18 02:27:12
440218Conceptual/Abstract Ideaspms-bugsUNCONFIRMEDportage should have a ebuild-accessible variable for the USE flags of previously-installed versions2012-10-30 16:30:36
425214PMS/EAPIpms-bugsUNCONFIRMED'dohtml -r ${directory}/' has undocumented behavior2012-07-08 06:59:50
414811PMS/EAPIpms-bugsUNCONFIRMED[Future EAPI] globstar shell option enabled by default2013-02-07 19:03:35
380459PMS/EAPIpms-bugsUNCONFIRMEDMERGE_TYPE phases aren't defined2011-08-24 17:51:29
456928Applicationsphp-bugsUNCONFIRMEDdev-lang/php-5.4.8[imap] - ./conftest: symbol lookup error: /usr/lib64/libc-client.so.1: undefined s2013-02-13 19:05:07
452568Ebuildsphp-bugsUNCONFIRMEDdev-php/phpunit should be slotted2013-01-16 16:30:51
451840Developmentphp-bugsUNCONFIRMED=dev-lang/php-5.4.8 - /usr/lib/gcc/x86_64-pc-linux-gnu/4.5.4/../../../../lib64/libldap.so: undefined2013-01-14 12:35:20
434968Applicationsphp-bugsUNCONFIRMEDdev-php/pecl-memcached add USE=json2013-01-08 18:40:16
423167Developmentphp-bugsUNCONFIRMEDdev-php/pecl-http-1.7.4 fails at runtime with "undefined symbol: gcry_control" when using net-libs/g2012-08-01 12:00:35
458380LibraryphosphanUNCONFIRMEDmedia-libs/jasper: ebuild patch for multilib support2013-02-20 21:19:41
456018ApplicationsphosphanUNCONFIRMEDmedia-gfx/sane-backends should show add user to scanner group message2013-02-07 14:31:50
454882DevelopmentperlUNCONFIRMEDdev-perl/TermReadKey-2.300.0 - ReadKey.o: file not recognized: file truncated - collect2: ld executi2013-01-31 23:12:14
439920Core systemperlUNCONFIRMEDdev-lang/perl-5.12.4-r1 - pp.o: In function `Perl_pp_pow': pp.c:(.text+0x3a8a): undefined reference 2012-10-28 16:20:23
437484DevelopmentperlUNCONFIRMEDdev-lang/perl-5.16.1 - Pod::Perldoc (perldoc) failures caused by typo2012-10-08 11:15:54
432944UnspecifiedperlUNCONFIRMEDperl-gcpan/Math-GSL-0.27 wants to install perl-gcpan/Test-Tester-0.108 which conflics with installed2012-09-17 07:17:25
420033DevelopmentperlUNCONFIRMEDdev-perl/MooseX-Types-DateTimeX fails tests with MooseX-Types-DateTime-ButMaintained-0.140.02012-06-07 09:09:11
423973DevelopmentperlUNCONFIRMEDdev-perl/Net-DNS-0.660.0 and 0.680.0 damages $SIG{} hash when included.2012-06-28 13:41:39
421159DevelopmentperlUNCONFIRMEDvirtual/perl-libnet needs updated RDEPEND2012-06-15 15:36:15
416455ServerperlUNCONFIRMEDmail-filter/spamassassin-3.3.2-r1 - child process [3695] exited or timed out without signaling produ2012-05-27 12:05:55
408151LibraryperlUNCONFIRMEDdev-perl/Cairo-1.90.0 with dev-lang/perl-5.14.2 - Failed 1/8 test programs. 6/270 subtests failed.2012-04-03 19:32:36
407841ApplicationsperlUNCONFIRMED=dev-lang/perl-5.14.2[build] is missing feature.pm, required by aclocal (during stage building)2012-05-27 02:40:44
458440ApplicationspatrickUNCONFIRMEDapp-office/openerp-6.1.1-r1 USE=-postgres - sed: can't read /var/tmp/portage/app-office/openerp-6.1.2013-02-20 15:16:18
453516ApplicationspatrickUNCONFIRMEDapp-emulation/virtualbox-bin-4.2.6 - can not use Bridged Adapter in network config2013-01-23 14:33:55
445120LibrarypatrickUNCONFIRMEDsys-libs/tdb-1.2.10 - Compilatin phase failed - [Errno 2] No such file or directory: '/var/tmp/porta2012-12-08 15:46:16
444218ApplicationspatrickUNCONFIRMEDwww-servers/apache-2.4.3 - init script doesn't handle failed start correctly2013-02-16 13:19:08
432326EbuildspatrickUNCONFIRMEDapp-emulation/virtualbox-guest-additions should add group "vboxsf" to support automount shared folde2012-10-23 10:19:47
430274EbuildspatrickUNCONFIRMEDwww-servers/apache-2.2.22-r1: modules aren't compiled with -fPIC2013-02-16 13:34:26
427946Eclasses and ProfilespatrickUNCONFIRMEDapache-2.eclass: Proposed enhancement: USE_EXPAND of APACHE2_MODULES should support IUSE-DEFAULTS2013-02-17 09:25:03
424373ApplicationspatrickUNCONFIRMEDnet-misc/strongswan-5.0.0 - Outdated description about (non-)root privileges2012-07-03 14:39:13
410451ApplicationspatrickUNCONFIRMEDwww-servers/apache-2.4.1-r1 APACHE2_MPMS="itk" - configure: error: MPM itk is not supported on this 2013-02-16 13:20:37
409303ApplicationspatrickUNCONFIRMEDdev-lang/nqp-2012.02 - In file included from dyncall_thunk.c:27:0: dyncall_thunk.h:59:1: error: func2012-03-22 14:55:21
403439ServerpatrickUNCONFIRMEDwww-servers/apache: remove deprecated AddDirectoryIndex from default config2013-02-16 14:05:28
396179ApplicationspatrickUNCONFIRMEDdev-lang/nqp-2011.10 - /usr/bin/parrot: symbol lookup error: dynext/nqp_group.so: undefined symbol: 2011-12-27 21:15:43
385783ApplicationspatrickUNCONFIRMEDwww-servers/apache-2.2.21 cross-compilation fix (libtool related)2013-02-16 13:33:00
456908Core systempam-bugsUNCONFIRMEDsys-libs/pam-1.1.6-r2: /usr/lib64/portage/bin/isolated-functions.sh: line 215: wait: `Failed Running2013-02-16 21:10:14
385779ApplicationspatrickUNCONFIRMEDapp-admin/apache-tools-2.2.21 cross-compilation fix (libtool related)2013-02-16 13:32:00
307401ApplicationspachoUNCONFIRMEDmedia-gfx/xsane crashes during startup if xinerama is enabled2012-03-02 11:17:03
428282LibrarypachoUNCONFIRMEDnet-wireless/bluez-4.99 expected specifier-qualifier-list before ‘typeof’ in bluetooth.h2013-02-12 21:43:00
402355Applicationspam-bugsUNCONFIRMEDsys-auth/pam_keystore HOMEPAGE outdated (404)2012-02-06 20:31:29
446172Core systempam-bugsUNCONFIRMEDsys-libs/pam-1.1.5 fails to cross-compile because flex is not installed in the target2013-01-09 09:31:35
445192Other documentsoverlaysUNCONFIRMEDDeprecated references to /etc/make.conf in the Gentoo overlays users' guide2012-12-01 07:27:56
458074OpenRCopenrcUNCONFIRMEDsys-apps/openrc-0.11.8 doesn't parse correctly options contained two words abreast self2013-02-18 13:35:38
455912OpenRCopenrcUNCONFIRMEDsys-apps/openrc-0.11.8 with sys-libs/ncurses[tinfo] - ../libeinfo/libeinfo.so: undefined reference t2013-02-14 14:13:57
446606OpenRCopenrcUNCONFIRMEDsys-apps/openrc: Routing policy rules need to be set before routes2013-01-15 20:33:29
430318OpenRCopenrcUNCONFIRMEDsys-apps/openrc-0.10.5 fails to remounts reiserfs root file system read only on reboot: failed becau2012-11-07 11:40:40
436266OpenRCopenrcUNCONFIRMEDsys-apps/openrc-0.9.8.4: start in LXC brings down lxc-initialized interface2012-10-05 14:00:02
439174OpenRCopenrcUNCONFIRMEDrc-update (and other rc utilities) need to be quiet when --quiet is specified2013-01-01 21:24:06
417365OpenRCopenrcUNCONFIRMEDsys-apps/openrc: parameter "-1" passed to dhclient, causing dhclient not to retry when failing2012-12-07 11:49:41
411461OpenRCopenrcUNCONFIRMEDsys-apps/openrc-0.9.8.4: services fail to start at boot because of "stalled" deptree cache2012-04-10 12:21:07
409787OpenRCopenrcUNCONFIRMEDsys-apps/openrc-0.9.9.3: "rc-status -a" doesn't display all started services2012-11-07 15:40:11
367717OpenRCopenrcUNCONFIRMEDsys-apps/openrc: services which need net aren't starting on boot2011-06-29 16:46:02
369811ApplicationsopenrcUNCONFIRMEDsys-apps/openrc: Patch to measure time required for starting daemons (was: delay to sys-auth/console2012-05-20 13:25:32
366779OpenRCopenrcUNCONFIRMEDsys-apps/openrc - "cannot allocate memory" when overcommit is disabled2012-02-27 14:07:23
448130ApplicationsopenofficeUNCONFIRMEDapp-office/libreoffice-3.6.4.3 - /usr/lib64//libclucene-core.so: undefined reference to `std::__deta2012-12-27 07:54:58
430224ApplicationsopenofficeUNCONFIRMEDapp-office/libreoffice-bin-3.5.4.2 - printing to CUPS fails before the job has been submitted2012-08-08 18:24:36
410719ApplicationsnxUNCONFIRMEDnet-misc/nxclient - nxclient: symbol lookup error: /usr/lib/libfontconfig.so.1: undefined symbol: FT2012-04-04 02:19:00
458274ApplicationsnirbheekUNCONFIRMEDnet-misc/networkmanager-0.9.6.4 does not save settings for wired connection with 802.1x authenticati2013-02-21 08:24:51
369851ApplicationsnxUNCONFIRMEDnet-misc/nx-3.4.0-r3 *** stack smashing detected ***: nxagent - terminated2012-07-12 06:06:30
443596ApplicationsnirbheekUNCONFIRMEDnet-misc/networkmanager: ifnet plugin does not save cloned MAC address & duplicates entries2013-01-26 21:16:37
399193ApplicationsnirbheekUNCONFIRMEDnet-misc/networkmanager-0.9.2.0-r2: init script needs net.lo2012-11-04 15:16:36
436534EbuildsnirbheekUNCONFIRMEDmedia-fonts/source-sans-pro-1.036 version bump2012-09-29 15:26:54
457566LibrarynikoliUNCONFIRMEDmedia-libs/libechonest-2.0.3 version bump2013-02-15 15:35:23
457656ApplicationsnikoliUNCONFIRMEDmedia-sound/clementine (while scanning media) - segfault in TagLib::File::find(TagLib::ByteVector co2013-02-15 15:57:13
450674ApplicationsnetmonUNCONFIRMEDnet-analyzer/rrdtool needs a group for rrdcached2013-01-07 12:07:36
448938EbuildsnikoliUNCONFIRMEDmedia-video/mplayer2 needs a local description of bindist USE-flag2012-12-27 20:30:03
456024ApplicationsnikoliUNCONFIRMEDmedia-sound/clementine 1.1.1 crashes with 0 size .mood file when moodbar is enabled in the playlist2013-02-07 14:14:11
452484ApplicationsnikoliUNCONFIRMED=media-video/mplayer2-2.0_p20120828 ABI=x32 - cpudetect.c:206: Error: invalid instruction suffix for2013-01-29 12:55:58
439654EbuildsnetmonUNCONFIRMEDnet-misc/iperf iperf init script should drop need net2012-10-26 16:11:02
439652EbuildsnetmonUNCONFIRMEDnet-analyzer/rrdtool rrdcached init script should drop need net2012-10-26 16:27:07
433443EbuildsnetmonUNCONFIRMEDnet-analyzer/snmptt should install snmptthandler-embedded2012-09-03 15:46:10
428674ApplicationsnetmonUNCONFIRMEDnet-analyzer/ifmetric-0.3 with kernel 3.5 -
NETLINK: Packet too small or truncated! 32!=16!=101
2012-07-30 23:43:53
405765ApplicationsnetmonUNCONFIRMEDnet-analyzer/rrdtool-1.4.5-r2 - main.c:(.text+0x26c): undefined reference to `rrd_xport'2012-08-26 06:23:55
408825ApplicationsnetmonUNCONFIRMEDnet-analyzer/ntop-4.1.0 No interface has been configured. Please configure ntop first.2012-08-11 18:16:20
410549ServernetmonUNCONFIRMEDnet-analyzer/ntop init.d script looks for ntop data at a hardcoded location2012-04-06 22:12:41
396353Prefix SupportnetmonUNCONFIRMEDnet-analyzer/nmap fails with LDFLAGS="-Wl,--as-needed" on sparc64-solaris2013-01-15 17:08:42
396171ApplicationsnetmonUNCONFIRMEDnet-misc/iperf-2.0.5 when using -i flag, interval calculated to be negative and spews output2011-12-27 21:01:05
367375EbuildsnetmonUNCONFIRMEDnet-analyzer/ndoutils-1.4_beta9: "db/" directory from source code is not installed to system2012-02-09 10:57:19
425196Developmentnet-proxyUNCONFIRMEDnet-proxy/adzapper needs flush.pl (removed from dev-lang/perl-5.16.0)2012-09-30 19:55:13
437350Applicationsnet-p2pUNCONFIRMEDnet-p2p/deluge-1.3.5 init.d script does not apply DELUGED_OPTS2013-01-26 06:26:03
449818Applicationsnet-p2pUNCONFIRMEDnet-p2p/deluge-1.3.5 with >=net-libs/rb_libtorrent-0.16 - metadata for torrents added using a magnet2013-01-03 12:09:55
427936Ebuildsnet-p2pUNCONFIRMEDmedia-libs/gupnp-dlna-0.6.6 USE=introspection - sandbox violation in /dev/dri/card0 by gst-plugin-sc2013-02-05 18:34:08
420157Ebuildsnet-p2pUNCONFIRMED${AMULEHOME} do not work for amuled, amuleweb (net-p2p/amule-2.3.1)2013-01-14 23:46:38
388879Servernet-p2pUNCONFIRMEDnet-p2p/mldonkey-3.1.0: Exception setgid failed: Operation not permitted trying to set group_gid2011-11-21 00:31:52
432502Ebuildsnet-mailUNCONFIRMEDmail-filter/mimedefang-2.73 please stabilize2012-11-09 18:12:51
387009Applicationsnet-mailUNCONFIRMEDnet-mail/fetchmail - modified initscript to allow multiple daemons AND inlined configuration2011-11-08 12:12:48
449526Applicationsnet-imUNCONFIRMEDnet-im/pidgin-2.10.6 fails to compile with USE="eds" and gnome-extra/evolution-data-server-3.62013-02-12 16:15:52
439550Applicationsnet-imUNCONFIRMEDx11-plugins/pidgin-otr-3.2.1 - configure: error: libotr 3.2.0 or newer is required.2012-10-25 15:42:02
399779Applicationsnet-imUNCONFIRMEDnet-im/pidgin flawed deps2012-06-02 18:36:38
429802Ebuildsnet-imUNCONFIRMEDnet-im/sendxmpp-1.20 with 2012-08-04 16:43:36
380889Applicationsnet-imUNCONFIRMEDnet-im/sendxmpp-1.20 does not work when dev-perl/XML-Stream-1.22 is installed (1.23 needed)2011-09-01 19:39:25
381279Servernet-imUNCONFIRMEDnet-im/jabberd2-2.2.4: error: XML parse error (not well-formed (invalid token)) in c2s log for some 2012-10-20 06:45:03
453962Core systemnet-fsUNCONFIRMEDnet-fs/autofs-5.0.6-r5: umount automounted NFS share fails2013-02-16 13:31:29
439660Ebuildsnet-fsUNCONFIRMEDnet-fs/nfs-utils nfsmount init script should drop need net2012-11-19 20:31:41
402343Servernet-fsUNCONFIRMEDnet-fs/netatalk /etc/init.d/afpd needs avahi-daemon even if called with -nozeroconf2012-04-08 21:14:32
455470Applicationsnet-dialupUNCONFIRMEDnet-dialup/pptpclient-1.7.2-r2: applied patch hardcodes wrong ip path2013-02-04 18:47:35
436122Ebuildsnet-dialupUNCONFIRMEDnet-dialup/ppp-2.4.5-r3 - Failed Patch: 80_all_eaptls-mppe-0.991-gentoo.patch !2012-11-09 04:09:40
407227baselayoutnet-dialupUNCONFIRMEDnet-dialup/ppp - /etc/init.d/net.ppp0 goes into endless loop after openvpn was stopped2012-04-22 20:16:25
406139Applicationsnet-dialupUNCONFIRMEDnet-dialup/ppp-2.4.5-r2: /etc/resolv.conf gets emptied upon connection re-negotiation.2012-04-06 22:11:33
451978ApplicationsnaotaUNCONFIRMEDmedia-video/v4l2loopback-0.6.2 - Version bump to support kernel 3.72013-01-14 22:49:56
370703Applicationsmysql-bugsUNCONFIRMEDdev-db/myodbc-5.1.6 - emerge --config fails: odbcinst: SQLWritePrivateProfileString failed with Gene2011-06-10 02:05:40
455280ApplicationsmythtvUNCONFIRMEDmedia-tv/mythtv-0.25.2_p20120716: links upon pulseaudio even with USE=-pulseaudio2013-02-03 13:49:02
442662Ebuildsmysql-bugsUNCONFIRMEDdev-db/mysql-connector-c++ - Output from mysql_config is parsed in in ugly way.2012-11-19 15:55:25
433994Servermysql-bugsUNCONFIRMEDdev-db/mysql-5.1.62-r1 stack smashing detected in mysqld2012-09-05 17:17:06
431000Applicationsmysql-bugsUNCONFIRMEDdev-db/mysql-5.1.62-r1 - make[1]: *** No rule to make target `../mysys/libmysys.la', needed by `fact2012-08-21 17:31:46
385513Developmentmysql-bugsUNCONFIRMEDdev-db/mariadb-5.1.50: failed to compile x86-libs with multilib-overlay enabled2011-10-30 04:20:27
445988LibrarymozillaUNCONFIRMEDdev-libs/jemalloc-3.2.0 does hardcoded AR calls2012-12-19 17:53:39
451504ApplicationsmozillaUNCONFIRMEDwww-client/firefox-18.0/www-client/seamonkey-2.15 failed (install phase) [to emerge]; incorrect pag2013-02-07 15:47:44
454460ApplicationsmozillaUNCONFIRMEDwww-client/firefox-18.0.1: undefined reference to `WebRtcAecm_WindowAndFFTNeon'2013-01-30 20:14:08
403051Applicationsmr_bones_UNCONFIRMEDmedia-gfx/gqview-2.1.5 - ld: pan-calendar.o: undefined reference to symbol 'sqrt@@GLIBC_2.0'2012-02-13 12:03:19
432236ApplicationsmozillaUNCONFIRMEDmail-client/thunderbird-bin - missing media-libs/libpng:1.2 dependency2012-08-21 20:31:46
434130ApplicationsmozillaUNCONFIRMEDdev-libs/nss-3.13.6 - /usr/lib/libnspr4.so: undefined reference to `__fdelt_chk'2012-09-24 16:48:11
422447ApplicationsmozillaUNCONFIRMEDwww-client/firefox 10.0.5 creates /tmp/mozilla-media-cache2012-06-20 12:56:08
418115ApplicationsmozillaUNCONFIRMEDwww-client/firefox-12.0-r2 ignores ccache when both ccache and distcc are enabled2012-07-15 05:38:36
417687ApplicationsmozillaUNCONFIRMEDmail-client/thunderbird www-client/seamonkey segfault at startup if nss_ldap/openldap are installed2012-10-22 16:13:48
416047ApplicationsmozillaUNCONFIRMEDdev-libs/nss-3.13.{3,4} - die "Failed to detect whether your arch is 64bits or 32bits, disable distc2012-05-16 02:51:26
414363ApplicationsmozillaUNCONFIRMEDwww-client/firefox-12.0 / mail-client/thunderbird-12.0.1 german locale not recognized, no german int2012-05-08 15:45:35
409295ApplicationsmozillaUNCONFIRMEDmail-client/thunderbird-bin-10.0.2 - HTTP links cannot be opened - Failed to load native module at p2012-03-23 15:08:47
386077ApplicationsmozillaUNCONFIRMED=mail-client/thunderbird-10.0.1 shows double entries in newly created address book contacts2012-07-06 07:46:22
379499ApplicationsmlUNCONFIRMEDnet-misc/unison-2.27.57-r1 stack smashing detected2011-08-19 00:43:25
443958Server Problemmirror-adminUNCONFIRMEDrsync.nl.gentoo.org / 195.241.77.98 (tiscali) often reports "@ERROR: max connections (15) reached --2012-11-19 21:19:27
444310New Servermirror-adminUNCONFIRMEDNew Full mirror has been configured.2012-11-27 17:40:36
457652Applicationsmedia-videoUNCONFIRMEDmedia-video/mplayer-1.1 - fix building against >=media-libs/giflib-52013-02-18 15:14:07
456110Applicationsmedia-videoUNCONFIRMED[multimedia overlay] mpv-9999 --disable-tv-bsdbt848 and --disable-radio-bsdbt848 does not exist anym2013-02-09 15:41:09
455058Applicationsmedia-videoUNCONFIRMEDmedia-video/gxine with dev-lang/spidermonkey-1.8.8 - build fails to find mozjs2013-02-05 11:27:23
454568Librarymedia-videoUNCONFIRMEDmedia-libs/mlt-0.8.8 - luma.c:92:11: erreur interne du compilateur: dans build2_stat, à tree.c:38032013-02-01 10:14:17
452482Applicationsmedia-videoUNCONFIRMEDmedia-video/libav-0.8.5 ABI=x32 - libavutil/x86/cpu.c:52: Error: invalid instruction suffix for `pus2013-02-03 00:43:50
454376Applicationsmedia-videoUNCONFIRMEDmedia-video/recordmydesktop messes up bitrate2013-01-28 13:09:26
452048Applicationsmedia-videoUNCONFIRMEDmedia-video/vlc-2.0.5 - drop dependency on smbclient use-flag for >=net-fs/samba-4.0.02013-02-18 07:03:10
451888Applicationsmedia-videoUNCONFIRMEDmedia-libs/mlt-0.8.2 - consumer_jack.o: In function `consumer_thread': consumer_jack.c:(.text+0x139e2013-01-15 12:21:47
450526Applicationsmedia-videoUNCONFIRMEDmedia-video/tovid-0.34_p20120123 - Please rebuild dev-python/pypy:1.9 with the following USE flags e2013-01-07 11:52:42
449306Applicationsmedia-videoUNCONFIRMEDmedia-video/gaupol-0.21 version bump request2012-12-30 16:48:12
449372Applicationsmedia-videoUNCONFIRMEDnet-misc/mediatomb - broken Samsung 2012 TV send an invalid request2013-01-24 20:18:11
445962Applicationsmedia-videoUNCONFIRMEDmedia-video/dvdauthor-0.7.1 files contain writable and executable sections2012-12-04 19:02:06
446552Applicationsmedia-videoUNCONFIRMEDnet-misc/mediatomb-0.12.1-r1 - Mediatomb launches the transcoder twice for a given file.2012-12-09 08:28:14
447746Librarymedia-videoUNCONFIRMED[PATCH] media-libs/mlt-0.8.2 builds with -DARCH_X86_64 even though CHOST=i686-pc-linux-gnu and fails2012-12-24 10:27:50
448706Applicationsmedia-videoUNCONFIRMEDmedia-plugins/frei0r-plugins-1.3 - defish0r plugin makes kdenlive rendering fail2013-02-01 10:32:02
449238Applicationsmedia-videoUNCONFIRMEDmedia-video/gpac-0.5.0 should use --extra-cflags in configure instead of overriding OPTFLAGS2012-12-31 15:11:00
445544Applicationsmedia-videoUNCONFIRMEDmedia-video/dvdstyler-2.3.4 - Fails to generate iso, consider to hard-mask this version.2012-12-03 05:50:21
417621Applicationsmedia-videoUNCONFIRMEDmedia-video/guvcview-1.5.3 does not show the Zoom control2012-05-27 15:48:10
418037Applicationsmedia-videoUNCONFIRMEDmedia-video/subtitlecomposer-0.5.3 USE=xine fails due to underlinking: ld: CMakeFiles/subtitlecompos2012-05-29 00:01:02
419955Applicationsmedia-videoUNCONFIRMEDmedia-video/vlc-2.0.1 - src_test(): srtp-test-aes / srtp-test-recv: Libgcrypt warning: missing initi2012-09-19 13:11:08
426248Librarymedia-videoUNCONFIRMEDmedia-libs/libvpx-1.1.0 builds with incorrectly -m64 on x322012-09-25 05:38:06
427004Applicationsmedia-videoUNCONFIRMEDmedia-video/ffmpeg-0.10.3 ABI=x32 - libavfilter/libmpcodecs/vf_ilpack.c:116: Error: operand type mis2012-09-25 03:49:30
428416Librarymedia-videoUNCONFIRMEDmedia-video/dirac-1.0.2 with sys-devel/gcc-4.7 (graphite) - ?2012-07-30 03:55:51
430564Applicationsmedia-videoUNCONFIRMEDmedia-video/devede - when converting mkv, devede passes an obsolete options to mencoder2012-08-09 23:46:58
430960Applicationsmedia-videoUNCONFIRMEDmedia-video/vlc[vaapi] should depend on virtual/ffmpeg[vaapi]2013-01-26 17:56:56
433375Applicationsmedia-videoUNCONFIRMEDmedia-video/cinelerra ignores LDFLAGS, causing multilib compile failure2012-11-20 12:23:36
435102Ebuildsmedia-videoUNCONFIRMEDmedia-video/vlc-9999 - 300_all_pic.patch fails to apply2012-09-18 20:17:27
435354Applicationsmedia-videoUNCONFIRMEDmedia-video/devede-3.22 looks in the wrong place for /usr/share/doc/devede/html/main.html2012-09-18 13:52:57
437258Applicationsmedia-videoUNCONFIRMEDmedia-video/vlc-9999 - Failed Patch: 300_all_pic.patch !2012-10-06 13:33:40
437632Ebuildsmedia-videoUNCONFIRMEDmedia-video/vlc: metadata.xml should be updated2012-10-08 20:15:56
437704Applicationsmedia-videoUNCONFIRMEDmedia-video/gpac-0.4.5-r5: wxOsmo4.o: undefined reference to symbol 'gtk_widget_get_parent_window'2012-10-09 15:40:38
438928Applicationsmedia-videoUNCONFIRMEDmedia-video/vlc should open directories in KDE2012-10-19 14:47:58
442886Applicationsmedia-videoUNCONFIRMEDmedia-video/devede' - elog mentions "lame" for mplayer, but that flag isn't used in mplayer.2012-11-12 18:50:32
413661Librarymedia-videoUNCONFIRMEDmedia-libs/x264-0.0.20111220 on x86 enables SSE even on non-SSE host2012-04-27 15:27:08
411231Applicationsmedia-videoUNCONFIRMEDmedia-plugins/live-2012.01.07 - x86_64-pc-linux-gnu-ld -olibliveMedia.a: x86_64-pc-linux-gnu-ld: -f 2012-04-10 13:19:50
411443Applicationsmedia-videoUNCONFIRMEDmedia-libs/libcaca-0.99_beta18 - java-pkg_newjar java/libjava.jar fails2012-12-30 03:36:17
412457Librarymedia-videoUNCONFIRMEDmedia-video/gpac-0.4.5-r4 - ld: wxOsmo4.o: in function wxCreateApp():wxOsmo4.cpp(.text+0x1c): error:2012-04-18 15:19:39
383513Applicationsmedia-videoUNCONFIRMED>media-video/transcode-1.0.7 can handle only the first audio track when transcoding from media-video2011-12-06 10:16:57
384313Applicationsmedia-videoUNCONFIRMEDmedia-video/vlc vlc-cache-gen Segmentation fault on hardened system2012-09-19 13:08:49
378557Librarymedia-videoUNCONFIRMEDmedia-libs/libvpx-0.9.7: Compile failure with debug USE flag - "No rule to make target libvpx_g.so, 2012-09-15 05:01:43
409327Applicationsmedia-videoUNCONFIRMEDmedia-video/vlc-2.0.1 crashes when playing dvd with menu (and dvd-CSS)2012-09-19 13:10:13
406735Applicationsmedia-videoUNCONFIRMEDmedia-video/vlc-2.0.0 - erratic audio volume behaviour under Gnome32012-09-19 13:09:42
406367GNOMEmedia-videoUNCONFIRMEDmedia-libs/libdvdnav: assertion in set_PTT() triggered (was: media-video/totem-3.2.1: Crashes when p2012-03-01 03:04:44
405813Ebuildsmedia-videoUNCONFIRMEDmedia-libs/libvpx-1.0.0 USE=ssse3 - x86_systemdependent.c:(.text+0x263): undefined reference to `vp82013-01-15 22:37:22
405173Applicationsmedia-videoUNCONFIRMEDmedia-video/vlc-2.0.0 - /bin/sh: line 4: 2215 Segmentation fault ./vlc-cache-gen ../modules2012-09-19 13:09:28
395801Applicationsmedia-videoUNCONFIRMEDmedia-video/libav-0.8_pre20111222 produces white noise with part of some music files2012-03-08 07:44:03
395387Librarymedia-videoUNCONFIRMEDmedia-libs/x264-0.0.20111218 - fatal: ambiguous argument 'origin/master': unknown revision or path n2012-02-04 20:00:18
394241Ebuildsmedia-videoUNCONFIRMEDmedia-libs/xvid - on ppc g3 hardware use flag -altivec is not honored2011-12-10 16:29:03
388849Ebuildsmedia-videoUNCONFIRMEDmedia-video/dirac-1.0.2 fails with gcc-4.5.32011-12-06 17:32:25
385109Applicationsmedia-videoUNCONFIRMEDmedia-video/vlc-1.1.11 segfault error2012-09-19 13:08:57
386947Librarymedia-videoUNCONFIRMEDmedia-libs/libdv-1.0.0-r2 - enc_input.c:1021:26: error: array type has incomplete element type2011-11-12 17:03:32
384947Applicationsmedia-videoUNCONFIRMEDmedia-video/aacskeys-0.4.0c-r1: please update ProcessingDeviceKeysSimple.txt2012-08-23 16:40:14
383295Librarymedia-videoUNCONFIRMEDmedia-libs/libdc1394-2.1.3-r1 fails to link (undefined references to yuy2_to_yv16 and yuy2_to_yv12)2011-10-05 09:12:28
370275Applicationsmedia-videoUNCONFIRMEDmedia-video/libav-0.7_pre20110327 error: selected processor does not support ARM mode2011-10-26 17:48:22
370587Applicationsmedia-videoUNCONFIRMEDmedia-video/vlc-1.1.9: vlc won't play files from ssh folder connected through gnome "Places" menu2012-09-19 13:08:20
367699Ebuildsmedia-videoUNCONFIRMEDmedia-video/winki - winki: [..] ImportError: No module named gnome (missing RDEPEND?)2011-05-17 23:55:09
423687Ebuildsmedia-tvUNCONFIRMEDmedia-tv/linuxtv-dvb-apps - Please enable building of alevt2012-06-27 14:05:27
436708Ebuildsmedia-tvUNCONFIRMEDmedia-tv/xawtv-3.95-r2 - v4lctl: dlopen: /usr/lib64/xawtv/flt-disor.so: undefined symbol: atanf / po2013-02-15 14:53:00
454466Applicationsmedia-tvUNCONFIRMEDapp-misc/lirc-9.0-r2 - irexec init script uses deprecated --chuid2013-01-29 14:50:41
410427Applicationsmedia-tvUNCONFIRMEDmedia-tv/freevo-1.9.0 needs dev-python/gdata for the youtube plugin2012-04-02 02:30:30
413457Applicationsmedia-tvUNCONFIRMEDmedia-tv/dvbstreamer-2.1.0 version bump2012-04-29 13:11:46
413987Ebuildsmedia-tvUNCONFIRMEDmedia-tv/xawtv with --as-needed drops libm link2012-04-29 18:01:29
416021Applicationsmedia-tvUNCONFIRMEDapp-misc/lirc-*: livedrive_midi.c: livedrive_rec_midi fails to see SYSEX_END until logprintf(…) is a2012-12-02 02:09:04
403389Applicationsmedia-tvUNCONFIRMEDmedia-tv/tvtime-1.0.2_p20110131-r3 configure error - configure: error: asound needed2012-07-09 14:32:00
390233Ebuildsmedia-tvUNCONFIRMEDmedia-tv/tvtime : request for patch merge (for wide monitors)2011-11-15 00:33:44
388189Ebuildsmedia-tvUNCONFIRMEDVersion bump: media-tv/freevo-1.9.2b22011-10-23 11:53:46
370287Applicationsmedia-tvUNCONFIRMEDapp-misc/lirc-0.9.0 fails to emerge, because 'struct i2c_adapter’ has no member named ‘id’2012-07-17 20:40:06
369987Ebuildsmedia-tvUNCONFIRMEDapp-misc/lirc-0.9.0 emerge error econf failed2012-07-17 20:43:17
369431Unspecifiedmedia-tvUNCONFIRMEDmedia-tv/linuxtv-dvb-firmware-2009.09.19 - !!! Couldn't download 'TT_PCI_2.19h_28_11_2006.zip'. Abor2012-02-22 05:20:10
430690EbuildsmattmUNCONFIRMEDnet-libs/wt-3.2.2 - Aborting due to QA concerns: 4 files installed in /tmp/portage/net-libs/wt-3.2.22012-09-17 06:33:36
433708ApplicationsmattmUNCONFIRMEDnet-analyzer/zabbix-2.0.2-r1: Makefiles are erroneously installed in /usr/share/zabbix2012-09-03 17:12:18
413681ServermattmUNCONFIRMEDnet-misc/hylafaxplus - connection refused from another machine2012-05-01 22:55:07
453966ApplicationsmatsuuUNCONFIRMEDwww-apps/redmine-2.2.0 should depend on dev-ruby/fastercsv2013-01-30 10:10:19
374943ApplicationsmattmUNCONFIRMEDmedia-gfx/cutycapt-0_p20110502-r2 unable to ignore invalid ssl certificate2012-04-16 01:32:13
413779ApplicationsmatsuuUNCONFIRMEDwww-apps/redmine-1.4.1 without dev-ruby/ruby-net-ldap - ?2012-10-06 16:51:25
444936ApplicationsmatsuuUNCONFIRMEDwww-apps/redmine creates keepdir /var/run/redmine2012-12-10 13:49:46
458152Ebuildsmaintainer-wantedUNCONFIRMEDdev-db/odb-2.2.0 - C++ Object-Relational Mapping (ORM) implemented as a gcc plugin2013-02-19 22:42:42
455198Ebuildsmaintainer-wantedUNCONFIRMEDNew ebuild: media-gfx/ACBFViewer-0.95 - Advanced Comic Book Format Viewer2013-02-03 01:06:39
453658Ebuildsmaintainer-wantedUNCONFIRMEDdev-util/jenkins - application that monitors executions of repeated jobs, such as building a softwar2013-01-30 11:30:11
454346Ebuildsmaintainer-wantedUNCONFIRMEDEbuild request: app-misc/elasticsearch - Open Source, Distributed, RESTful, Search Engine2013-01-28 18:47:24
450684Applicationsmaintainer-wantedUNCONFIRMEDmedia-gfx/xdot - Interactive viewer for Graphviz dot files2013-01-07 11:59:08
450440Core systemmaintainer-wantedUNCONFIRMEDnet-fs/xtreemfs - XtreemFS is a fault-tolerant distributed file system for all storage needs2013-01-07 02:42:31
450300Ebuildsmaintainer-wantedUNCONFIRMEDx11-misc/menulibre - An advanced menu editor that provides modern features in a clean, easy-to-use i2013-01-27 17:35:31
449996Ebuildsmaintainer-wantedUNCONFIRMEDmedia-tv/xbmc-pvr-addons ebuild for XBMC Frodo pvr addons2013-02-20 22:05:02
449794Ebuildsmaintainer-wantedUNCONFIRMEDapp-emulation/tilem-2.0 - an emulator and debugger for Texas Instruments Z80-based graphing calculat2013-01-03 00:16:42
449652Ebuildsmaintainer-wantedUNCONFIRMEDmedia-video/enzyme-0.2.ebuild - Video metadata parser2013-01-22 02:24:26
449654Ebuildsmaintainer-wantedUNCONFIRMEDmedia-video/subliminal-0.6.2.ebuild - Subtitles, faster than your thoughts2013-01-22 02:24:52
449034Ebuildsmaintainer-wantedUNCONFIRMEDNew package: app-backup/insync-bin-0.9.32 - Advanced cross-platform Google Drive client2012-12-28 14:36:13
448168Applicationsmaintainer-wantedUNCONFIRMEDdev-perl/pDLNA - a UPnP and DLNA service which serves multimedia content to compatible clients on th2012-12-24 15:40:36
447194Ebuildsmaintainer-wantedUNCONFIRMEDapp-misc/wiimotedev-1.4.0 - Wii Remote utilities2012-12-15 08:58:36
446974Ebuildsmaintainer-wantedUNCONFIRMEDdev-libs/libpreludedb, app-admin/prelude-manager, net-analyzer/prewikka resurrection request2012-12-27 21:31:08
446028Ebuildsmaintainer-wantedUNCONFIRMEDdev-python/python-backports-1.0.1 - Backported python features2012-12-06 08:27:46
446192Ebuildsmaintainer-wantedUNCONFIRMEDdev-python/python-eventlib-0.1.1 - Coroutine-based networking library2012-12-06 08:27:46
446024Ebuildsmaintainer-wantedUNCONFIRMEDdev-python/python-sipsimple-0.31.1 - SDK for easy development of SIP multimedia end-points2012-12-16 23:53:59
445106Eclasses and Profilesmaintainer-wantedUNCONFIRMEDxmlcatalog.eclass needed for managing xml catalogs in packages2012-11-29 19:33:23
445280Ebuildsmaintainer-wantedUNCONFIRMEDmedia-libs/avbin-bin - New package. - AVbin is a binary release of a cross-platform, thin wrapper ar2012-12-09 09:27:38
445548Ebuildsmaintainer-wantedUNCONFIRMEDnet-analyzer/tespeed - New package. - Terminal network speed test that uses servers from Speedtest.n2012-12-04 09:31:07
445614Ebuildsmaintainer-wantedUNCONFIRMEDapp-editors/retext - New package. - Qt-based text-editor for Markdown written in Python2013-01-02 12:40:40
445724Ebuildsmaintainer-wantedUNCONFIRMEDnet-p2p/armory - New package. - Full-featured Bitcoin client, offering a dozen innovative features..2012-12-04 14:45:46
442916Ebuildsmaintainer-wantedUNCONFIRMEDmedia-sound/ladish - Successor of media-sound/lash.2012-11-13 12:29:05
442920Ebuildsmaintainer-wantedUNCONFIRMEDmedia-sound/laditools - Control and monitor a LADI system the easy way.2012-11-13 12:30:44
443456Ebuildsmaintainer-wantedUNCONFIRMEDNew ebuild: media-sound/oom an OpenOctave MIDI & audio sequencer2012-11-15 21:08:06
443512Ebuildsmaintainer-wantedUNCONFIRMEDsci-physics/fullprof - a set of crystallographic programs (FullProf, WinPLOTR, EdPCR, GFourier, etc.2012-11-19 15:34:40
443714Ebuildsmaintainer-wantedUNCONFIRMEDdev-java/jllvm-3.1.2 - bindings for LLVM, providing an object-oriented interface as similar as possi2012-11-19 09:24:34
444946Ebuildsmaintainer-wantedUNCONFIRMEDdev-python/txscheduling-1.1 - A scheduling plugin for Twisted2013-02-17 16:25:45
442342Ebuildsmaintainer-wantedUNCONFIRMEDdev-perl/Data-Diver - Simple, ad-hoc access to elements of deeply nested structures2012-12-27 11:11:38
439754Ebuildsmaintainer-wantedUNCONFIRMEDsys-apps/inxi - A full featured system information script2012-11-19 17:19:20
441610Ebuildsmaintainer-wantedUNCONFIRMEDsys-block/flashbench - Identifies the properties of SD cards and other media2012-11-04 18:48:03
439462Ebuildsmaintainer-wantedUNCONFIRMEDnet-nntp/spotweb - a webbased usenet binary resource indexer based on the protocol and development d2013-01-23 03:27:27
439700Ebuildsmaintainer-wantedUNCONFIRMEDapp-vim/evervim - a vim plugin for editing Evernote note's directly from vim2012-10-26 16:19:43
438468Ebuildsmaintainer-wantedUNCONFIRMEDsci-electronics/eds - Electric design tool2013-01-16 08:45:05
438470Ebuildsmaintainer-wantedUNCONFIRMEDsci-electronics/eds-libs - Set of libraries for EDS2013-01-15 12:48:14
439396Ebuildsmaintainer-wantedUNCONFIRMEDmedia-sound/postfish - The Postfish is a digital audio post-processing, restoration, filtering and m2012-10-26 06:43:41
439408Ebuildsmaintainer-wantedUNCONFIRMEDdev-db/rockmongo-1.1.5 - Web-based administration for Mongo database in PHP2013-02-07 14:35:09
437106Ebuildsmaintainer-wantedUNCONFIRMEDapp-misc/stiki - a tool for reverting vandalism on Wikipedia2012-10-04 06:58:58
437634Ebuildsmaintainer-wantedUNCONFIRMEDnet-dialup/qst - QT-based serial terminal program2012-10-09 06:34:10
436976Applicationsmaintainer-wantedUNCONFIRMEDnet-mail/geary - A lightweight email program designed around conversations and built for the GNOME d2012-10-08 16:10:46
436076Librarymaintainer-wantedUNCONFIRMEDmedia-plugins/ladspa-trigger: Audio trigger LADSPA plugin2012-09-24 11:22:18
435660Ebuildsmaintainer-wantedUNCONFIRMEDx11-themes/beefy-miracle-background - Fedora's official background artwork2012-09-20 15:36:51
435712Ebuildsmaintainer-wantedUNCONFIRMEDnet-nntp/es-f-2.6.0 - web based HTML frontend for esniper, a lightweight console application for sni2013-01-23 03:27:50
435146Ebuildsmaintainer-wantedUNCONFIRMEDsci-electronics/bitscope-chart - a frequency and voltage logger designed for use with the BitScope P2012-09-16 15:52:10
435150Ebuildsmaintainer-wantedUNCONFIRMEDsci-electronics/bitscope-meter - a frequency and voltage meter designed for use with the BitScope PC2012-09-16 15:53:47
435148Ebuildsmaintainer-wantedUNCONFIRMEDsci-electronics/bitscope-logic - a logic analyzer designed for use with the BitScope PC oscilloscope2012-09-16 15:53:01
435144Ebuildsmaintainer-wantedUNCONFIRMEDsci-electronics/bitscope-dso - a suite of high performance mixed signal virtual test, measurement an2012-09-16 16:13:50
435024Ebuildsmaintainer-wantedUNCONFIRMEDsys-fs/diskdevcmds-540.1 - HFS and HFS+ utils ported from OSX, supplies mkfs and fsck2012-09-14 14:23:28
435056Ebuildsmaintainer-wantedUNCONFIRMEDdev-embedded/gnoduino - GTK UI for arduino IDE2012-09-16 15:48:55
434828Ebuildsmaintainer-wantedUNCONFIRMEDapp-editors/gedit-collaboration-9999 - GNOME Text Editor Collaboration Plugin2012-09-18 23:55:14
434592Ebuildsmaintainer-wantedUNCONFIRMEDnet-misc/bubbleupnpserver - extends your existing UPnP AV Media Servers and Media Renderers on your 2012-09-11 14:16:40
434124Ebuildsmaintainer-wantedUNCONFIRMEDdev-perl/Cache-FastMmap - Uses an mmap'd file to act as a shared memory interprocess cache2012-09-06 14:41:46
433864Ebuildsmaintainer-wantedUNCONFIRMEDapp-misc/format-junkie - a program that can convert your media files (audio files, videos and pictur2012-09-10 17:00:15
433786Ebuildsmaintainer-wantedUNCONFIRMEDmedia-fonts/opengostfont-0.3 - Open-source version of the fonts by Russian standard GOST 2.304-812012-09-04 09:14:50
432712Ebuildsmaintainer-wantedUNCONFIRMEDsci-geosciences/gpx2svg – Convert GPX formatted geodata to Scalable Vector Graphics (SVG)2012-08-26 20:33:26
432292Ebuildsmaintainer-wantedUNCONFIRMEDmedia-gfx/iscan-plugin-(???) for Epson Perfection V2002013-02-19 10:47:20
431804Ebuildsmaintainer-wantedUNCONFIRMEDapp-text/pelican-3.0 - A tool to generate a static blog, with restructured text (or markdown) input 2012-08-18 15:39:10
431842Ebuildsmaintainer-wantedUNCONFIRMEDmedia-sound/lyvi - A simple command-line lyrics viewer for various audio players2012-08-18 16:10:35
431872Ebuildsmaintainer-wantedUNCONFIRMEDx11-terms/kmscon - Linux KMS/DRM based virtual Console Emulator2012-12-13 01:07:28
430642Ebuildsmaintainer-wantedUNCONFIRMEDssdeep-2.9 - computes context triggered piecewise hashes (fuzzy hashes)2012-08-09 23:59:51
428246Ebuildsmaintainer-wantedUNCONFIRMEDapp-backup/jungledisk-server - offsite managed backup for servers2012-07-28 23:06:49
427762Ebuildsmaintainer-wantedUNCONFIRMEDNew: dev-python/django-grappelli-2.4.0 - A grid-based alternative/extension to the Django administra2012-07-24 14:52:05
427334Ebuildsmaintainer-wantedUNCONFIRMEDmail-client/mutt-kz - a fork of mutt with added support for net-mail/notmuch2012-08-03 06:29:47
427728Ebuildsmaintainer-wantedUNCONFIRMEDNew: dev-python/django-classy-tags-0.3.4.1 - Class based template tags for Django2012-12-12 11:41:28
427730Ebuildsmaintainer-wantedUNCONFIRMEDNew: dev-python/django-mptt-0.4.2 - Utilities for implementing a modified pre-order traversal tree i2012-12-12 11:46:23
426518Ebuildsmaintainer-wantedUNCONFIRMEDmedia-tv/oscam ebuild request2013-02-04 11:05:51
425132Ebuildsmaintainer-wantedUNCONFIRMEDdev-db/riak - "the most powerful open-source, distributed database you'll ever put into production."2012-07-08 14:09:00
424834Ebuildsmaintainer-wantedUNCONFIRMEDmedia-tv?/sick-beard - TV shows PVR & episode guide2012-12-13 07:37:13
424832Ebuildsmaintainer-wantedUNCONFIRMEDmedia-sound?/headphones - Automatic music downloader for SABnzbd2013-01-23 03:28:15
424818Ebuildsmaintainer-wantedUNCONFIRMEDnet-nntp/moviegrabber - a fully automated way of downloading movies from usenet2012-11-29 03:18:46
424191Gamesmaintainer-wantedUNCONFIRMEDgames-strategy/vcmi-data-0.89 - Data files for the turn based strategy game HOMM3 clone VCMI2013-01-28 21:27:50
421007Ebuildsmaintainer-wantedUNCONFIRMEDnet-misc/xupnpd - Light DLNA Media Server2012-06-13 19:03:02
418353Ebuildsmaintainer-wantedUNCONFIRMEDdev-php/pecl-dbase - DBASE support removed from PHP 5.32012-05-31 14:59:48
419599Ebuildsmaintainer-wantedUNCONFIRMEDdev-libs/folly - Newly open-sourced C++ library from Facebook Engineering2012-06-04 10:42:01
419847Ebuildsmaintainer-wantedUNCONFIRMEDmedia-plugins/gst-editing-services - a high-level library for facilitating the creation of audio/vi2012-07-08 08:53:36
417681Ebuildsmaintainer-wantedUNCONFIRMEDmedia-plugins/gimp-apng-0.1.0 - provides Animated PNG (APNG) image file load and save modules for th2012-07-06 20:09:12
418285Ebuildsmaintainer-wantedUNCONFIRMEDmedia-libs/dcmtk - DCMTK - a collection of libraries and applications implementing large parts the D2012-05-30 18:44:00
417295Ebuildsmaintainer-wantedUNCONFIRMEDmedia-video/sview-12.05 - a universal stereoscopic player which supports image viewing and movie pla2012-10-14 10:12:17
415443Ebuildsmaintainer-wantedUNCONFIRMEDnet-fs/junglediskworkgroup-3.16 - Networked storage/backup using Amazon's S3 service2012-07-28 23:06:49
414699Ebuildsmaintainer-wantedUNCONFIRMEDnet-misc/mysecureshell-1.25 - an openssh based SFTP server2012-05-05 16:42:27
413389Ebuildsmaintainer-wantedUNCONFIRMEDmedia-fonts/prosto-1 - New font for project of free fonts www.jovanny.ru / / Font has multilanguage 2012-04-24 19:51:59
412493Ebuildsmaintainer-wantedUNCONFIRMEDmedia-tv/mumudvb - (Multi Multicast DVB) is a program for streaming TV over a network originally bas2012-04-18 17:40:58
412549Applicationsmaintainer-wantedUNCONFIRMEDapp-editors/vim-qt - An experimental Qt gui for Vim2012-06-01 05:52:22
412041Ebuildsmaintainer-wantedUNCONFIRMEDmedia-sound/mudita24-1.0.3 - an application controlling the digital mixer, channel gains and other h2012-04-16 10:43:36
410383Ebuildsmaintainer-wantedUNCONFIRMEDdev-cpp/cppcms - a Free C++ Web Development Framework aimed for Rapid Web Application Development2013-01-14 21:48:56
411087Core systemmaintainer-wantedUNCONFIRMEDsys-fs/ddumbfs-1.0.11 - An inline data deduplicating filesystem designed with backup in mind2012-04-07 14:35:41
411619Ebuildsmaintainer-wantedUNCONFIRMEDmedia-sound/rockbox-utility - Graphical utility for automating Rockbox firmware installation and man2012-11-07 20:02:26
409759Ebuildsmaintainer-wantedUNCONFIRMEDx11-themes/gtk-engines-clearlooks-compact-1.5 - Theme for Clearlooks GTK+ engine, optimized for smal2012-07-12 11:32:18
409861Ebuildsmaintainer-wantedUNCONFIRMEDx11-themes/humanity-icon-theme-0.5.3.11 - Nice and well polished icon themes for the GNOME desktop2012-03-27 17:13:16
408207Ebuildsmaintainer-wantedUNCONFIRMEDmedia-fonts/gohufont-2.0 - a bitmap font for programming and terminal use2012-11-01 14:25:15
408349Applicationsmaintainer-wantedUNCONFIRMEDEbuild request: sys-block/xnbd, another much more advanced NBD server2012-03-15 15:11:46
408405Ebuildsmaintainer-wantedUNCONFIRMEDmedia-sound/nuvola_player - Nuvola Player - Cloud music integration for your Linux desktop2013-01-15 14:41:55
409077Ebuildsmaintainer-wantedUNCONFIRMEDwww-apps/gerrit - web based code review and project management for Git based projects2012-03-21 15:35:16
409461Ebuildsmaintainer-wantedUNCONFIRMEDmedia-gfx/panotour and media-gfx/panotour-pro - Commercial GUI front-end to krpano from Kolor2012-03-23 16:32:57
407199Ebuildsmaintainer-wantedUNCONFIRMEDmedia-video/smtube: smplayer youtube helper2012-10-01 16:18:41
406935Ebuildsmaintainer-wantedUNCONFIRMEDmedia-libs/silly-0.1.0 - Silly image codec (Simple Image Loading LibrarY)2012-03-05 20:40:08
406895Ebuildsmaintainer-wantedUNCONFIRMEDmedia-gfx/psdparse-9999 - tools to parse Photoshop PSD/PSB format files2012-03-06 14:26:15
406865Ebuildsmaintainer-wantedUNCONFIRMEDwww-servers/distcache - Distributed session caching2012-03-05 20:17:46
405847Ebuildsmaintainer-wantedUNCONFIRMEDmail-client/ner-9999 - Notmuch based email client (currently read-only)2012-02-27 01:05:27
405461Ebuildsmaintainer-wantedUNCONFIRMEDapp-editors/sublime-text - a sophisticated text editor for code, html and prose2012-11-18 12:37:09
405093Applicationsmaintainer-wantedUNCONFIRMEDmedia-gfx/macrofusion - GUI for Enfuse2012-10-24 12:33:35
404439Ebuildsmaintainer-wantedUNCONFIRMEDapp-backup/rear - Fully automated disaster Recovery for GNU/Linux2013-01-18 12:20:52
403913Gamesmaintainer-wantedUNCONFIRMEDgames-emulation/fs-uae - a multi-platform Amiga emulator based on WinUAE/E-UAE/PUAE, with a focus on2012-02-15 17:27:10
402101Applicationsmaintainer-wantedUNCONFIRMEDmedia-video/mplayer-vaapi live ebuild request2012-11-12 21:03:16
402627Ebuildsmaintainer-wantedUNCONFIRMEDnet-mail/iredmail ebuild request2012-02-08 06:54:28
402767Ebuildsmaintainer-wantedUNCONFIRMEDagner - a rebar-friendly Erlang package index and package manager inspired by Clojars and Homebrew2012-03-09 08:30:12
403579Ebuildsmaintainer-wantedUNCONFIRMEDdev-tex/latexdraw - a graphical drawing editor for LaTeX2012-04-29 18:30:43
401921Ebuildsmaintainer-wantedUNCONFIRMEDsci-libs/o2scl - An object-oriented library for scientific computing in C++2012-02-04 17:07:01
402067Ebuildsmaintainer-wantedUNCONFIRMEDdev-utils/statifier - creates one file from dynamically linked executables and all its libraries2012-04-09 15:46:20
399869Ebuildsmaintainer-wantedUNCONFIRMEDmedia-gfx/brscan4 media-gfx/brother-skan-key-tool - Brothers brscan4 scanner driver2012-01-25 13:40:02
399199Ebuildsmaintainer-wantedUNCONFIRMEDmedia-sound/acoustid-fingerprinter - GUI application for submitting audio fingerprints to Acoustid2012-01-17 21:28:50
398487Ebuildsmaintainer-wantedUNCONFIRMEDmedia-sound/coquillo-1.9 - a metadata editor / tagger for various audio file formats2012-01-11 17:10:51
398491Ebuildsmaintainer-wantedUNCONFIRMEDmedia-sound/qloud-0.30 - Tool to measure loudspeaker frequency and step response, distortions' SPL a2012-01-11 17:10:33
398483Applicationsmaintainer-wantedUNCONFIRMEDmedia-sound/yarock-0.0.54 - a Qt sound player2012-08-09 23:41:54
398485Ebuildsmaintainer-wantedUNCONFIRMEDmedia-sound/eko-0.6.0.ebuild simple sound editor2012-01-11 17:11:12
398137Ebuildsmaintainer-wantedUNCONFIRMEDitap rdp client - a closed source rdp client that supports (among other things) TS-Gateway servers2012-01-10 15:05:30
396131Ebuildsmaintainer-wantedUNCONFIRMEDEbuild Request: sys-apps/tuned2011-12-26 22:41:41
395307Ebuildsmaintainer-wantedUNCONFIRMEDmedia-libs/munt-mt32emu / media-sound/munt-mt32emu-alsadrv - Library and ALSA MIDI driver for emulat2011-12-19 21:20:57
392191Ebuildsmaintainer-wantedUNCONFIRMEDmedia-libs/unicap ( New package )2011-11-27 12:57:04
390415Ebuildsmaintainer-wantedUNCONFIRMEDmedia-gfx/iscan-plugin-perfection-gt-s630-0.1.1 for Epson Perfection V300 PHOTO2013-02-19 10:50:34
390391Ebuildsmaintainer-wantedUNCONFIRMEDx11-misc/pdf_presenter_console - a GTK based presentation viewer application2012-08-12 14:09:53
389489Ebuildsmaintainer-wantedUNCONFIRMEDmedia-video/smoviecat - Simple Movie Catalog2011-11-05 15:49:59
389673Ebuildsmaintainer-wantedUNCONFIRMEDmedia-sound/gsharkdown: Download and play audio files from the grooveshark.com service2011-11-08 20:53:53
389129Gamesmaintainer-wantedUNCONFIRMEDgames-action/voxatron - game set in a world completely made of tiny cubes that can be blasted to smi2012-06-03 22:42:56
389029Ebuildsmaintainer-wantedUNCONFIRMEDsys-libs/libuser - implements a standardized interface for manipulating and administering user and g2011-11-01 15:42:13
389027Ebuildsmaintainer-wantedUNCONFIRMEDnet-misc/qpid-cpp - cross-platform Enterprise Messaging system which implements the Advanced Message2012-08-31 06:30:43
389015Ebuildsmaintainer-wantedUNCONFIRMEDdev-libs/libpki - Provide an easy-to-use PKI library and tools for PKI enabled application developme2011-11-01 15:33:59
387345Ebuildsmaintainer-wantedUNCONFIRMEDnet-misc/gateone - an HTML5 web-based terminal emulator and SSH client.2011-10-18 18:27:36
386909Applicationsmaintainer-wantedUNCONFIRMEDmedia-libs/libshairport: new package (used by xbmc + --enable-airtunes)2013-02-21 14:38:48
385483Ebuildsmaintainer-wantedUNCONFIRMEDnew ebuild: app-editors/x22012-05-04 15:36:31
384425Ebuildsmaintainer-wantedUNCONFIRMEDqxmlrpc : New package ( ebuild included )2011-09-25 14:44:20
383369Ebuildsmaintainer-wantedUNCONFIRMEDNew ebuild (media-sound/groovewalrus)2011-09-17 16:21:47
383279Ebuildsmaintainer-wantedUNCONFIRMEDmedia-fonts/openfontlibrary-20110916: new ebuild for fonts from OpenFontLibrary2011-09-16 22:47:58
383097Ebuildsmaintainer-wantedUNCONFIRMEDsys-kernel/libre-sources with Freedo logo new request2011-09-16 14:42:35
382935Ebuildsmaintainer-wantedUNCONFIRMEDumap ebuild wanted2011-09-16 03:53:31
382339Ebuildsmaintainer-wantedUNCONFIRMED[ebuild request] app-office/dunnart - constraint-based diagram editor2011-09-09 07:53:17
382099Ebuildsmaintainer-wantedUNCONFIRMEDmedia-gfx/mitsuba - An extensible rendering framework written in portable C++ (ebuild request)2011-09-07 04:01:42
381669Ebuildsmaintainer-wantedUNCONFIRMEDPlease provide an ebuild for media-gfx/g3dviewer2011-09-03 10:37:29
381671Ebuildsmaintainer-wantedUNCONFIRMEDPlease provide media-gfx/s3d ebuild2011-09-03 10:30:33
381647Ebuildsmaintainer-wantedUNCONFIRMEDapp-vim/vst - Vim reStructured Text support2011-09-06 02:47:15
380313Ebuildsmaintainer-wantedUNCONFIRMEDmedia-gfx/ttfautohint (new ebuild)2011-09-09 18:31:28
380943Ebuildsmaintainer-wantedUNCONFIRMEDsys-apps/udev-discover: Sysfs browsing tool focused on helping udev users and developers (new packag2011-08-28 18:11:10
379701Ebuildsmaintainer-wantedUNCONFIRMEDfeedgenerator-1.2.1.ebuild(New Package)2011-09-16 05:46:30
377747Ebuildsmaintainer-wantedUNCONFIRMEDmedia-gfx/sK1 is an open-source illustration program2011-08-05 21:49:02
374789Ebuildsmaintainer-wantedUNCONFIRMEDebuild request: chiliproject - a community fork of redmine2013-02-13 20:47:13
374377Ebuildsmaintainer-wantedUNCONFIRMED[ebuild request] www-clients/qtweb ebuild - lightweight, html5 compliant qt-based web-browser2011-07-10 17:26:58
371773Ebuildsmaintainer-wantedUNCONFIRMEDmedia-sound/umurmur-0.2.8 - Minimalistic Murmur (Mumble server)2012-12-25 19:00:18
372729Ebuildsmaintainer-wantedUNCONFIRMEDNew ebuild for gedit-source-code-browser2011-07-24 10:48:48
373217Applicationsmaintainer-wantedUNCONFIRMEDmedia-sound/audacious-mplayer plugin: new package2012-02-03 02:38:51
371165GNOMEmaintainer-wantedUNCONFIRMED[gnome overlay] Ebuild for gnome-shell-extensions-mediasplayers2011-12-17 15:02:38
370785Ebuildsmaintainer-wantedUNCONFIRMEDsteadyflow-0.1.7 - a GTK+ based download manager that aims for minimalism, ease of use, and a clean,2013-02-06 11:25:50
369855Ebuildsmaintainer-wantedUNCONFIRMED[media-video(?)/]freeseer - a video capture utility capable of capturing and streaming video2012-03-16 04:22:13
367429Ebuildsmaintainer-wantedUNCONFIRMEDmedia-sound/jackctlmmc-4 - JackCtlMMC is a slightly simpler command-line version of QJackMMC2011-05-17 11:44:37
366259Ebuildsmaintainer-wantedUNCONFIRMEDx11-themes/gtk-engines-equinox - Equinox GTK+2 Engine based on Aurora2012-08-16 21:03:11
366649Applicationsmaintainer-wantedUNCONFIRMEDCQRLOG - an advanced ham radio logger based on [the] Firebird database2011-05-12 21:53:26
367427Ebuildsmaintainer-wantedUNCONFIRMEDmedia-sound/qjackmmc-4 - a Qt based program that can connect to a device or program that emits MIDI 2011-05-18 11:04:44
367027Ebuildsmaintainer-wantedUNCONFIRMEDnet-analyzer/amun - Low-interaction honeypot, capture autonomous spreading malware in an automated f2012-03-08 02:09:36
365245Ebuildsmaintainer-wantedUNCONFIRMEDEbuild request app-dicts/stardict-freedict-fra-eng2012-01-22 22:08:04
457830Applicationsmaintainer-neededUNCONFIRMEDmedia-gfx/freecad-0.13 - Version bump.2013-02-17 09:29:20
457876Applicationsmaintainer-neededUNCONFIRMEDmedia-gfx/argyllcms - drop toolchain-funcs and virtual/pkgconfig2013-02-17 17:50:06
455414Librarymaintainer-neededUNCONFIRMEDdev-libs/libmix-2.05-r6 with clang-3.2 - aes/saferp.c:22:8: error: redefinition of 'expf' as differe2013-02-05 12:13:40
450156Applicationsmaintainer-neededUNCONFIRMEDmedia-gfx/splashutils-1.5.4.4-r2 unable to switch from silent mode to verbose using F2 with the 2nd 2013-01-20 10:25:23
443856Applicationsmaintainer-neededUNCONFIRMEDmedia-gfx/splashutils-1.5.4.4-r2 failed to build - asm/posix_types.h: No such file or directory2013-01-27 08:05:31
446424Applicationsmaintainer-neededUNCONFIRMEDapp-misc/gpsdrive-2.11-r3[mapnik] - In file included from ..., .../gpsdrive-2.11/src/mapnik.cpp:11: 2013-01-03 18:33:04
440544Applicationsmaintainer-neededUNCONFIRMEDmedia-gfx/splashutils-1.5.4.4-r1: some elog messages should only be shown when upgrading from an old2013-01-20 10:24:06
417439Core systemmaintainer-neededUNCONFIRMEDmedia-gfx/splashutils should move cachedir /lib/splash/cache to /run2013-01-20 10:21:52
415073Applicationsmaintainer-neededUNCONFIRMEDmedia-gfx/freecad-0.12.5284-r2 fails multilib-strict2012-08-24 18:17:55
414273Ebuildsmaintainer-neededUNCONFIRMEDmedia-gfx/picasa USE=nsplugin - alternatively depend on www-client/firefox / www-client/firefox-bin2013-02-10 08:42:58
412753Applicationsmaintainer-neededUNCONFIRMEDmedia-gfx/xfig-3.2.5b-r2 segfaults in Edit menu2013-02-16 13:34:57
406255Sandboxmaintainer-neededUNCONFIRMEDdev-libs/apr-1.4.6 failed test: testlfs : \/bin/bash: line 2: 3428 Segmentation fault (core d2012-12-29 17:08:08
400623Ebuildsmaintainer-neededUNCONFIRMEDapp-text/ots-0.5.0: shared libraries don't have .so extension2012-03-04 10:37:54
400905Applicationsmaintainer-neededUNCONFIRMEDnet-libs/udns please add filter-flags -fpeel-loops used with -03 or -0s2013-02-16 13:22:28
402681Applicationsmaintainer-neededUNCONFIRMEDapp-editors/cooledit-3.17.17-r1 doesn't honor LINGUAS for locale files2012-02-23 21:38:44
385775Applicationsmaintainer-neededUNCONFIRMEDdev-libs/apr-util-1.3.11 cross compilation fix (libtool related)2013-01-01 20:20:51
379951Ebuildsmaintainer-neededUNCONFIRMEDx11-terms/mrxvt squared tabs build flag not available2012-12-31 14:36:04
375825Applicationsmaintainer-neededUNCONFIRMEDapp-admin/ulogd-2.0.0_beta4 fails to build with +doc USE flag if latex is not installed2012-09-16 09:14:45
378125Unspecifiedmaintainer-neededUNCONFIRMEDmedia-gfx/bootsplash-themes - Suggestion: per-resolution USE flags etc.2013-01-20 10:18:16
375777Applicationsmaintainer-neededUNCONFIRMEDapp-admin/ulogd-2.0.0_beta4 should warn about needed config changes2012-12-04 17:37:14
375089Ebuildsmaintainer-neededUNCONFIRMED=x11-wm/stumpwm-9999 bump request (ebuild included)2011-07-28 23:45:14
456784ApplicationslxnayUNCONFIRMED[sabayon overlay] net-wireless/blueman-1.23-r2: Failed Patch: blueman-1.21-fix-segfault-startup.patc2013-02-12 15:10:18
445484SELinuxlxnayUNCONFIRMEDnet-nds/389-ds-base-1.2.11.15 fails to build in hardened selinux profile2012-12-04 19:58:35
452874Applicationslu_zeroUNCONFIRMEDmedia-video/mplayer-1.1 - mplayer-1.1-libav-9.patch introducing enum AVPixelFormat, should be called2013-02-18 15:15:08
417239ApplicationslxdeUNCONFIRMEDIf LXDE session is running the kbd input on tty1 is broken (need to press keys twice)2012-06-14 13:17:06
451326Corelu_zeroUNCONFIRMEDapp-emulation/qemu-user-1.1.0-r1: "qemu: Unsupported syscall: 373" for epoll syscall inside arm chro2013-01-20 17:32:15
448152Applicationslu_zeroUNCONFIRMEDapp-emulation/qemu-user-1.0 should depend on sys-apps/usbredir[static-libs]2012-12-24 16:15:07
448206Core systemlu_zeroUNCONFIRMEDflag-o-matic.eclass: `CHOST=${CTARGET} strip-unsupported-flags` doesn't strip flags2013-01-07 17:18:12
447626Applicationslu_zeroUNCONFIRMEDmedia-gfx/blender should not use environment variables to set installation directories2013-01-31 09:26:50
433127Applicationslu_zeroUNCONFIRMEDmedia-video/lives-1.6.3 version bump2012-11-14 19:05:41
395109Unspecifiedlu_zeroUNCONFIRMEDmedia-video/lives-1.4.6 "Capture External Window" fails to render video; errors in console2011-12-19 12:16:42
433633ApplicationslordvanUNCONFIRMED[lordvan-overlay] media-video/openshot-1.4.1 blocks 'emerge -uvND world'2013-02-08 08:35:09
455890Core systemlivecdUNCONFIRMEDsys-block/parted - parted binary should be installed in /usr/bin2013-02-07 02:12:12
416903ApplicationslivecdUNCONFIRMEDsys-block/parted-3.1 fails tests [t8001-loop-blkpg.sh t2100-zerolen.sh]2012-05-21 14:59:50
415413ApplicationslivecdUNCONFIRMED2013-01-20 10:21:21
441880ApplicationslehoUNCONFIRMEDmedia-tv/tvheadend-3.2 should not force --disable-dvbscan and should not install data in /usr/share/2012-11-30 01:57:07
442418ApplicationslehoUNCONFIRMEDmedia-tv/tvheadend-3.2.18 version bump2013-02-15 12:16:40
441888ApplicationslehoUNCONFIRMEDmedia-tv/tvheadend-3.2 usage of xmltv is mysterious2012-11-05 17:16:09
442324Ebuildslang-miscUNCONFIRMEDdev-lang/fpc ebuilds are largely outdated2012-11-08 09:14:16
399899Developmentlang-miscUNCONFIRMEDdev-lang/fpc-2.6.0 USE=ide - fpcalc.pas(244,3) Fatal: Selected assembler reader not supported2012-02-15 16:20:16
454868ApplicationslackUNCONFIRMEDx11-wm/fluxbox-? with updated media-libs/glew-1.9.0 - `fbrun` yields error while loading shared libr2013-02-04 17:23:15
449340ApplicationslackUNCONFIRMEDwww-client/firefox-17.0.1 crashed while watching movie online2013-01-02 22:09:55
415667ApplicationslackUNCONFIRMEDx11-misc/fbpager - HOMEPAGE has been changed2012-05-13 15:42:57
417701Ebuildsl33tmmxUNCONFIRMEDmedia-sound/a2jmidid-7 version bump2012-12-18 11:47:01
446700Ebuildskernel-miscUNCONFIRMEDdev-libs/klibc-1.5.25 - make silentoldconfig: Console input/output is redirected. Run 'make oldconfi2012-12-10 11:38:29
438734Eclasses and Profileskernel-miscUNCONFIRMEDlinux-mod.eclass - KERNEL_DIR/KBUILD_OUTPUT version mismatch is not detected, KERNEL_DIR is not infe2012-10-18 07:40:38
444238Ebuildskernel-miscUNCONFIRMEDsys-kernel/linux-headers: Out of kernel builds seems not supported2012-11-23 04:59:46
436402Eclasses and Profileskernel-miscUNCONFIRMEDkernel-2.eclass - Print the value of PATCH_DEPTH actually used for patching rather than it's initial2012-09-28 14:33:19
428728Core systemkernel-miscUNCONFIRMEDsys-kernel/ksymoops-2.4.11-r1 - In file included from ksymoops.h:9:0, from ksymoops.c:14: /usr/inclu2012-12-17 16:12:54
427052Eclasses and Profileskernel-miscUNCONFIRMEDlinux-mod.eclass needs a fix for ABI x322012-08-08 15:24:14
402967Applicationskernel-miscUNCONFIRMEDsys-fs/fuse-2.8.7 - ld.gold: error: symbol fuse_new has undefined version2012-12-25 21:39:12
386235Applicationskernel-miscUNCONFIRMEDsys-kernel/gentoo-sources-3.x will not boot encrypted /2011-12-26 13:34:01
390293Unspecifiedkernel-miscUNCONFIRMED[enhancement] sys-fs/sshfs-fuse: Improve remote permissions when files and directories are created2011-11-15 00:36:35
457732KDEkdeUNCONFIRMEDkde-base/kwin - Hyperthreading enabled + Java = Kwin unresponsive2013-02-17 17:49:19
457742EbuildskdeUNCONFIRMEDmedia-libs/phonon-vlc-0.6.2 version bump request2013-02-15 19:14:23
457920KDEkdeUNCONFIRMEDkde-base/kate-4.10.0-r1 improved ebuild2013-02-18 04:25:35
458270KDEkdeUNCONFIRMEDmedia-libs/qt-gstreamer-0.10.2: QtGLib requires >=sys-devel/gcc-4.5 as RDEPEND (libstdc++.so.6)2013-02-19 11:59:44
444742ApplicationskernelUNCONFIRMEDnet-fs/autofs-5.0.6-r3 unable to mount NFS on HPPA: do_mount_indirect: path to be mounted is to long2013-02-06 04:36:10
458116Core systemkernelUNCONFIRMEDkernel 3.7.5 - BUG related to skb when sysctl net.ipv4.tcp_mtu_probing!=02013-02-21 02:44:06
457166KDEkdeUNCONFIRMEDmedia-fonts/terminus-font unusable in konsole-4.9.5 because QT-4.8.4 renders terminus bitmap-font in2013-02-13 23:40:12
457132KDEkdeUNCONFIRMEDkde-base/plasma-workspace-4.10.0(-r1) wont save changed wallpapers2013-02-14 06:57:54
456360KDEkdeUNCONFIRMEDkde-base/print-manager looking for org.fedoraproject.Config.Printing2013-02-14 21:31:30
456394KDEkdeUNCONFIRMEDkde-base/ksmserver-4.10.0:4: Screen always locks (requires password) even if not supposed to2013-02-10 16:12:50
456230KDEkdeUNCONFIRMEDapp-cdr/k3b-2.0.2-r4: complains about "process can't started. Calling of In/Output module not possib2013-02-10 15:13:30
453088ApplicationskdeUNCONFIRMEDmedia-sound/amarok-2.7.0: sandbox access violation2013-02-14 11:48:25
453420KDEkdeUNCONFIRMEDmedia-libs/opengtl with sys-devel/llvm-3.2 fix2013-02-18 15:40:33
455234KDEkdeUNCONFIRMEDkmix: dbuscontrolwrapper.cpp:(.text+0x169): undefined reference to `vtable for DBusControlWrapper'2013-02-03 07:06:26
455634KDEkdeUNCONFIRMEDkde-base/systemsettings kde-base/powerdevil and other kde apps have automagical media-sound/pulseaud2013-02-06 07:13:02
455456LibrarykdeUNCONFIRMEDmedia-libs/phonon-gstreamer fails with gentoo-multilib - /usr/lib64/libphonon.so.4.6.0: could not re2013-02-05 06:18:13
455338KDEkdeUNCONFIRMEDmedia-libs/phonon-gstreamer-4.6.3 version bump2013-02-05 11:25:08
455286UnspecifiedkdeUNCONFIRMED=media-libs/gstreamer-0.10.36 upgrade causes kde-base/dragon-4.9.5 to crash when playing movies2013-02-04 17:58:38
433070KDEkdeUNCONFIRMEDapp-editors/kile-2.1.2-r1 - index.docbook:124: parser error : Entity 'ged.vertaald' not defined2013-02-17 22:53:14
436290KDEkdeUNCONFIRMEDkde-base/okular-4.9.1 - hpcups[7483]: prnt/hpcups/HPCupsFilter.cpp 536: cupsRasterOpen failed, fd = 2013-01-10 19:35:12
442120KDEkdeUNCONFIRMED[kde overlay] please add caledonia kdm-theme2012-11-07 02:08:16
447246KDEkdeUNCONFIRMEDkde-misc/kolor-manager-0.99 crashes when media-libs/oyranos-0.9.1 is built against app-admin/elektra2013-02-10 22:35:46
449888KDEkdeUNCONFIRMEDapp-text/poppler-0.20.4 - In file included from .../work/poppler-0.20.4/qt4/src/poppler-page.cc:36: 2013-01-17 13:59:17
449296KDEkdeUNCONFIRMEDnet-im/ktp-call-ui-0.5.1: gsttaglist.h:152:28: error: conflicting declaration ‘typedef struct _GstTa2013-01-18 10:50:15
458034ApplicationsjsbronderUNCONFIRMEDnet-nntp/sabnzbd-0.7.11 initscript always reports crashed status2013-02-19 20:05:09
400755KDEkdeUNCONFIRMEDkde-base/solid reads OpticalDisc, when the icon for the disc is queried2012-11-03 06:56:36
421231GNOMEkdeUNCONFIRMEDkde-misc/plasma-widget-menubar needs appmenu-gtk2013-02-14 21:21:05
453644Core systemjsbronderUNCONFIRMEDsys-cluster/torque-2.5.12 - qstat-qstat.o: In function `tcl_run': qstat.c:(.text+0x1ac5): undefined 2013-02-06 16:34:18
407155UnspecifiedjsbronderUNCONFIRMEDsys-cluster/openmpi - Rmpi fails to install under dev-lang/R-2.14.2 due to undefined symbol: mca_bas2012-05-11 12:13:24
406907Core systemjosejxUNCONFIRMEDsys-fs/diskdev_cmds - fsck.hfsplus segfaults on amd64/hardened2012-10-06 12:32:11
456186ApplicationsjmbsvicettoUNCONFIRMEDmedia-sound/amarok-2.6.0 - make[2]: *** No rule to make target `/usr/lib64/libGLU.so', needed by `li2013-02-13 19:21:15
372703UnspecifiedjmbsvicettoUNCONFIRMEDnet-misc/vde service script unloads module when it is still needed2012-06-08 13:14:11
457810Core systemjlecUNCONFIRMEDsys-fs/aufs3-3_p20130207 with USE="inotify" and sys-kernel/hardened-sources-3.7.5 doesn't compile - 2013-02-17 09:10:21
384429ApplicationsjlecUNCONFIRMEDdev-python/pyglet should depend on media-libs/libtxc_dxtn2011-10-05 19:38:41
386227ApplicationsjlecUNCONFIRMEDsci-libs/cgcode-1.0.ebuild doesn't install (shared object symlink issue)2011-11-21 16:34:36
435732ApplicationsjerUNCONFIRMEDx11-terms/rxvt-unicode-9.15 - glibc detected *** urxvtd: malloc(): smallbin double linked list corru2013-01-05 22:08:43
399353ApplicationsjerUNCONFIRMEDapp-admin/sysstat-10.0.3 generated daily report file will be truncated by cron.daily (sys-process/vi2012-05-10 14:40:15
456718LibraryjdhoreUNCONFIRMEDmedia-plugins/audacious-plugins-3.3.4 is incompatible with media-video/libav, fails during configure2013-02-11 17:14:50
439372Core systemjdhoreUNCONFIRMEDsys-apps/paludis[ruby-bindings] installs unslotted to latest ruby (actually 1.9) disregarding eselec2013-02-07 08:07:43
422483ApplicationsjdhoreUNCONFIRMEDdev-lang/pike-7.8.352-r2 multilib-strict check failed!2012-12-21 03:51:15
424201ApplicationsjdhoreUNCONFIRMEDmedia-video/miro-5.0.1 - .../work/miro-5.0.1/linux/miro-segmenter.c:236:45: error: ‘URL_WRONLY’ unde2012-07-11 03:26:33
427688EbuildsjdhoreUNCONFIRMEDmedia-video/miro-5.0.1, pre-stripped files, and revdep-rebuild keeps rebuilding due to /usr/bin/code2012-08-14 16:25:31
457636JavajavaUNCONFIRMEDdev-java/icedtea won't build with giflib-52013-02-15 00:51:36
403605ApplicationsjdhoreUNCONFIRMEDmedia-plugins/audacious-plugins-3.2 doesn't honor LINGUAS for locale files2012-02-23 21:52:28
403621ApplicationsjdhoreUNCONFIRMEDmedia-sound/audacious-3.2 doesn't honor LINGUAS for locale files2012-02-23 21:38:44
456932JavajavaUNCONFIRMEDERROR: dev-java/netbeans-javafx-7.2 failed (compile phase)2013-02-13 20:19:37
440636JavajavaUNCONFIRMEDdev-java/icedtea-web-1.3-r7: IcedTea-Web-Plugin displays garbage after version number in www-client/2012-10-31 17:38:32
441618JavajavaUNCONFIRMEDdev-java/icedtea-bin-7.2.3.3: should not install libsplashscreen.so with USE=-X2013-01-17 14:25:52
438834JavajavaUNCONFIRMEDdev-java/icedtea-6.1.11.4 fails to build with java.lang.OutOfMemoryError2012-10-18 18:57:31
439140JavajavaUNCONFIRMEDdev-java/icedtea: Use meaningful names for distfiles2013-02-20 07:39:04
434222JavajavaUNCONFIRMEDdev-java/ant-ivy-2.0.0 compilation failed2012-09-07 15:04:44
431972JavajavaUNCONFIRMEDicedtea-bin-7 should depend on gsettings-desktop-schemas2012-08-19 14:21:47
430062JavajavaUNCONFIRMEDdev-java/glazedlists-1.8 version bump2012-08-05 19:29:55
421077JavajavaUNCONFIRMEDdev-java/icedtea-7.2.2 compilation fails with Unrecognised option: -XX:-PrintVMOptions2012-10-18 16:15:26
417895JavajavaUNCONFIRMEDdev-java/stringtemplate-4.0.6 released2012-12-07 19:10:27
417897JavajavaUNCONFIRMEDdev-java/guava-12.0 released2012-05-28 20:37:26
399471JavajavaUNCONFIRMEDdev-java/ibm-jre-bin-1.6.0.9_p2-r1: error while loading shared libraries: libstdc++.so.5: cannot op2012-01-27 02:05:35
405715JavajavaUNCONFIRMEDjava eclass improved documentation2012-02-25 09:32:02
390399JavajavaUNCONFIRMEDicedtea-bin-1.10.4 always redownloads web start application2011-12-05 12:55:11
390663JavajavaUNCONFIRMEDicedtea-bin-1.10.4 fails to use Asian fonts automatically2012-01-10 19:16:30
391067JavajavaUNCONFIRMEDicedtea-7.2.0-r1 with javascript requires virtual/jdk:1.62012-09-16 15:08:31
389709JavajavaUNCONFIRMEDdev-java/icedtea-7.2.0-r1: failed to emerge due to SIGSEGV in the build process2012-11-02 14:42:48
382807ApplicationsjavaUNCONFIRMED[java-overlay] app-text/languagetool-0.9.8 needs >=virtual/ooo-3.02011-12-09 23:13:42
380441JavajavaUNCONFIRMEDjconsole (JRE 6.0_22-b22) crashes (SIGSEGV) in IcedTea6 1.10.32011-10-19 14:43:03
376823JavajavaUNCONFIRMEDdev-java/icedtea-6.1.10.3: I have problems when open Jdownloader program. A fatal error has been det2011-12-08 10:40:09
375319JavajavaUNCONFIRMEDProvide JavaScript for the dev-java/icedtea6-bin build2011-10-19 14:43:03
372097JavajavaUNCONFIRMEDdev-java/jpfcodegen-0.4 needs jdom-jaxen to build2011-06-17 20:35:53
368377JavajavaUNCONFIRMEDjava-config should support JNI related native config options and ld.so.conf pathes2012-04-04 14:19:10
374839Mailing Listsinfra-bugsUNCONFIRMEDList-Id: is not very fine configured2011-07-11 12:05:40
454218CVS/SVN/Gitinfra-bugsUNCONFIRMEDUnconfirmed reports of anonvcs (specifically cvs) failing to sync entirely2013-01-26 22:06:35
439686Applicationsidl0rUNCONFIRMEDmedia-video/nvidia-settings-304.60: ignoring '.nvidia-settings-rc' when '--load-config-only' is used2012-10-26 16:36:03
443086Ebuildsidl0rUNCONFIRMEDmedia-plugins/vdr-xineliboutput-9999 change actual CVS from 9999 to 999999992012-12-02 22:03:17
445760Applicationsidl0rUNCONFIRMEDmedia-plugins/vdr-xineliboutput-9999 CVS-Server: Connection reset by peer2012-12-04 15:07:50
447628Applicationsidl0rUNCONFIRMEDmedia-plugins/vdr-imonlcd-1.0.0 version bump2012-12-17 18:54:12
450406Applicationsidl0rUNCONFIRMEDnet-dns/bind-9.9.2_p1: /etc/bind/named.conf now points to /var/bind/root.cache (symlink) instead to 2013-01-07 03:35:32
456396Serveridl0rUNCONFIRMEDnet-dns/bind-9.9.2_p1: old named.cache2013-02-10 15:09:02
382719Ebuildsidl0rUNCONFIRMEDmedia-video/nvidia-settings hangs with three connected displays [patch]2012-02-17 05:16:12
403473Applicationsidl0rUNCONFIRMEDmedia-plugins/vdr-xineliboutput-1.0.5-r1 - xine_post_audiochannel.c:97:7: error: ‘post_audio_port_t’2012-09-27 15:47:31
377599Applicationsidl0rUNCONFIRMEDVersion bump: media-plugins/vdr-xineliboutput-1.0.72012-11-13 16:04:32
458160Applicationsidella4UNCONFIRMEDapp-emulation/xen-4.2.0-r1 - x86_64-pc-linux-gnu-ld: unrecognized option '--subsystem=10'2013-02-21 12:48:18
410053Applicationsidella4UNCONFIRMEDapp-emulation/xen-tools-4.1.2-r2 init script throws: option 'a' not supported2012-06-08 07:16:47
456684ApplicationshwoarangUNCONFIRMEDmedia-gfx/shotwell-0.13.1-r2: opening preferences window causes segfault in gnome-shell-3.6.2-r1 + m2013-02-13 11:47:53
453566ApplicationshwoarangUNCONFIRMEDmedia-sound/lastfmplayer 2.1.30 version bump2013-02-11 11:46:14
443728EbuildshwoarangUNCONFIRMEDapp-laptop/prey-0.5.4-r1: /etc/init.d/prey-trigger is installed as invalid symlink, first run attemp2013-01-15 19:43:12
406757ApplicationshwoarangUNCONFIRMEDmedia-video/rtmpdump crashes with gnutls[nettle]2012-03-24 09:19:49
430866ApplicationshwoarangUNCONFIRMEDx11-misc/lightdm-1.3.2: both password and ssh passphrase need to be entered at login2013-01-24 22:40:09
403841EbuildshwoarangUNCONFIRMEDdev-embedded/openocd-9999 - refactor and improve device support2012-11-05 12:32:05
397391ApplicationshwoarangUNCONFIRMEDx11-misc/lightdm doesn't work properly with gnome-base/gdm installed.2013-01-22 22:35:59
392401ApplicationshwoarangUNCONFIRMEDmedia-gfx/mypaint-0.9.1 (and 1.0.0) Can't paint after focus change2012-10-09 21:09:58
456770Libraryhd_brummyUNCONFIRMEDmedia-libs/FusionSound-1.1.1-r1 - core_sound.c:328:6: error: too few arguments to function 'fusion_o2013-02-11 14:57:06
456694LibraryhaubiUNCONFIRMEDdev-db/oracle-instantclient-sqlplus-11.2.0.3: sqlpus binary needs paxctl -c on hardened ~amd642013-02-19 20:33:27
454934GameshasufellUNCONFIRMEDgames-rpg/grimrock-20121222 segfault loading dungeon editor with USE=system-libs2013-02-05 01:39:36
444012ApplicationshaskellUNCONFIRMED=dev-lang/ghc-6.12.3 poorly handles -fPIC (ZCMain_main_closure' can not be used when making a shared2012-12-16 14:18:00
420573UnspecifiedhaskellUNCONFIRMEDhaskell-updater wrongly identifies packages as not installed by package manager2012-06-12 18:40:25
457708Core systemhardened-kernelUNCONFIRMEDapp-emulation/virtualbox-4.{1.22,2.6}-r1 on sys-kernel/hardened-sources - Can't start virtual machin2013-02-16 21:53:53
453492Hardenedhardened-kernelUNCONFIRMEDsys-kernel/hardened-sources-3.7.3: kernel panic when loading modules2013-01-28 14:15:36
456970Applicationshardened-kernelUNCONFIRMEDapp-editors/emacs-24.2 failed to emerge with a segmentation fault on hardened-sources-3.7.4-r12013-02-12 22:17:52
444892Hardenedhardened-kernelUNCONFIRMEDNetwork failure with >sys-kernel/hardened-sources-3.4.5 tulip driver (DECchip 21140)2013-01-24 14:11:59
446326Core systemhardened-kernelUNCONFIRMED=sys-kernel/hardened-sources-3.6.8 - unable to handle kernel NULL pointer dereference - vsftpd copy_2013-01-22 13:36:00
447682Core systemhardened-kernelUNCONFIRMEDsys-kernel/hardened-sources-3.7.0 on ia64 - drivers/built-in.o: In function `show_yoffset': bgrt.c:(2012-12-19 09:12:02
447702Core systemhardened-kernelUNCONFIRMEDsys-kernel/hardened-sources-3.7.0 fails to crosscompile for Ski-Simulator: include/linux/gfp.h:295:22012-12-19 09:10:48
437722Core systemhardened-kernelUNCONFIRMEDsys-kernel/hardened-sources-3.4.5, 3.5.4-r1: BUG: unable to handle kernel NULL pointer dereference2013-01-22 13:36:29
412551Applicationshardened-kernelUNCONFIRMEDsys-kernel/hardened-sources-3.2.12 + qemu-kvm: rcu_shed detected stall on CPU2012-08-06 00:30:12
417409Core systemhardened-kernelUNCONFIRMEDsys-kernel/hardened-sources-3.2.11 - beam: page allocation failure: order:1, mode:0x20 or swapper: p2012-05-28 10:16:10
390363Core systemhardened-kernelUNCONFIRMEDsys-kernel/hardened-sources-2.6.32-r42/r68/r73 - Problem with support OCFS2 filesystems2011-12-24 02:47:23
401669Core systemhardened-kernelUNCONFIRMEDsys-kernel/hardened-sources-2.6.32-r89: Compilation broken on ia642012-02-27 01:07:20
456922UnspecifiedhardenedUNCONFIRMEDUnable to start any java-vm on hardened gentoo icedtea-bin-6.1.11.5: Could not reserve enough space 2013-02-13 15:13:44
456364HardenedhardenedUNCONFIRMEDsys-kernel/hardened-sources-3.7.5 ppc64 xics-common.c fails with "assignment of member 'cause_ipi' i2013-02-10 01:31:44
455472HardenedhardenedUNCONFIRMEDsys-kernel/hardened-sources-3.2.37-r2: File "/usr/src/linux-3.2.35-hardened-r1/arch/ia64/scripts/unw2013-02-04 17:45:58
452828HardenedhardenedUNCONFIRMEDsys-apps/util-linux-2.21.2 - dmesg: *** glibc detected *** dmesg: double free or corruption (!prev):2013-01-18 16:31:50
446850HardenedhardenedUNCONFIRMEDthunderbird-17.0-r2 fails to install with CONFIG_PAX_MPROTECT enabled2012-12-14 17:52:48
447280HardenedhardenedUNCONFIRMEDsys-apps/haveged readd support2012-12-14 20:01:22
448322HardenedhardenedUNCONFIRMEDmake fails on kernel/sched/core.o when trying to build sys-kernel/hardened-sources-3.5.4-r12013-01-18 21:53:13
450776HardenedhardenedUNCONFIRMEDapp-emulation/wine-1.5.21 - configure: checking for -lGL... ./conftest: error while loading shared l2013-02-11 21:23:57
443296HardenedhardenedUNCONFIRMEDcrashes lvm&mkfs.xfs on mdraid10 with sys-kernel/hardened-sources > 3.22012-11-15 18:45:28
437732HardenedhardenedUNCONFIRMEDmedia-video/ffmpeg-0.10.3 can't install ffmpeg due to grsec restrictions2012-10-09 14:52:20
434922HardenedhardenedUNCONFIRMEDnet-fs/openafs-1.6.1 doesn't built with sys-kernel/hardened-sources with grsecurity/PaX enabled2013-02-10 14:52:43
432520HardenedhardenedUNCONFIRMEDmedia-libs/mesa-8.0.3: segfault in nouveau_dri (?) due to RWX mmap2012-09-10 12:14:55
415951ApplicationshardenedUNCONFIRMEDnet-analyzer/p0f-3.05_beta "p0f -L" throws segfault on hardened-sources2012-05-14 18:51:41
428682HardenedhardenedUNCONFIRMEDSystem.map has an incorrect kernel version reported when grsec enabled2012-08-03 15:29:25
402475HardenedhardenedUNCONFIRMEDXen DomU hardened kernel 3.1.8 and later crashes on boot2013-01-31 18:12:48
400951HardenedhardenedUNCONFIRMEDJava does not run properly on non-root with Grsecurity Hardened Gentoo [workstation] level2012-01-26 19:28:36
386647HardenedhardenedUNCONFIRMEDdev-java/jamvm-1.5.4-r1 segfaults with hardened gcc-4.5.3-r1 (any profile), unless -Xnoinlining is s2012-07-11 11:36:26
375439HardenedhardenedUNCONFIRMEDmedia-gfx/hugin-2011.0.0 needs paxctl -m2011-09-21 16:42:22
374289ApplicationshardenedUNCONFIRMEDwww-clients/firefox-5.0-r2 mmap loog on PaX&hardened system2012-01-21 01:27:05
435656EbuildshannoUNCONFIRMEDnet-analyzer/greenbone-security-assistant-2.0.1 - ld: CMakeFiles/gsad.dir/gsad.c.o: undefined refere2012-09-24 10:44:47
434472ApplicationshannoUNCONFIRMEDnet-analyzer/openvas-scanner-3.2.4 - ld: CMakeFiles/openvassd.dir/preferences.c.o: undefined referen2013-01-01 12:37:32
430422ApplicationshannoUNCONFIRMEDapp-emulation/dosemu-1.4.1_pre20091009 : svga USE flag is not handled properly2012-08-08 09:56:45
429778ApplicationshannoUNCONFIRMEDapp-emulation/dosemu-1.4.1_pre20091009 should depend on media-libs/libsdl2012-08-04 09:42:48
416587LibraryhannoUNCONFIRMEDmedia-libs/gegl-0.2.0: fails to compile with USE="introspection"2012-11-17 12:46:15
415107ApplicationshannoUNCONFIRMEDmedia-libs/gegl-0.2.0: suspect runtime-depend on dev-lang/perl2012-05-18 15:50:06
411271ApplicationshannoUNCONFIRMEDnet-im/python-otr-0.2.1.1 SRC_URI has changed2012-04-10 13:34:22
406333ApplicationshannoUNCONFIRMEDmedia-gfx/gimp-2.6.12 - Black and yellow striped rectangle on zoom2012-04-02 22:14:48
399687ApplicationshannoUNCONFIRMEDSVGs exported by app-office/libreoffice cause segmentation fault in media-gfx/gimp-2.6.11-r52012-01-23 09:36:24
392261UnspecifiedhannoUNCONFIRMEDapp-emulation/dosemu -fno-pic causes build failure when using hardened compiler with PIE2012-12-23 17:38:30
390843ApplicationshannoUNCONFIRMEDnet-mail/mailman-2.1.14 doesn't work with hardened with TPE2011-11-17 16:39:35
366757ApplicationshannoUNCONFIRMED=media-libs/gegl-0.1.6 - ff-load.c:79: error: duplicate case value2011-05-11 08:40:52
373847ApplicationshannoUNCONFIRMEDmedia-gfx/gimp-2.6.11-r1: crash on startup with error GLib-WARNING ignoring no-arg, optional-arg or 2011-10-22 18:15:20
436674ApplicationsgstreamerUNCONFIRMEDmedia-libs/gst-plugins-base-0.10.35: www-client/firefox-15.0.1[gstreamer] segfaults playing some vid2013-01-31 21:51:41
446251EbuildsgstreamerUNCONFIRMEDmedia-plugins/gst-plugins-dts and others shouldn't depend on media-libs/gst-plugins-bad2012-12-09 05:36:59
431522ApplicationsgstreamerUNCONFIRMEDmedia-video/flumotion: fails to build with python3* as system interpreter2012-12-28 00:22:54
427768ApplicationsgstreamerUNCONFIRMEDmedia-plugins/gst-plugins-ffmpeg-0.10.13-r2 - gstffmpegutils.c:42:40: error: parameter 1 ('smp_fmt')2012-07-24 15:31:30
422707EbuildsgstreamerUNCONFIRMEDmedia-plugins/gst-plugins-ffmpeg-0.10.13-r2 blocking, conflicts ffmpeg and libav2012-09-03 18:03:01
402763EbuildsgstreamerUNCONFIRMEDmedia-plugins/gst-plugins-ffmpeg-0.10.13-r1 - libavcodec/arm/dsputil_vfp.S:45: Error: selected proce2012-02-09 01:08:01
421829ApplicationsgstreamerUNCONFIRMEDmedia-plugins/gst-plugins-ffmpeg-0.10.13-r1 with ABI=x32 - libswscale/x86/swscale_template.c:998: Er2012-09-11 06:15:09
396583ApplicationsgstreamerUNCONFIRMEDmedia-plugins/gst-plugins-ffmpeg-0.10.13-r1 - libavcodec/x86/h264_deblock_10bit.asm:421: error: inva2012-02-29 20:47:12
383995ApplicationsgstreamerUNCONFIRMEDmedia-plugins/gst-plugins-ffmpeg-0.10.12 fails test2012-09-06 23:05:53
391381ApplicationsgstreamerUNCONFIRMEDmedia-video/flumotion-0.10.0 version bump2012-10-01 15:17:35
374043ApplicationsgstreamerUNCONFIRMEDmedia-plugins/gst-plugins-ffmpeg-0.10.11-r1 does not compile on x86 with mstackrealign CFLAG and gcc2011-07-10 10:04:50
418199ApplicationsgrozinUNCONFIRMEDsci-libs/mathgl-1.11.2 install phase - ln: failed to create symbolic link './mathgl-1.11.2/ChangeLog2012-06-04 09:41:36
365043GNOMEgstreamerUNCONFIRMEDmedia-plugins/gst-plugins-v4l2-0.10.28-r1: v4l2src is not working with ffmpegcolorspace (gst-plugins2011-07-07 12:30:25
371955EbuildsgstreamerUNCONFIRMEDmedia-libs/gstreamer should interactively install requested plugins2011-06-16 23:08:35
382463DevelopmentgrozinUNCONFIRMEDdev-lisp/cmucl-20b_p001 fails to install due to (I think) a broken sed script.2012-05-07 02:56:52
375783EbuildsgrozinUNCONFIRMEDmedia-gfx/fotoxx-11.07 ~ppc keyword request2011-07-21 11:28:06
447418ApplicationsgrobianUNCONFIRMEDmail-mta/exim-4.80.1 - Place exiscan-acl check in REQUIRED_USE?2012-12-17 19:10:33
453728ApplicationsgregkhUNCONFIRMEDmedia-gfx/colorhug-client- new homepage?2013-02-06 21:12:00
456180ApplicationsgraphicsUNCONFIRMEDmedia-gfx/graphicsmagick-1.3.16-r1: Perl bindings not linked properly2013-02-11 11:22:06
456780LibrarygraphicsUNCONFIRMEDmedia-libs/icclib-2.14: iccdump segfaults on startup2013-02-12 15:13:03
456896LibrarygraphicsUNCONFIRMEDmedia-libs/lensfun-0.2.5-r2 - Fatal error: can't create out/posix.x86_64/release/libs/lensfun/mod-co2013-02-12 08:34:39
456990LibrarygraphicsUNCONFIRMEDmedia-libs/lensfun-0.2.7 version bump2013-02-12 21:58:13
457080EbuildsgraphicsUNCONFIRMEDmedia-gfx/cellwriter-1.3.5 - version bump request and please move it to app-accessibility/2013-02-13 18:34:41
457634LibrarygraphicsUNCONFIRMEDmedia-libs/imlib2-1.4.5 with media-libs/giflib-5.0.x - pass NULL a second argument to DGifOpenFileHa2013-02-15 15:41:00
454260ApplicationsgraphicsUNCONFIRMEDmedia-gfx/nvidia-cg-toolkit-2.1.0017-r1 - should install a symlink on path /opt/nvidia-cg-toolkit 2013-01-28 13:14:58
448900LibrarygraphicsUNCONFIRMEDmedia-libs/gexiv2-0.5.0 version bump request2012-12-28 14:52:07
449086ApplicationsgraphicsUNCONFIRMEDmedia-libs/lensfun-0.2.5-r2 fails using multiple jobs2013-01-10 07:44:47
448670ApplicationsgraphicsUNCONFIRMEDmedia-gfx/inkscape-0.48.4 - Superfluous dependencies, make them USE-dependent or remove them.2012-12-26 23:33:10
446628EbuildsgraphicsUNCONFIRMEDmedia-gfx/gtkimageview-1.6.4 should not restrict userpriv when not running tests2012-12-09 23:41:57
443584ApplicationsgraphicsUNCONFIRMED>=media-gfx/nvidia-cg-toolkit-3.1.0013 - Breaks flash websites. - Inconsistency detected by ld.so: d2012-11-19 18:47:29
440452ApplicationsgraphicsUNCONFIRMEDmedia-gfx/grub-splashes-20091109: some elog messages should only be shown for the first install.2012-10-31 16:14:45
440960ApplicationsgraphicsUNCONFIRMEDmedia-gfx/wings crashes at startup with incorrect version of erl_driver.h2012-11-02 17:02:33
440104ApplicationsgraphicsUNCONFIRMEDmedia-libs/lensfun-0.2.6 installs corrupted pkgconfig file2013-01-10 07:44:34
438436ApplicationsgraphicsUNCONFIRMEDmedia-gfx/enblend-4.0 USE=doc - !pdfTeX error: pdfetex (file ./smooth-edge.pdf): reading image file 2012-10-15 11:31:41
431986ApplicationsgraphicsUNCONFIRMEDmedia-gfx/luminance-hdr-2.3.0 - crash when loading any hdr file if compiled with -march=core22012-08-20 12:08:47
436120ApplicationsgraphicsUNCONFIRMEDmedia-gfx/inkscape-0.48.3.1 configure: error: Package requirements were not met (cblas.pc)2012-10-06 20:58:27
437446ApplicationsgraphicsUNCONFIRMEDmedia-gfx/nip2-7.26.4 - parser.h:57:12: error: conflicting types for ‘yyleng’ lex.c:275:11: note: pr2013-02-16 13:23:10
427696EbuildsgraphicsUNCONFIRMEDmedia-gfx/xli: broken homepage link2012-07-23 12:17:10
424812EbuildsgraphicsUNCONFIRMEDmedia-gfx/cairosvg should depend on dev-python/cssselect2012-07-06 04:28:24
426362ApplicationsgraphicsUNCONFIRMEDmedia-gfx/graphviz-2.28.0 media-gfx/graphviz-2.28.0 enables qt, despite USE=-qt4 builds Qt support2012-07-18 00:01:30
427392EbuildsgraphicsUNCONFIRMEDmedia-gfx/graphviz-2.26.3-r{3,4}: build fails at link time2012-07-23 18:43:29
427692EbuildsgraphicsUNCONFIRMEDmedia-libs/giblib: broken homepage link2012-07-23 12:18:55
427694EbuildsgraphicsUNCONFIRMEDmedia-gfx/xloadimage: broken homepage2012-07-23 12:18:25
416835ApplicationsgraphicsUNCONFIRMEDmedia-gfx/nip2 should support USE="compat examples"2013-02-16 14:13:54
422643ApplicationsgraphicsUNCONFIRMEDmedia-gfx/graphviz-2.28.0 sci-biology/phrap-1.080812 - file collision in /usr/bin/cluster2012-06-21 14:28:59
417995EbuildsgraphicsUNCONFIRMEDmedia-gfx/gimageview-0.2.27-r3: 'pow@@GLIBC_2.0' is defined in DSO /lib/libm.so.2012-05-28 16:32:51
417711ApplicationsgraphicsUNCONFIRMEDmedia-gfx/graphviz-2.26.3-r4 + distcc - iffe: x86_64-pc-linux-gnu-gcc : not a C compiler: should not2012-06-05 19:48:49
404227ApplicationsgraphicsUNCONFIRMEDmedia-gfx/hugin-2011.4.0 - ../hugin_base/libhuginbase.so.0.0: undefined reference to `sgesvd_'2012-02-17 15:08:27
416817LibrarygraphicsUNCONFIRMEDmedia-libs/vips-7.26.3 has automagic cxx dependency2013-02-16 13:19:29
416815LibrarygraphicsUNCONFIRMEDmedia-libs/vips should not depend on dev-libs/liboil2013-02-16 14:08:06
416199EbuildsgraphicsUNCONFIRMEDmedia-gfx/sxiv-9999: live ebuild request2012-05-16 11:41:18
415307ApplicationsgraphicsUNCONFIRMEDmedia-gfx/grub-splashes - HOMEPAGE is dead2012-05-10 00:18:44
414529LibrarygraphicsUNCONFIRMEDmedia-libs/openjpeg-1.5.0 does not build on Gentoo/FreeBSD2012-05-04 04:38:10
403045ApplicationsgraphicsUNCONFIRMEDmedia-gfx/tuxpaint-0.9.21-r1 doesn't honor LINGUAS for locale files2013-02-16 13:25:53
400601ApplicationsgraphicsUNCONFIRMEDmedia-gfx/enblend-4.0 USE=doc - ./auxmac.tex:1: I can't find file `thumbpdf.sty'.2012-01-25 13:59:04
387963EbuildsgraphicsUNCONFIRMEDmedia-gfx/gtkimageview: awkward configure.in adds unuseful dependency to gnome-common2013-01-20 18:14:43
398093DevelopmentgraphicsUNCONFIRMEDsys-devel/gcc-4.6.2 with -march=bdver1 creates broken media-libs/jpeg2012-04-27 15:47:47
387373ApplicationsgraphicsUNCONFIRMEDmedia-gfx/imagemagick-6.7.1.0 segmentation fault if not enough space in /tmp2011-10-21 07:30:54
386019ApplicationsgraphicsUNCONFIRMEDmedia-gfx/openclipart-2.3 version bump2012-06-19 16:44:15
385897ApplicationsgraphicsUNCONFIRMEDmedia-gfx/enblend-4.0 fails compilation with use="+image-cache"2011-10-07 00:52:55
382111LibrarygraphicsUNCONFIRMEDmedia-libs/libpgf-6.11.28: fails to build on ppc2011-09-09 00:09:11
383239EbuildsgraphicsUNCONFIRMEDmedia-gfx/wings-1.4.1 version bump2011-09-16 21:42:53
384205EbuildsgraphicsUNCONFIRMEDmedia-gfx/gnofract4d: gconf-2 dependency should be dropped2011-09-25 19:49:08
373479ApplicationsgraphicsUNCONFIRMEDmedia-libs/lensfun - Lensfun plugin for GIMP2013-01-10 07:42:30
373519EbuildsgraphicsUNCONFIRMEDmedia-gfx/yafray-9999 ebuild REQUEST for blender 2.5x or blender-svn2011-08-12 02:07:29
374137EbuildsgraphicsUNCONFIRMEDmedia-libs/openjpeg-9999.ebuild request2012-01-08 00:10:08
374337ApplicationsgraphicsUNCONFIRMEDmedia-gfx/hugin-2011.0.0 : ebuild need a debug USE flag2012-01-30 07:37:54
373387ApplicationsgraphicsUNCONFIRMEDmedia-gfx/hugin-2011.0.0 fail to compile; ld cannot find -lwx_gtk2_gl-2.82012-03-26 20:18:36
312935EbuildsgraphicsUNCONFIRMEDmedia-gfx/ufraw: Optionalize more dependencies and improve metadata.xml2011-10-09 07:35:16
369539ApplicationsgraphicsUNCONFIRMEDmedia-gfx/k3d 0.7.11.0-r1 - work/k3d-source-0.7.11.0/k3dsdk/ngui/main_document_window.cpp:1572:36: e2012-06-19 11:22:07
393335Javagnu_andrewUNCONFIRMEDdev-java/icedtea-7.2.0-r3 - segmentation fault in /var/tmp/portage/dev-java/icedtea-7.2.0-r3/work/ic2011-12-25 05:58:41
450808Javagnu_andrewUNCONFIRMEDdev-java/icedtea-6.1.11.5 SIGSEGV on nouveau_dri.so+0x26ea5b2013-01-08 14:10:07
364495Keywording and Stabilizationgnu_andrewUNCONFIRMEDPlease stabilize dev-java/icedtea-6.1.10.4 and dev-java/icedtea-web-1.1.12012-11-27 04:46:18
413489ApplicationsgnustepUNCONFIRMEDgnustep-base/gnustep-gui-0.22.0 - ld: warning: libicuuc.so.48, needed by /usr/lib64/libgnustep-gui.s2012-05-05 21:04:42
455134Applicationsgnome-officeUNCONFIRMEDapp=office/gnucash with dev-db/libdbi - "The library "libdbi" installed on your system doesn't corre2013-02-12 19:39:30
442294Ebuildsgnome-officeUNCONFIRMEDapp-office/dia-0.97.2 - Added support for >=gnome-3.002012-11-08 01:05:22
455938GNOMEgnomeUNCONFIRMED=gnome-base/gdm-3.6* - Fails to start when access to /proc is restricted.2013-02-07 02:11:03
453562GNOMEgnomeUNCONFIRMEDx11-libs/gtk+-3.6.3-r2 USE="wayland" - ./.libs/libgdk-3.so: undefined reference to `wl_egl_pixmap_cr2013-01-24 09:23:22
452464GNOMEgnomeUNCONFIRMEDmedia-video/totem-3.6.x: nautilus warning: libtotem-properties-page.so: undefined symbol: bacon_vide2013-01-16 18:49:29
450748GNOMEgnomeUNCONFIRMEDSegmentation fault with media-sound/rhythmbox-2.972013-01-07 21:31:17
449496GNOMEgnomeUNCONFIRMEDgnome-base/gnome-shell-3.6.2-r1: on non-gdm systems needs new dependency on gnome-screensaver2013-02-01 16:55:53
448964GNOMEgnomeUNCONFIRMEDgnome-extra/bug-buddy-2.32.0-r2 eds build fails with gnome-extra/evolution-data-server-3.62012-12-27 23:11:40
448898DevelopmentgnomeUNCONFIRMEDgnome-extra/contacts-0.12 : Only should be included directly2013-02-12 12:25:38
448894DevelopmentgnomeUNCONFIRMEDapp-mobilephone/gnome-phone-manager-0.68 : Only should be included directly2012-12-27 23:08:41
448892DevelopmentgnomeUNCONFIRMEDdev-python/evolution-python-2.32.0 : Only should be included directly2013-01-10 17:31:37
448770GNOMEgnomeUNCONFIRMED[gnome overlay] app-accessibility/at-spi2-atk-9999 fails to build due to failed patch "at-spi2-atk-2012-12-27 05:56:05
448772GNOMEgnomeUNCONFIRMED[gnome overlay] x11-libs/gtk+-9999 fails to build due to failed patch "gtk+-3.3.18-fallback-theme.2012-12-27 05:55:29
448890DevelopmentgnomeUNCONFIRMEDgnome-extra/evolution-webcal-2.32.0 : Only should be included directly2013-02-03 08:52:56
448342GNOMEgnomeUNCONFIRMED[gnome-overlay] =app-admin/gnome-system-tools-3.0.0: undefined reference to `g_thread_init'2012-12-23 23:45:59
448566GNOMEgnomeUNCONFIRMEDmedia-sound/rhythmbox should RDEPEND on media-plugins/gst-plugins-gio2012-12-25 18:04:00
447500GNOMEgnomeUNCONFIRMEDnet-libs/webkit-gtk-1.8.3 USE=spell - bad utf8 data is being passed to enchant_dict_check2012-12-17 19:41:30
444816GNOMEgnomeUNCONFIRMEDmedia-gfx/eog-3.4.3-r1 dosn't show me the entire picture2013-01-01 19:35:10
442208GNOMEgnomeUNCONFIRMEDmedia-gfx/gnome-screenshot-3.4.1 creates only black images2013-01-29 14:32:01
438560EbuildsgnomeUNCONFIRMEDmedia-sound/rhythmbox-2.98 version bump2013-01-12 11:04:35
439246ApplicationsgnomeUNCONFIRMEDmedia-gfx/gthumb-3.0.0 - segmentation fault in strlen(""), called from g_str_has_prefix at gstrfuncs2012-11-19 23:40:51
435488GNOMEgnomeUNCONFIRMEDmedia-libs/cogl-1.10.4 fails all tests2013-01-13 16:14:42
428514GNOMEgnomeUNCONFIRMEDmedia-gfx/gthumb-3.0.0 broken video thumbnail handling2012-07-29 13:16:35
434842GNOMEgnomeUNCONFIRMEDmedia-video/cheese-3.4.2 This package installs one or more .desktop files that do not pass validati2012-11-21 18:48:25
426676GNOMEgnomeUNCONFIRMEDmail-client/evolution-2.32.3-r1 deleted whole directory with calendars2012-07-21 12:09:48
421107GNOMEgnomeUNCONFIRMEDmedia-libs/cogl-1.10.2[gles2] error with GLchar (tegra2 headers of EGL & GLES1/2)2012-06-14 15:04:50
415801GNOMEgnomeUNCONFIRMEDwww-client/epiphany-3.4.1 fails test test-ephy-embed-single2012-09-16 08:52:40
420771GNOMEgnomeUNCONFIRMEDgnome-base/gvfs-1.12.3 (and apps using it, e.g. Nautilus) corrupt files on copy. Caused by prelink?2012-07-24 08:26:50
404475GNOMEgnomeUNCONFIRMEDgnome-base/gnome-shell-3.2.2.1 segfaults in on_apps_tree_changed_cb()2012-02-20 03:31:40
378931GNOMEgnomeUNCONFIRMEDmail-client/evolution-2.32.3: Changes in Account Editor windows cannot be submitted because of the d2012-03-05 08:17:37
393497GNOMEgnomeUNCONFIRMEDgnome-base/gnome-applets-3.2.1 fails to install if sys-apps/linux-misc-apps is installed2012-08-07 17:34:06
458456GamesgamesUNCONFIRMEDlxdream needs pax-marking2013-02-20 13:03:54
373903genkernelgenkernelUNCONFIRMEDsys-kernel/genkernel: initramfs does not open luks container if gpg-encrypted passphases are used2011-07-08 17:41:51
391443genkernelgenkernelUNCONFIRMEDsys-kernel/genkernel doesnt autodetect the key device if at other address than specified2012-05-12 20:33:06
419773genkernelgenkernelUNCONFIRMEDearly bind mounts are listed twice in the mount table2012-06-05 14:14:06
447328genkernelgenkernelUNCONFIRMEDsys-kernel/genkernel-3.4.45: encrypted filesystems from initramfs.mounts cannot be mounted2012-12-15 11:14:42
449692GamesgamesUNCONFIRMEDmedia-libs/libsdl-1.2.15 with >=x11-base/xorg-server-1.7 - cannot set gamma2013-01-05 21:05:36
447904GamesgamesUNCONFIRMEDBuild games-rpg/pcgen from source with fewer bundled libraries2012-12-20 05:10:59
447842GamesgamesUNCONFIRMEDgames-roguelike/adom-1.2.0_pre3 version bump - Ebuild included2012-12-19 21:19:26
436140GamesgamesUNCONFIRMEDgames-action/descent3 - updated ebuild to support installation from GOG package2012-09-24 22:54:46
435818GamesgamesUNCONFIRMEDgames-roguelike/dungeons-of-dredmor-1.1.2.ebuild - new ebuild2012-09-22 08:12:03
429286GamesgamesUNCONFIRMEDMouse behavior in games-fps/quake2-icculus is inverted in both x and y axis.2012-08-01 00:20:46
423031GamesgamesUNCONFIRMEDgames-puzzle/mindless-1.6 crash in generating sealed deck2012-08-27 12:45:23
419055GamesgamesUNCONFIRMEDgames-emulation:mednafen-0.9.21 does not compile2012-06-01 20:48:36
411715GamesgamesUNCONFIRMEDgames-fps/etxreal-0.30 - a heavily improved Quake 3 Arena engine2012-04-30 19:06:16
415913GamesgamesUNCONFIRMEDgames-sports/speed-dreams new version 2.0 available - please update2013-01-28 08:07:00
405839GamesgamesUNCONFIRMEDdelay created when selecting tiles2012-02-26 03:03:55
385873GamesgamesUNCONFIRMEDgames-action/survivor: new game, ebuilds provided (1.0.1, 9999)2012-04-30 19:22:26
380887GamesgamesUNCONFIRMEDgames-emulation/ssnes (plus libsnes) - SNES emulator based on bsnes (new ebuild)2012-09-04 21:28:30
379729EbuildsgamesUNCONFIRMEDgames-action/shadowgrounds: new game, ebuilds provided (1.0.1, 9999)2012-02-01 15:26:15
375691GamesgamesUNCONFIRMEDNew Ebuild for sdlhana-0.34, an SDL based hanafuda card game2011-07-22 12:18:47
374475GamesgamesUNCONFIRMEDnwn-data downloads 1.5GB of files only to tell me i need USE=cdinstall in order to proceed2012-10-07 11:42:43
372413GamesgamesUNCONFIRMEDImproved ebuild for games-action/transcend, also fixing sound on amd642012-12-14 06:03:39
457642Applicationsfreedesktop-bugsUNCONFIRMEDapp-misc/tracker-0.14.4 with media-libs/giflib-5 - add NULL as second argument to DGifOpenFileHandle2013-02-15 15:43:43
442052Applicationsfreedesktop-bugsUNCONFIRMEDsys-power/pm-utils-1.4.1-r2 uses deprecated kernel option CONFIG_WIRELESS_EXT_SYSFS2012-11-06 16:06:47
438900GNOMEfreedesktop-bugsUNCONFIRMEDmedia-libs/libopenraw-0.0.9 - segmentation faults in OpenRaw::IO::MemStream::read (crashes gnome-bas2012-10-19 17:18:13
398123EbuildsforensicsUNCONFIRMEDapp-forensics/rkhunter missed dependency on virtual/mailx2012-01-08 16:25:00
378067ApplicationsforensicsUNCONFIRMEDapp-forensics/aide-0.14.2 - aide fails if non-standard paths are used2013-02-03 13:02:31
442852Applicationsford_prefectUNCONFIRMEDmedia-sound/pulseaudio: keeps dir /var/run/pulse2012-12-30 21:51:58
447694Applicationsford_prefectUNCONFIRMEDmedia-sound/pulseaudio-2.99.3 USE=-system-wide - * Starting D-BUS system messagebus ... Unknown user2013-01-30 07:04:04
455818Applicationsford_prefectUNCONFIRMEDmedia-sound/pulseaudio USE=xen should depend on app-emulation/xen-tools not app-emulation/xen2013-02-06 13:55:31
437906Ebuildsford_prefectUNCONFIRMEDmedia-sound/pulseaudio build log not verbose2012-10-11 07:50:34
440508Applicationsford_prefectUNCONFIRMEDmedia-sound/pulseaudio-1.1-r1: some elog messages should only be shown for the first install.2012-12-07 20:08:23
441624KDEford_prefectUNCONFIRMEDmedia-sound/pulseaudio-2.1-r1: KDE freezes when using pulseaudio.2012-11-16 17:53:45
436506GNOMEford_prefectUNCONFIRMEDmedia-sound/pulseaudio-2.1-r1: does not die after logout2012-09-28 18:42:51
430854GNOMEford_prefectUNCONFIRMEDmedia-sound/pulseaudio-2.1: won't store volume level on gnome 3.2012-08-27 21:33:07
428116Ebuildsford_prefectUNCONFIRMEDmedia-sound/pulseaudio should RDEPEND on gnome-extra/gnome-media2013-02-02 08:13:37
430056Applicationsford_prefectUNCONFIRMEDmedia-sound/pulseaudio-1.1-r1 USE=lirc does not build lirc module2012-08-05 22:53:00
436158LibraryfontsUNCONFIRMEDmedia-fonts/lohit-fonts-20120607 version bump2012-09-25 05:17:02
437082LibraryfontsUNCONFIRMEDmedia-fonts/hunkyfonts has wrong LICENSE2013-01-06 03:05:35
440538ApplicationsfontsUNCONFIRMEDmedia-fonts/urw-fonts-2.4.9: some elog messages should only be shown when upgrading from an old enou2012-10-31 16:23:03
440590ApplicationsfontsUNCONFIRMEDmedia-libs/freetype-2.4.9-r1: some elog messages should only be shown when upgrading from an old eno2012-10-31 16:28:45
440598Eclasses and ProfilesfontsUNCONFIRMEDfont.eclass outputs elog messages that shoud only be displayed for new installs2012-10-31 16:05:11
446012Eclasses and ProfilesfontsUNCONFIRMEDfont.eclass should RDEPEND on media-libs/fontconfig2012-12-12 21:38:35
448926EbuildsfontsUNCONFIRMEDmedia-libs/freetype needs a local description of bindist USE-flag2012-12-27 20:19:55
455318LibraryfontsUNCONFIRMEDmedia-libs/freetype[X,-utils] needlessly depends on X libraries2013-02-05 11:37:35
456264LibraryfontsUNCONFIRMEDmedia-fonts/droid-113-r2 with multiple values in 2013-02-15 20:47:53
456646LibraryfontsUNCONFIRMEDmedia-libs/fontconfig-2.10.2: /var/lib/texmf/web2c/pdftex/pdfjadetex.fmt doesn't match pdftex.pool (2013-02-20 11:21:15
394875Applicationsford_prefectUNCONFIRMEDmedia-sound/pulseaudio - module-tunnel-sink is unreliable2012-12-15 12:50:15
410663Applicationsford_prefectUNCONFIRMEDmedia-sound/pulseaudio - without "flat-volumes = no" in daemon.conf pulseaudio doesn't restore mixer2012-04-04 07:10:48
427266Applicationsford_prefectUNCONFIRMEDmedia-sound/pulseaudio - When playing Flash plugin based video in browsers, .xsession-errors fills u2012-12-15 13:05:18
431430LibraryfontsUNCONFIRMEDmedia-fonts/libertine-ttf-5.3.0.20120702 version bump2013-01-01 22:02:26
433157LibraryfontsUNCONFIRMEDmedia-libs/freetype-2.4.10-r1 USE=infinality causes segmentation faults running x11-wm/openbox in _f2012-10-17 12:10:36
434262ApplicationsfontsUNCONFIRMEDmedia-fonts/urwvn-fonts - wrong license due to vn garamond2013-01-06 03:07:50
429922ApplicationsfontsUNCONFIRMEDmedia-gfx/fontforge-20120731 version bump2012-09-22 19:07:17
420901EbuildsfontsUNCONFIRMEDmedia-fonts/vlgothic-20120610 version bump2012-12-27 08:49:43
423001EbuildsfontsUNCONFIRMEDmedia-fonts/ricty-3.2.0 version bump2012-06-23 14:13:21
415653ApplicationsfontsUNCONFIRMEDx11-misc/gbdfed - HOMEPAGE has been changed2012-05-13 16:29:09
419335UnspecifiedfontsUNCONFIRMEDmedia-libs/fontconfig-? - fc-cat charmap field shows gibberish2012-09-14 22:56:18
373399ApplicationsfontsUNCONFIRMEDmedia-fonts/corefonts-1-r6: weird bold fonts2012-08-13 08:15:52
401207UnspecifiedfontsUNCONFIRMEDmedia-gfx/fontforge-20110222-r1: Crash while select more than 4 points while press "Shift/Ctrl"2012-01-28 17:49:29
406891ApplicationsfontsUNCONFIRMEDmedia-libs/freetype-1.4_pre20080316-r2 compile failure: make[2]: execvp: ../libtool: Permission deni2012-03-05 20:19:14
457010ApplicationsfloppymUNCONFIRMEDnet-misc/flexget-1.0.3344: BUG: Unhandled error in plugin --series: Only '='/'!=' operators can be u2013-02-17 18:32:40
435848ApplicationsfloppymUNCONFIRMEDx11-misc/x11vnc-0.9.13 with net-libs/libvncserver-0.9.9 - buffer overflow detected in /usr/lib/libvn2013-01-20 19:18:24
438850Core systemfloppymUNCONFIRMEDsys-boot/grub-2.00-r1 - .../work/grub-2.00/grub-core/efiemu/i386/coredetect.c:38: Error: invalid ins2013-02-01 09:31:19
454802DevelopmentflameeyesUNCONFIRMEDdev-utils/google-perftools-2.0-r1 ARMv6 does not imply 'dmb' instruction availability but it is used2013-02-02 00:14:37
453330ApplicationsflameeyesUNCONFIRMEDnet-proxy/squidclamav-6.10: redirection on virus detection does not work2013-01-21 20:20:05
453894ApplicationsflameeyesUNCONFIRMEDnet-misc/lksctp-tools-1.0.12 - src/apps/sctp_darn.c:1870: undefined reference to `sctp_connectx'2013-01-26 01:40:32
423817DevelopmentflameeyesUNCONFIRMEDdev-util/dwarves-1.9: ostra-cg cannot find python module ostra: ImportError: No module named ostra2012-06-27 18:54:10
399839EbuildsfauliUNCONFIRMEDapp-admin/tmpwatch reports "Cannot stat file" with --fuser on sufficiently loaded system2012-02-17 15:33:53
453540ApplicationsevermindUNCONFIRMED[pro-audio overlay] media-sound/jack-audio-connection-kit-1.9.9.5: TypeError: 'list' object is not c2013-02-09 17:14:49
368251EbuildsevermindUNCONFIRMED[pro-audio overlay] media-libs/armstrong-9999 ebuild needs updating: distutils.eclass2011-05-23 08:42:25
438778EbuildsevermindUNCONFIRMED[pro-audio overlay] media-sound/non-things - git structure change causing configure fail and eutils 2012-10-25 13:48:06
411367EbuildsevermindUNCONFIRMED[pro-audio overlay] media-sound/glashctl-0.4.[2|3] - lashserverinterface.cpp: In constructor 'LASHSe2012-04-11 01:40:34
414829Applicationseric.joshua.martinUNCONFIRMEDwww-apps/rt-4.0.5: Generated.pm configured directories point to /usr/share/webapps instaed of webapp2012-05-06 22:45:45
444199EbuildsenlightenmentUNCONFIRMED[enlightenment overlay] several packages moved in enlightenment svn2012-12-22 20:35:59
435752LibraryenlightenmentUNCONFIRMEDmedia-libs/evas-9999 - configure: WARNING: unrecognized options: --enable-software-sdl2012-09-21 16:55:35
458354Eclasses and ProfilesembeddedUNCONFIRMEDvideo_cards_geode is masked in profile hardened/linux/uclibc/x862013-02-20 15:30:48
441976StagesembeddedUNCONFIRMEDIdea: Providing a tiny stage (and profile) for limited embedded devices.2013-02-15 11:46:25
430566DevelopmentembeddedUNCONFIRMEDsys-devel/crossdev installed bashrc doesn't run cross-fix-root when it should2012-08-10 00:43:26
408505Installation HandbookembeddedUNCONFIRMEDqemu-user chroot information is outdated2012-03-27 08:13:11
370063DevelopmentembeddedUNCONFIRMEDsys-devel/crossdev: settings masked via arch profiles are not considered with cross-compilers2012-03-08 21:08:25
416227EbuildsemailUNCONFIRMEDmedia-gfx/splash-themes-livedvd: missing execute bit on /etc/splash/livedvd-12.0/scripts/*2012-10-29 21:32:09
446422Eclasses and ProfilesemacsUNCONFIRMEDbzr.eclass might need to use bzr pull’s --overwrite flag2013-01-29 14:59:44
426444ApplicationsemacsUNCONFIRMEDapp-editors/emacs-23.4-r3 fails to build in parallel (--jobs=64)2012-07-18 15:26:44
406425EbuildselvanorUNCONFIRMEDmedia-gfx/iscan-plugin-gt-f720-0.1.1 version bump2012-08-22 11:59:30
458494Keywording and StabilizationdotnetUNCONFIRMEDmedia-sound/banshee-2.6.0 stabilization request2013-02-20 21:52:39
443970ApplicationsdotnetUNCONFIRMEDmedia-plugins/banshee-community-extensions-2.4.0 - mirage-extension causes crashes2012-11-24 16:26:22
443604LibrarydotnetUNCONFIRMEDdev-dotnet/libgdiplus-2.10 - ../src/.libs/libgdiplus.so: error: undefined reference to 'atan' /// (m2012-11-19 10:30:17
431916ApplicationsdotnetUNCONFIRMEDdev-dotnet/libgdiplus-2.10.9 - Variable 'libjpeg_prefix' not defined in '/usr/lib64/pkgconfig/libgdi2012-11-09 14:13:30
445626Installation Handbookdocs-teamUNCONFIRMEDSwap amount in handbook needs a discussion2012-12-02 15:31:04
425312Other documentsdocs-teamUNCONFIRMEDnvidia guide xorg.conf can be simplified2012-07-13 20:07:44
400721Installation Handbookdocs-teamUNCONFIRMEDPart about bonding should be reworked2012-09-05 11:11:12
377179[FR]docs-teamUNCONFIRMEDUpdate need on the French documentation of Xen2012-07-21 15:05:04
382121Otherdocs-teamUNCONFIRMEDThe Suggestion of the new Korean translation for the related documentation2011-09-07 07:25:44
445083ApplicationsdjcUNCONFIRMEDdev-vcs/mercurial-2.1.1 src_test(): ...: Permission denied2012-12-16 14:33:53
442162ApplicationsdjcUNCONFIRMEDnet-misc/openvpn-2.1.4 - src_install: rmdir: failed to remove ‘/var/tmp/portage/net-misc/openvpn-2.12012-11-07 14:09:59
442616DevelopmentdjcUNCONFIRMEDdev-db/couchdb - /usr/lib/couchdb/bin/couchjs needs pax-mark mr on PaX-enabled systems.2013-01-12 18:34:44
413203DefaultdevrelUNCONFIRMEDcedk's revoked gpg key on active dev list2012-08-15 21:44:38
413217DefaultdevrelUNCONFIRMEDnirbheek's revoked gpg key on active dev list2012-08-09 10:43:08
440794ApplicationsdilfridgeUNCONFIRMEDmedia-gfx/digikam 2.9.0 - digikam (core): Failed to detect camera with GPhoto2 from Solid (canon ixu2013-01-27 16:08:36
442420ApplicationsdilfridgeUNCONFIRMEDmedia-libs/opencv-2.4.3 with USE=cuda : /opt/cuda/bin/nvcc compiles in /tmp which results in "No spa2013-02-04 21:24:25
443498LibrarydilfridgeUNCONFIRMEDmedia-libs/opencv - python/src2/cv2.cpp:1: /usr/include/python2.7/pyport.h:849:2: ??????: #error "LO2013-02-04 22:23:56
413197DefaultdevrelUNCONFIRMEDcardoe's revoked gpg key on active dev list2012-09-07 20:23:54
458006Applicationsdev-zeroUNCONFIRMEDx11-drivers/xf86-video-vmware with media-libs/mesa-9.1_rc1 - module fails to load2013-02-20 00:43:23
447630Unspecifieddev-zeroUNCONFIRMED=net-misc/openvswitch-1.6.1-r2 - /etc/init.d/ovs-controller: ERROR: ovs-controller needs service(s) 2013-02-12 08:26:14
435686Librarydev-zeroUNCONFIRMEDdev-libs/boost-1.49.0-r1 - In file included from [...] libs/date_time/src/gregorian/greg_month.cpp:12012-11-11 05:45:20
457760Enhancement/Feature Requestsdev-portageUNCONFIRMEDemerge -v to print expected total build time according to emerge.log?2013-02-16 10:08:21
458148Unclassifieddev-portageUNCONFIRMEDdev-libs/cyrus-sasl-2.1.25-r4: gzip: stdout: Broken pipe - phase-helpers.sh, line 312: Called __as2013-02-20 22:52:41
442056Enhancement/Feature Requestsdev-portageUNCONFIRMEDAdditional checks for sanity of user-supplied *FLAGS variables in make.conf2012-11-06 16:12:29
438816Coredev-portageUNCONFIRMEDsys-apps/portage-2.1.11.9 : /var/tmp/portage/._unmerge_/ directory not cleaned up2012-10-18 17:51:53
431978Coredev-portageUNCONFIRMEDsys-apps/portage: FEATURES=preserve-libs missed dependency (libmpc.so.2) in /usr/libexec/gcc/x86_64-2012-12-25 20:59:53
430132Core - Dependenciesdev-portageUNCONFIRMEDVersioned virtuals cause slot conflict when weak block dependencies could resolve with uninstall2012-08-08 07:44:32
430190Coredev-portageUNCONFIRMEDSlot conflict because of "no parents that aren't satisfied by other packages in this slot"2012-08-07 14:41:13
430102Unclassifieddev-portageUNCONFIRMEDEmerging in a deleted directory outputs lots of "getcwd: cannot access parent directories: No such f2012-08-21 00:22:33
428678Core - Configurationdev-portageUNCONFIRMEDsys-apps/portage-2.1.10.65 omits some variables from cascaded profiles make.defaults2012-08-07 05:00:31
423453Unclassifieddev-portageUNCONFIRMEDsys-libs/e2fsprogs-libs-1.42 - invalid /usr/bin/mk_cmds SED2012-07-26 18:50:05
422491Coredev-portageUNCONFIRMEDemerging updates to nfs-mounted file systems can cause running programs to segfault2012-06-21 02:59:59
421353Core - Interface (emerge)dev-portageUNCONFIRMED'The following REQUIRED_USE flag constraints are unsatisfied:' is not specific enough2013-01-14 09:02:15
420577Portage Documentationdev-portageUNCONFIRMEDsys-apps/portage: Polish manuals are severely outdated2013-01-05 13:26:13
416907Core systemdev-portageUNCONFIRMEDOption to remove orphaned dependencies when using emerge -C2012-12-25 21:12:35
420459Enhancement/Feature Requestsdev-portageUNCONFIRMEDemerge --keep-going should leave behind --resume state for skipped/failed builds2012-09-07 04:13:06
419381Core - Interface (emerge)dev-portageUNCONFIRMEDsys-apps/portage-2.2.0_alpha109: emerge autounmask comment shows confusing "required by" dependency 2013-02-18 21:17:14
415911Enhancement/Feature Requestsdev-portageUNCONFIRMED/var/log/portage/ not owned by an ebuild2012-05-15 15:24:41
403697Coredev-portageUNCONFIRMEDsys-apps/portage-2.1.10.46: TypeError: an integer is required2012-02-18 05:35:08
402977Documentationdev-portageUNCONFIRMEDemerge --update doesn't update all packages which can be updated2012-03-05 10:02:22
402935Core - Dependenciesdev-portageUNCONFIRMEDemerge bad handle on --exclude with masked packages2012-02-10 18:02:04
401503Enhancement/Feature Requestsdev-portageUNCONFIRMEDemerge please ad short option to autounmask-write, -w suggested2012-01-30 17:48:55
399577Core - Dependenciesdev-portageUNCONFIRMEDportage/emerge fails to compute dependencies and fails to report what triggered the problem2012-01-22 15:26:36
396439Enhancement/Feature Requestsdev-portageUNCONFIRMEDKeep track of packages that need the kernel sources2011-12-30 00:46:36
394419Enhancement/Feature Requestsdev-portageUNCONFIRMEDportage: provide a make.conf option for changing to cgroups (configuring them if needed) on package 2011-12-19 18:43:41
383323Javadev-portageUNCONFIRMEDsys-apps/portage: emerges pulls in older jdk slot when newer slot is masked (newer masked slot remai2012-09-06 19:32:08
380389Enhancement/Feature Requestsdev-portageUNCONFIRMEDebuild skips EAPI unsupported phases silently2011-08-26 03:07:11
380295Conceptual/Abstract Ideasdev-portageUNCONFIRMED[patch] sys-apps/portage: Enhanced output for emerge --pretend --fetchonly2012-09-06 20:12:21
426360Ebuildsdev-embeddedUNCONFIRMEDdev-embedded/sgpp-lite-arm-eabi-bin-2012.03.56 version bump2012-07-16 17:54:18
453426Developmentdev-embeddedUNCONFIRMEDdev-embedded/avrdude-9999: new ebuild2013-01-22 10:32:13
455828Developmentdev-embeddedUNCONFIRMED=dev-embedded/avr-libc - Please add epatch_user to ebuild.2013-02-06 13:29:14
412273Developmentdev-embeddedUNCONFIRMEDdev-embedded/avr-libc-1.8.0 probable preprocessor mistake in inttypes.h2012-04-17 15:26:21
410679Ebuildsdev-embeddedUNCONFIRMEDdev-embedded/libftdi-9999.1.0: add ability to install ftdi_eeprom utility2013-02-06 04:19:56
410677Ebuildsdev-embeddedUNCONFIRMEDdev-embedded/libftdi-9999.1.0: install docs from cmake build directory2012-04-03 20:37:04
452730Applicationsdesktop-wmUNCONFIRMEDx11-wm/icewm-1.3.7 suggested patches2013-01-18 22:55:56
443154Ebuildsdesktop-wmUNCONFIRMEDx11-wm/pekwm-0.1.15 - Doesn't create xsession attributes, new revision for the ebuild proposed.2013-01-24 16:59:23
411077Applicationsdesktop-dockUNCONFIRMEDx11-plugins/wmauda-0.8 - wmauda.c:126:11: error: expected '=', ',', ';', 'asm' or '__attribute__' be2012-11-07 21:33:21
383867Applicationscron-bugsUNCONFIRMEDsys-process/vixie-cron-4.1-r11 - won't run any scheduled tasks2011-09-21 00:11:06
409259Applicationscron-bugsUNCONFIRMEDsys-process/vixie-cron: sed -i Makefile expands $CFLAGS, $LDFLAGS into sed call, which can confuse s2012-03-22 12:39:21
449266LibrarycppUNCONFIRMEDdev-libs/Ice-3.4.2-r1 - /usr/lib64/libIceGrid.so.34: undefined reference to `IceInternal::upCast(Ice2012-12-31 15:31:18
458338DevelopmentcppUNCONFIRMEDdev-libs/boost-1.49.0-r2 with sys-libs/uclibc - In file included from libs/locale/src/posix/codecvt.2013-02-21 02:53:30
374471LibrarycppUNCONFIRMEDdev-libs/Ice-3.4.1 failed to install2011-07-09 03:07:07
442522EbuildscppUNCONFIRMEDboost::unordered_multimap<>::erase(iterator, iterator) broken in boost1.49-1.512012-11-10 11:44:20
432980Applicationscommon-lispUNCONFIRMEDdev-lisp/sbcl-1.0.55-r1 fails to compile with "The value 18446744073 is not of type (UNSIGNED-BYTE 32012-08-29 09:14:51
389783Ebuildscommon-lispUNCONFIRMEDdev-lisp/clozurecl-1.7 fails to build (unquoted SVN_REVISION in generated compiler commands)2011-11-08 19:59:04
404423Unspecifiedcommon-lispUNCONFIRMEDdev-lisp/ecls-12.2.1 fails to run tests - An error occurred during initialization: Module error: Don2013-02-02 10:15:50
455582ServerclusterUNCONFIRMEDsys-cluster/ceph should be started before netmount2013-02-05 12:25:27
455418ServerclusterUNCONFIRMEDsys-cluster/libdlm-3.1.5 - In file included from .../work/cluster-3.1.5/dlm/libdlm/libdlm.c:21:0: /2013-02-05 12:39:44
455516Core systemclusterUNCONFIRMEDsys-fs/gfs2-utils with sys-kernel/hardened-sources-3.7.3 - In file included from conftest.c:84: /usr2013-02-08 16:35:19
452378ServerclusterUNCONFIRMED>=sys-cluster/ceph-0.55.1 with dev-libs/boost-1.49 - In file included from mds/Dumper.cc:24: /usr/in2013-01-15 17:14:48
451270Core systemclusterUNCONFIRMEDsys-infiniband/ofed-3.5 - /etc/infiniband/openib.conf: MLX4_LOAD=yes not obeyed by init script2013-01-11 16:26:21
437090ServerclusterUNCONFIRMEDsys-cluster/keepalived-1.2.7-r1 "ip number count" errors2012-10-03 18:20:57
436218EbuildsclusterUNCONFIRMEDnet-misc/pssh with dev-lang/python-3.2 - pssh --help: ImportError: No module named version2013-01-04 06:31:50
412767Core systemclusterUNCONFIRMEDsys-block/lio-utils-9999 - python_pkg_setup() not called2012-06-18 20:39:15
414793Core systemclusterUNCONFIRMEDsys-cluster/maui-3.3.1-r2 - ERROR: cannot setpgrp, errno: 1 (Operation not permitted)2012-08-06 03:49:46
407173ApplicationsclusterUNCONFIRMEDsys-devel/icecream: distributed jobs fail because of missing libraries2012-06-27 00:00:39
392681Core systemclusterUNCONFIRMEDsys-devel/distcc[avahi] init script needs to depend on dbus for zeroconf2013-02-03 13:13:16
451054LibrarycjkUNCONFIRMEDdev-libs/oniguruma-5.9.2-r1 - autotools-utils_src_prepare: Cannot find the latest automake! Tried 1.2013-01-09 14:27:12
384031ApplicationschutzpahUNCONFIRMEDnet-analyzer/pchar[pcap] fails to build (possibly glibc version related)2012-08-20 03:39:32
456328ApplicationschithanhUNCONFIRMEDwww-plugins/gnash-08.10-r2 with dev-libs/boost-1.52.0-r5 - ld: sdl_gnash-gnash.o: undefined referenc2013-02-12 14:38:36
456722EbuildschithanhUNCONFIRMEDapp-misc/dvtm-9999.ebuild: added this ebuild2013-02-11 18:29:42
451316ApplicationscedkUNCONFIRMEDnet-firewall/conntrack-tools-0.9.14 - parse.c:230:34: error: ‘NULL’ undeclared (first use in this fu2013-01-11 16:17:24
454560LibrarycardoeUNCONFIRMEDx11-drivers/nvidia-drivers-313.18 with kernel 3.7.4 - NVRM: This PCI I/O region assigned to your NVI2013-02-05 19:04:08
456898ApplicationscardoeUNCONFIRMEDmedia-tv/mythtv with sys-fs/udisks:2 fails to detect DVD drives2013-02-14 00:28:21
371865ApplicationscedkUNCONFIRMEDmedia-sound/sndpeek :highlight_maker: command not found2011-06-16 16:05:08
440006ApplicationscardoeUNCONFIRMEDmedia-tv/mythtv-0.25 USE=-hls should depend on media-sound/lame2012-10-30 17:33:47
442996ApplicationscardoeUNCONFIRMEDmedia-tv/mythtv - logging to a file in /etc/conf.d/mythbackend fails because of hard-wired /etc/ini2012-12-30 16:58:46
446644EbuildscardoeUNCONFIRMEDmedia-tv/ivtv-firmware-20080701 should probably not be mirror-restricted2012-12-10 12:04:48
439656EbuildscardoeUNCONFIRMEDmedia-tv/mythtv mythbackend init script should drop need net2012-10-28 04:57:08
369497UnspecifiedcardoeUNCONFIRMEDfirmware from media-tv/ivtv-firmware-20080701 fails to initialize hauppauge hvr-13002011-06-06 02:07:34
428746ApplicationscardoeUNCONFIRMEDnet-misc/netcf-0.1.9 - drv_initscripts.c:1083:15: error: ‘NETCF_TRANSACTION’ undeclared (first use i2012-08-01 04:17:19
438248ApplicationscalchanUNCONFIRMEDmedia-video/kino-1.3.4 generates XML DVD indices incompatible with media-video/dvdauthor-0.7.02012-10-15 10:52:33
403037Applicationsc1pherUNCONFIRMEDmedia-gfx/darktable-0.9.3 doesn't honor LINGUAS for locale files2012-02-23 21:38:44
425708ApplicationscalchanUNCONFIRMEDdev-lang/R-2.10.1 - R: stack smashing attack in function - terminated2012-10-07 11:57:34
457784BugzillabugzillaUNCONFIRMED/data/cached/buglist-*.html missing last-modified timestamps2013-02-16 03:03:10
454384BugzillabugzillaUNCONFIRMEDExtend "My Bugs" list with RESOLVED NEEDINFO and RESOLVED TEST-REQUEST states2013-01-28 15:27:34
447322BugzillabugzillaUNCONFIRMEDRFC: Search mask should accept hash-tag-prefixed bug numbers too2012-12-15 10:18:21
435212BugzillabugzillaUNCONFIRMEDgentoo's bugzilla does not support xz compressed patches2012-11-28 14:34:32
373653BugzillabugzillaUNCONFIRMEDUnspecified component kills entered bugdescription2011-10-30 23:17:02
380107BugzillabugzillaUNCONFIRMEDBugzilla should have 'need ebuild' field.2011-10-30 23:16:56
458598Applicationsbug-wranglersUNCONFIRMED[media-gfx/asymptote-2.21] emerge failed with USE="doc latex"2013-02-21 14:49:39
458596Applicationsbug-wranglersUNCONFIRMEDmedia-gfx/wings-1.1.1: can't find include lib "esdl/include/gl.hrl" and "esdl/include/glu.hrl"2013-02-21 14:35:44
458594Applicationsbug-wranglersUNCONFIRMEDlibreoffice-bin: plain text files are opened by default using libreoffice writer, not gedit2013-02-21 14:20:01
458580Ebuildsbug-wranglersUNCONFIRMEDmedia-gfx/sane-backends-1.0.23 unnecessary linking to libnetsnmp.so2013-02-21 12:38:16
458568Applicationsbug-wranglersUNCONFIRMEDUdisks2 fails to mount flash drive when ACL isn't supported in kernel2013-02-21 13:23:05
458550Applicationsbug-wranglersUNCONFIRMEDmedia-libs/mesa-9.1_rc2 cannot compile2013-02-21 08:35:33
458548Unspecifiedbug-wranglersUNCONFIRMED=sys-apps/shadow-4.1.5.1-r1 failing sed in ebuild2013-02-21 08:10:22
458544Librarybug-wranglersUNCONFIRMEDdev-tcltk/tcllib-1.15: Detected file collision(s)2013-02-21 08:19:27
454508FreeBSDbsdUNCONFIRMEDfreebsd-rescue-9.1: Fail to link in environment that dev-util/pkgconfig-0.28 is installed.2013-01-29 11:31:19
444918FreeBSDbsdUNCONFIRMEDapp-arch/libarchive-3.0.4-r1 -- getvfsbyname failed error occurs, doesn't work in x86 chroot on amd62013-01-15 12:22:54
419591FreeBSDbsdUNCONFIRMEDCreate an OpenJDK ebuild based on the FreeBSD port2012-06-04 09:05:30
454228HardenedbluenessUNCONFIRMEDsys-kernel/hardened-sources-3.2.37-r2 fails to build for ia64: mm/mmap.c:1689:4: error: too few argu2013-02-21 02:26:58
445578ApplicationsbluenessUNCONFIRMEDnet-p2p/bitcoind - Hardcoded paths (/var/run/bitcoind.pid, /usr/bin/bitcoind, var directory) in init2013-02-12 03:34:41
447826Core systembluenessUNCONFIRMEDsys-kernel/hardened-sources-2.6.32-r143 fails to compile for ia64: include/linux/random.h:91:19: err2013-01-18 23:15:20
453902HardenedbluenessUNCONFIRMEDsys-kernel/hardened-sources-3.7.0 kernel panic or something like this2013-01-26 15:33:28
444078EbuildsbluenessUNCONFIRMEDdev-util/gperf-3.0.4 does hardcoded AR calls2012-11-20 18:58:24
443020ApplicationsbluenessUNCONFIRMEDnet-misc/tor-0.2.4.5_alpha USE=bufferevents [err] channel_closed(): Bug: src/or/channel.c:1315: chan2012-12-12 03:45:35
438508Core systembluenessUNCONFIRMEDhardened kernel 3.4.9 with ZFS patch - Recursive fault on unsuspending (resuming from RAM) laptop wi2012-10-17 03:55:19
436680ApplicationsbluenessUNCONFIRMEDapp-admin/webapp-config wrong permissions for vhost_perms_defaultowned_dir2012-10-01 00:54:40
434916ApplicationsbluenessUNCONFIRMEDapp-admin/webapp-config, SELinux support: set 'server-owned' file as rw content2012-09-21 18:37:35
434914ApplicationsbluenessUNCONFIRMEDapp-admin/webapp-config: Manage recursive server-owned dirs independently2012-11-01 08:18:58
434894ApplicationsbluenessUNCONFIRMEDapp-admin/webapp-config: Bad permissions for server-owned dirs (umask 022)2012-09-13 14:23:46
431048Core systembluenessUNCONFIRMEDsys-kernel/hardened-sources-3.4.7 panic on UP->SMP transition when putting CPU core online - BUG: un2013-01-18 20:53:51
401317ApplicationsbluenessUNCONFIRMEDnet-misc/curl-7.24.0: test cases failed: 1007 1009 1049 1093 1094 10992012-03-24 18:04:32
374505ApplicationsbluenessUNCONFIRMEDdev-util/gperf-3.0.4: compile error collect2: ld returned 1 exit status2012-02-04 01:23:02
374699ApplicationsbinkiUNCONFIRMEDdev-libs/lzo need LDFLAGS -no-undefined to build DLL for CHOST *-*-mingw322011-12-02 03:19:46
453500ApplicationsbircophUNCONFIRMEDapp-doc/root-docs-5.34.03 - Error: Function Open(filename,"RECREATE") is not defined in current scop2013-02-19 19:12:58
403455ApplicationsbilllUNCONFIRMEDmedia-video/ogmrip-0.13.7 - configure.in:132: error: possibly undefined macro: AM_GCONF_SOURCE_22012-02-15 17:31:54
385121ApplicationsbilllUNCONFIRMEDmedia-video/ogmrip refuses to install due to "poor programming practices"2011-11-12 17:23:29
387341ApplicationsbilllUNCONFIRMEDmedia-video/ogmrip-0.13.6 - ogmdvd-disc.h:71:1: error: expected '=', ',', ';', 'asm' or '__attribute2011-10-27 17:36:11
371083ApplicationsbilllUNCONFIRMEDmedia-video/ogmrip - add support for ogg container2012-03-26 09:37:04
457798ApplicationsbillieUNCONFIRMEDapp-portage/pfl-2.3-r2: cron-script doesn't run since 'python2' is not supported.2013-02-20 18:57:15
434830PrintingbillieUNCONFIRMEDnet-print/hplip-3.12.6-r1 - checks for updates when configured not to (default)2012-11-18 13:42:03
431684ApplicationsbenchmarksUNCONFIRMEDapp-benchmarks/bonnie++-1.96: manpage references ebuild-altered docpath2012-08-17 16:04:52
458518Core systembase-systemUNCONFIRMED=net-misc/iputils-20121221-r1 needs sys-libs/libcap in pkg_postinst()2013-02-21 10:14:40
455990Applicationsbase-systemUNCONFIRMEDapp-shells/bash=4.2_p37 - segfault when script aborted - *** glibc detected *** double free or corru2013-02-08 23:10:35
456308Core systembase-systemUNCONFIRMEDgrub2 won't launch memtest86 and memtest86+ if / and /boot are separated partitions and grub2 graphi2013-02-13 22:19:39
457026Core systembase-systemUNCONFIRMEDnet-misc/openssh: no host keys generated on systemd based system2013-02-20 18:21:40
454404Core systembase-systemUNCONFIRMEDsys-fs/static-dev: should also check for devtmpfs mounted at /dev2013-01-29 18:37:25
453098Core systembase-systemUNCONFIRMEDsys-devel/patch-2.7.1-r1: fails tests crlf-handling and need-filename2013-01-21 11:54:50
451622Core systembase-systemUNCONFIRMEDsys-apps/man-db-2.6.3-r1[nls]: Translated manpages will not be installed if app-text/po4a is not ins2013-01-15 12:05:38
452604Eclasses and Profilesbase-systemUNCONFIRMEDCPU_FEATURES: move USE="mmx sse etc..." CPU features to USE expanded variable2013-01-25 05:38:49
452630OpenRCbase-systemUNCONFIRMEDsys-apps/openrc - /etc/sysctl.conf not respected2013-02-16 23:07:26
446386Core systembase-systemUNCONFIRMEDsys-devel/automake-1.12.5 fails tests related to yacc2012-12-08 05:53:22
445636Librarybase-systemUNCONFIRMEDdev-libs/libpcre-8.32 - stack size should be increased for the test case2012-12-04 15:29:58
442690baselayoutbase-systemUNCONFIRMEDsys-apps/baselayout - share.BSD/fstab device names have changed with FreeBSD 9.02012-11-12 22:39:21
444092Core systembase-systemUNCONFIRMEDsys-apps/groff-1.21 does hardcoded AR calls2012-11-20 19:11:37
444090Core systembase-systemUNCONFIRMEDsys-apps/sed-4.2.1 does hardcoded AR calls2012-11-20 19:11:18
444088Core systembase-systemUNCONFIRMEDsys-apps/texinfo-4.13 does hardcoded AR calls2012-11-20 19:10:56
444086Core systembase-systemUNCONFIRMEDsys-devel/flex-2.5.37 does hardcoded AR calls2012-12-21 18:33:27
444084Core systembase-systemUNCONFIRMEDsys-devel/m4-1.4.16 does hardcoded AR calls2012-11-20 19:10:14
441970Core systembase-systemUNCONFIRMEDnet-misc/dhcp: Fedora patches should be considered for inclusion2012-11-14 18:55:55
439728Core systembase-systemUNCONFIRMEDnet-misc/ntp with sys-libs/glibc-2.15-r3 - ntpq -p: Request timed out2012-10-26 16:32:10
439504Core systembase-systemUNCONFIRMEDnet-misc/ethercard-diag - command is called ether-wake but man page is called etherwake2012-10-24 15:15:54
432652Applicationsbase-systemUNCONFIRMEDnet-misc/dhcp - dhclient (ipv6) not enabled for ppp devices2012-12-02 10:22:16
422877Core systembase-systemUNCONFIRMEDnet-firewall/iptables: ip6tables "state" test fails; will not jump to ACCEPT on ESTABLISHED,RELATED 2013-02-16 13:31:38
418287Core systembase-systemUNCONFIRMEDsys-boot/grub-0.97-r11 - Failed Running autoconf ! - configure.ac:59: error: possibly undefined macr2012-10-09 04:21:54
418181Ebuildsbase-systemUNCONFIRMEDmedia-video/vlc 2.0.1 or newer should depend on gettext 0.18.1 or newer2012-09-19 13:10:58
414857Core systembase-systemUNCONFIRMEDnet-firewall/iptables-1.4.12.1-r1 and -1.4.13: hack to use saner kernel-headers should be replaced b2013-02-16 14:07:42
410605Core systembase-systemUNCONFIRMEDsys-apps/util-linux-2.20-r1: fsck complains about checking file systems mounted ro2013-02-05 14:52:10
402245Core systembase-systemUNCONFIRMEDsys-fs/dosfstools-3.0.12 dosfslabel does not work if long file names are used in partition2013-01-23 19:12:35
395475Core systembase-systemUNCONFIRMEDsys-devel/libtool-2.4.2 fails tests: 8 failed (5 expected failures).2012-05-23 17:17:13
395537Core systembase-systemUNCONFIRMEDsys-process/procps doesn't prints cgroups correctly (systemd releated)2012-01-24 20:57:29
399491Core systembase-systemUNCONFIRMEDsys-devel/automake-1.11.2-r1 - fails py-compile-basic.test py-compile-basic2.test py-compile-basedir2012-02-06 11:51:29
390245Core systembase-systemUNCONFIRMEDsys-fs/mtools-4.0.15 - mcd fails to mount SD memory card (with all available (tested) card readers)2011-11-20 07:19:18
386565Ebuildsbase-systemUNCONFIRMEDsys-devel/libtool-2.4-r1: failed (emake failed)2011-10-11 05:39:18
389485Core systembase-systemUNCONFIRMEDsys-libs/libcap-2.22: pam_cap.so unresolved symbol pam_get_item(), breaks authentication2011-12-20 18:53:00
386539Core systembase-systemUNCONFIRMEDsys-boot/grub-1.99-r2 doesn't detect framebuffer resolutions if /usr is not mounted2011-11-11 13:32:10
384731Core systembase-systemUNCONFIRMEDsys-devel/libtool-2.4-r3 fails tests 42, 84, 112 on hardened2011-11-21 22:32:49
368835Core systembase-systemUNCONFIRMEDapp-admin/sysklogd - no way to disable startup of klogd when sysklogd is used in a vserver2011-05-31 23:48:08
367553Core systembase-systemUNCONFIRMEDnet-misc/openssh - sshd sessions don't get killed when system goes down or reboots2013-02-11 16:00:41
367325Eclasses and Profilesbase-systemUNCONFIRMEDInconsist save/restore path in savedconfig.eclass2013-01-24 16:21:26
374901Applicationsarmin76UNCONFIRMED[embedded-cross overlay] dev-python/pyxml-0.8.4-r2: multiple Python ABIs in EAPI <=2 is deprecated a2011-11-05 18:47:19
368997Ebuildsarmin76UNCONFIRMEDnet-misc/tightvnc: /etc/ini.d/vnc failes to start when media-fonts/font-misc-misc is installed with 2012-06-23 17:45:55
386059Libraryarfrever.ftaUNCONFIRMEDnet-libs/neon uses deprecated function gnutls_certificate_verify_peers() of gnutls2012-04-01 12:04:01
439894Applicationsapp-dictsUNCONFIRMEDapp-text/stardict - configure.ac:310: error: possibly undefined macro: AM_GCONF_SOURCE_22012-10-27 18:48:47
411861Ebuildsapp-backupUNCONFIRMEDapp-backup/backuppc-3.2.1-r1 needs several apache modules: ebuild should enforce that2012-04-14 05:51:11
416267Applicationsapp-backupUNCONFIRMEDapp-backup/backuppc-3.2.1 hangs and shows warnings about deprecated qw(...) with perl-5.142012-05-16 14:10:07
427572Applicationsapp-backupUNCONFIRMEDapp-backup/boxbackup - man pages are installed in /usr/man2012-07-24 14:08:07
458066ApplicationsangelosUNCONFIRMEDmedia-sound/xnoise-9999 (and possibly other versions) should depend on certain gst-plugins-*-package2013-02-19 20:18:26
436596Applicationsandrej.filipcicUNCONFIRMEDnet-fs/openafs-1.6.1-r1: parallel build failure - In file included from db_dump.c:31:0: database.h:12012-09-29 15:38:55
444808Applicationsandreis.vinogradovsUNCONFIRMEDapp-misc/hivex-1.3.6-r2 USE=ruby - rake aborted! / / cannot load such file -- rake/rdoctask2012-12-05 04:45:09
380959OtheraltUNCONFIRMEDapp-arch/dpkg: failed to compile on Mac OSX2011-10-08 16:59:55
384401OtheraltUNCONFIRMEDapp-text/texlive-core-2011-r4: failed to compile on prefix/Mac OSX2011-09-25 06:48:07
403551OtheraltUNCONFIRMEDCompilation of gcc-4.5.3-r1 fails with "configure: error: Link tests are not allowed after GCC_NO_EX2012-02-14 10:57:13
414549Libraryamd64UNCONFIRMEDapp-emulation/emul-linux-x86-*; support for running PCSX2 32-bit released binary (or own)2012-07-18 15:48:39
417191Ebuildsamd64UNCONFIRMEDapp-emulation/emul-linux-x86-gtklibs-20120520 needs pax marking - gtk-query-immodules-2.0-32: error 2012-12-12 16:42:02
429674Libraryamd64UNCONFIRMEDapp-emulation/emul-linux-x86-medialibs: move media-libs/faac to a separate package due to license "i2012-11-02 18:16:56
438844Applicationsalsa-bugsUNCONFIRMEDmedia-sound/alsa-utils[pulseaudio]: alsasound init.d script generates pulse state files in /2012-12-16 03:05:14
440448Applicationsalsa-bugsUNCONFIRMEDmedia-sound/alsa-utils-1.0.25-r1: some elog messages should only be shown for the first install.2012-10-31 16:14:30
440520Applicationsalsa-bugsUNCONFIRMEDmedia-libs/alsa-lib-1.0.25-r1: some elog messages should only be shown for the first install.2012-10-31 16:21:34
447578Unspecifiedalsa-bugsUNCONFIRMEDmedia-sound/alsa-utils-? with kernel 3.7.0 - alsactl: set_control:1464: Cannot write control '3:3:0:2013-01-25 17:23:47
456114Applicationsalsa-bugsUNCONFIRMEDmedia-sound/alsa-tools[ALSA_CARDS="indigoio"] - echomixer needs media-fonts/font-misc-misc2013-02-09 16:24:29
380957OtheraltUNCONFIRMEDdev-libs/newt: failed to compile on Mac OSX2011-09-13 15:59:04
432890Applicationsalsa-bugsUNCONFIRMEDmedia-libs/alsa-lib w/ net-im/skype: snd_pcm_avail_update() returned a value that is exceptionally l2012-09-09 08:42:31
301679Applicationsalsa-bugsUNCONFIRMEDmedia-sound/alsa-utils: alsaconf doesn't recognize usb sound devices2013-02-11 18:25:24
383605Core systemalsa-bugsUNCONFIRMEDmedia-libs/alsa-lib-1.0.23 crash when compiled with sys-devel/gcc-4.4.5 / -O32011-09-20 16:11:19
402303Applicationsalsa-bugsUNCONFIRMEDmedia-sound/alsa-utils-1.0.25 doesn't honor LINGUAS for locale files2012-02-23 21:38:44
410395Ebuildsalsa-bugsUNCONFIRMEDmedia-sound/alsa-firmware always installs hdsp/hdspm firmware2012-04-02 02:24:32
410583Libraryalsa-bugsUNCONFIRMEDmedia-sound/alsa-utils-? - alsactl: cannot read control info '2,0,0,Front Playback Volume,0': Invali2012-04-03 15:47:38
427496ApplicationsalexxyUNCONFIRMEDnet-wireless/wimax-1.5.2-r1 with net-wireless/wpa_supplicant-1.0 USE=wimax - undefined reference to 2013-01-05 12:47:50
432224ApplicationsaleUNCONFIRMEDapp-admin/keepass - windows and dialogs have scrambled fonts2013-01-15 16:09:02
392727DevelopmentadaUNCONFIRMEDdev-lang/gnat-gcc-4.3.5: fetch failed missing gnatboot-4.3-amd64.tar.bz22012-02-03 18:23:19
371322Eclasses and ProfilesadaUNCONFIRMEDdev-lang/gnat-gcc-4.3.2 - work/gcc-4.3.2/libgcc/../gcc/unwind-pe.h:136: error: expected declaration 2012-03-19 19:22:36
439844EbuildsaballierUNCONFIRMEDmedia-libs/stk-4.4.4 - In file included from RtAudio.cpp:6750:0: include/soundcard.h:106:28: fatal e2013-01-23 16:33:32
428462EbuildsaballierUNCONFIRMEDmedia-sound/a2jmidid should [R]DEPEND on dev-lang/python-2.72012-07-30 12:57:07
408191EbuildsaballierUNCONFIRMEDnet-nntp/hellanzb uses deprecated opts in init script2012-06-07 16:11:26
393281EbuildsaballierUNCONFIRMEDmedia-sound/lmms possibly bloated dependencies2011-12-05 20:18:32
398399ApplicationsvimUNCONFIRMEDapp-editors/vim-7.3.393 - if_perl.c:1102:1: error: static declaration of 'XS_VIM_Msg' follows non-st2012-09-29 14:38:20
456292OthertenUNCONFIRMEDLiveDVD 20121221: Kernel cannot detect BIOS RAID array2013-02-10 06:48:14
281522VulnerabilitiessecurityUNCONFIRMEDmedia-video/vlc Stack-based buffer overflows via smb:// URLs2012-09-19 13:03:24
343021Ebuildsmaintainer-wantedUNCONFIRMEDAdd ebuild for membase server (community edition)2011-07-04 10:46:11
413613Applicationsmedia-videoUNCONFIRMEDmedia-video/h264enc-9.4.6 version bump2012-04-26 15:16:26
270860EbuildspatrickUNCONFIRMEDwww-servers/apache apxs2 should _not_ save the CFLAGS and LDFLAGS used during build2013-02-16 13:15:39
255644Ebuildsmaintainer-wantedUNCONFIRMEDapp-emulation/basiliskII-jit: a lot improved ebuild2012-12-14 15:37:41
370099Ebuildsmaintainer-neededUNCONFIRMEDmedia-sound/line6usb kernel sources accessed through /lib/modules/`uname -r`2012-12-01 08:18:42
313491ApplicationsgraphicsUNCONFIRMEDmedia-gfx/exact-image: Verify and potentially improve Python-related code2012-10-06 11:48:14
312161GNOMEgnomeUNCONFIRMEDgnome-base/libbonobo-2.24.2 fails to build on hardened with2013-02-19 13:28:21
369923GamesgamesUNCONFIRMEDgames-action/trine-bin Filesize does not match recorded size2011-06-03 17:20:29
211203GamesgamesUNCONFIRMEDgames-rpg/bass: script for getting bass translated2011-07-27 09:15:01
266311Applicationsford_prefectUNCONFIRMEDmedia-sound/pulseaudio is lacking suspend support for sys-power/pm-utils (?)2012-10-19 12:32:55
383363UnspecifiedbilllUNCONFIRMEDmedia-video/ogmrip-0.13.6 needs threads patch to enable multithreading2011-09-19 18:57:43
436916Keywording and Stabilizationbase-systemUNCONFIRMEDsys-boot/lilo-22.8-r2: Fatal: Setup length exceeds 31 maximum; kernel setup will overwrite boot load2013-01-27 14:59:32
146951Core systemalphaUNCONFIRMEDsys-fs/quota - value too large for defined data type on Alpha systems2011-12-02 19:03:44
403965EbuildsaballierUNCONFIRMEDmedia-sound/decibel-audio-player-1.09 version bump2012-02-17 04:54:23
339725EbuildsaballierUNCONFIRMEDmedia-sound/lmms fails to build remote_vst_plugin: winebuild: as --32 failed with status 12011-04-19 16:10:52


back
Please read "Why adblockers are bad".



other Ads
Stellenangebote
Stellenangebote
für Fach- und
Führungskräfte
www.nachoben.com
Trace My Cash
Wenn Sie sich schon immer mal gefragt haben, wo eigentlich Ihr geliebtes Bargeld geblieben ist, finden Sie hier vielleicht die Antwort.
www.tracemycash.com
Other free services
toURL.org
Shorten long
URLs to short
links like
http://tourl.org/2
tourl.org
.
Reverse DNS lookup
Find out which hostname(s)
resolve to a
given IP or other hostnames for the server
www.reversednslookup.org

New Packages

- as rdf newsfeed
- as rss newsfeed
- as Atom newsfeed
2014-10-31
PEAR-HTML_QuickForm2 - 2.0.2
Ebuild name:

dev-php/PEAR-HTML_QuickForm2-2.0.2

Description

The PEAR package provides methods for creating, validating, proc

Added to portage

2014-10-31

actionmailer - 3.2.20
Ebuild name:

dev-ruby/actionmailer-3.2.20

Description

Framework for designing email-service layers

Added to portage

2014-10-31

actionmailer - 4.0.11
Ebuild name:

dev-ruby/actionmailer-4.0.11

Description

Framework for designing email-service layers

Added to portage

2014-10-31

actionmailer - 4.1.7
Ebuild name:

dev-ruby/actionmailer-4.1.7

Description

Framework for designing email-service layers

Added to portage

2014-10-31

actionpack - 3.2.20
Ebuild name:

dev-ruby/actionpack-3.2.20

Description

Eases web-request routing, handling, and response

Added to portage

2014-10-31

actionpack - 4.0.11
Ebuild name:

dev-ruby/actionpack-4.0.11

Description

Eases web-request routing, handling, and response

Added to portage

2014-10-31

actionpack - 4.1.7
Ebuild name:

dev-ruby/actionpack-4.1.7

Description

Eases web-request routing, handling, and response

Added to portage

2014-10-31

actionview - 4.1.7
Ebuild name:

dev-ruby/actionview-4.1.7

Description

Simple, battle-tested conventions and helpers for building web pages

Added to portage

2014-10-31

activemodel - 3.2.20
Ebuild name:

dev-ruby/activemodel-3.2.20

Description

A toolkit for building modeling frameworks like Active Record and Activ

Added to portage

2014-10-31

activemodel - 4.0.11
Ebuild name:

dev-ruby/activemodel-4.0.11

Description

A toolkit for building modeling frameworks like Active Record and Activ

Added to portage

2014-10-31

activemodel - 4.1.7
Ebuild name:

dev-ruby/activemodel-4.1.7

Description

A toolkit for building modeling frameworks like Active Record and Active

Added to portage

2014-10-31

activerecord - 3.2.20
Ebuild name:

dev-ruby/activerecord-3.2.20

Description

Implements the ActiveRecord pattern (Fowler, PoEAA) for ORM

Added to portage

2014-10-31

activerecord - 4.0.11
Ebuild name:

dev-ruby/activerecord-4.0.11

Description

Implements the ActiveRecord pattern (Fowler, PoEAA) for ORM

Added to portage

2014-10-31

activerecord - 4.1.7
Ebuild name:

dev-ruby/activerecord-4.1.7

Description

Implements the ActiveRecord pattern (Fowler, PoEAA) for ORM

Added to portage

2014-10-31

activeresource - 3.2.20
Ebuild name:

dev-ruby/activeresource-3.2.20

Description

Think Active Record for web resources

Added to portage

2014-10-31

activesupport - 3.2.20
Ebuild name:

dev-ruby/activesupport-3.2.20

Description

Utility Classes and Extension to the Standard Library

Added to portage

2014-10-31

activesupport - 4.0.11
Ebuild name:

dev-ruby/activesupport-4.0.11

Description

Utility Classes and Extension to the Standard Library

Added to portage

2014-10-31

activesupport - 4.1.7
Ebuild name:

dev-ruby/activesupport-4.1.7

Description

Utility Classes and Extension to the Standard Library

Added to portage

2014-10-31

argh - 0.26.0
Ebuild name:

dev-python/argh-0.26.0

Description

A simple argparse wrapper

Added to portage

2014-10-31

argh - 0.26.1
Ebuild name:

dev-python/argh-0.26.1

Description

A simple argparse wrapper

Added to portage

2014-10-31

crossdev - 20141030
Ebuild name:

sys-devel/crossdev-20141030

Description

Gentoo Cross-toolchain generator

Added to portage

2014-10-31

digikam - 4.4.0
Ebuild name:

media-gfx/digikam-4.4.0

Description

Digital photo management application for KDE

Added to portage

2014-10-31

flask-openid - 1.2.4
Ebuild name:

dev-python/flask-openid-1.2.4

Description

OpenID support for Flask

Added to portage

2014-10-31

gentoo-sources - 3.14.23
Ebuild name:

sys-kernel/gentoo-sources-3.14.23

Description

Full sources including the Gentoo patchset for the . kernel tree

Added to portage

2014-10-31

gentoo-sources - 3.16.7
Ebuild name:

sys-kernel/gentoo-sources-3.16.7

Description

Full sources including the Gentoo patchset for the . kernel tree

Added to portage

2014-10-31

gentoo-sources - 3.17.2
Ebuild name:

sys-kernel/gentoo-sources-3.17.2

Description

Full sources including the Gentoo patchset for the . kernel tree

Added to portage

2014-10-31

gpsd - 3.11
Ebuild name:

sci-geosciences/gpsd-3.11

Description

GPS daemon and library to support USB/serial GPS devices and various GPS/

Added to portage

2014-10-31

irker - 2.12
Ebuild name:

net-irc/irker-2.12

Description

Submission tools for IRC notifications

Added to portage

2014-10-31

libnih - 1.0.3-r1
Ebuild name:

sys-libs/libnih-1.0.3-r1

Description

Light-weight 'standard library' of C functions

Added to portage

2014-10-31

mumble - 1.2.8
Ebuild name:

media-sound/mumble-1.2.8

Description

Mumble is an open source, low-latency, high quality voice chat software

Added to portage

2014-10-31

murmur - 1.2.8
Ebuild name:

media-sound/murmur-1.2.8

Description

Mumble is an open source, low-latency, high quality voice chat software

Added to portage

2014-10-31

orocos_kdl - 1.3.0
Ebuild name:

sci-libs/orocos_kdl-1.3.0

Description

Kinematics and Dynamics Library (KDL)

Added to portage

2014-10-31

orocos_kdl - 9999
Ebuild name:

sci-libs/orocos_kdl-9999

Description

Kinematics and Dynamics Library (KDL)

Added to portage

2014-10-31

protobuf - 2.6.1
Ebuild name:

dev-libs/protobuf-2.6.1

Description

Google's Protocol Buffers -- an efficient method of encoding structured dat

Added to portage

2014-10-31

qemu - 2.1.2-r1
Ebuild name:

app-emulation/qemu-2.1.2-r1

Description

QEMU + Kernel-based Virtual Machine userland tools

Added to portage

2014-10-31

rails - 3.2.20
Ebuild name:

dev-ruby/rails-3.2.20

Description

ruby on rails is a web-application and persistance framework

Added to portage

2014-10-31

rails - 4.0.11
Ebuild name:

dev-ruby/rails-4.0.11

Description

ruby on rails is a web-application and persistance framework

Added to portage

2014-10-31

rails - 4.1.7
Ebuild name:

dev-ruby/rails-4.1.7

Description

ruby on rails is a web-application and persistance framework

Added to portage

2014-10-31

railties - 3.2.20
Ebuild name:

dev-ruby/railties-3.2.20

Description

Tools for creating, working with, and running Rails applications

Added to portage

2014-10-31

railties - 4.0.11
Ebuild name:

dev-ruby/railties-4.0.11

Description

Tools for creating, working with, and running Rails applications

Added to portage

2014-10-31

railties - 4.1.7
Ebuild name:

dev-ruby/railties-4.1.7

Description

Tools for creating, working with, and running Rails applications

Added to portage

2014-10-31

recutils - 1.7
Ebuild name:

dev-db/recutils-1.7

Description

Tools and libraries to access human-editable, plain text databases

Added to portage

2014-10-31

simple_oauth - 0.2.0-r1
Ebuild name:

dev-ruby/simple_oauth-0.2.0-r1

Description

Simply builds and verifies OAuth headers

Added to portage

2014-10-31

sip - 4.16.4
Ebuild name:

dev-python/sip-4.16.4

Description

Python extension module generator for C and C++ libraries

Added to portage

2014-10-31

sprockets - 2.1.4
Ebuild name:

dev-ruby/sprockets-2.1.4

Description

Ruby library for compiling and serving web assets

Added to portage

2014-10-31

sprockets - 2.12.3
Ebuild name:

dev-ruby/sprockets-2.12.3

Description

Ruby library for compiling and serving web assets

Added to portage

2014-10-31

vigra - 1.10.0
Ebuild name:

media-libs/vigra-1.10.0

Description

C++ computer vision library with emphasize on customizable algorithms and d

Added to portage

2014-10-31

vim-misc - 1.17
Ebuild name:

app-vim/vim-misc-1.17

Description

vim plugin miscellaneous auto-load scripts

Added to portage

2014-10-31

wireshark - 99999999
Ebuild name:

net-analyzer/wireshark-99999999

Description

A network protocol analyzer formerly known as ethereal

Added to portage

2014-10-31

youtube-dl - 2014.10.30
Ebuild name:

net-misc/youtube-dl-2014.10.30

Description

Download videos from YouTube.com (and more sites...)

Added to portage

2014-10-31

2014-10-30
apbs - 1.4.1-r2
Ebuild name:

sci-chemistry/apbs-1.4.1-r2

Description

Evaluation of electrostatic properties of nanoscale biomolecular system

Added to portage

2014-10-30

bin-prot - 112.01.00
Ebuild name:

dev-ml/bin-prot-112.01.00

Description

A binary protocol generator

Added to portage

2014-10-30

chrome-binary-plugins - 39.0.2171.42_beta1
Ebuild name:

www-plugins/chrome-binary-plugins-39.0.2171.42_beta1

Description

Binary plugins from Google Chrome for use in C

Added to portage

2014-10-30

chrome-binary-plugins - 40.0.2202.3_alpha1
Ebuild name:

www-plugins/chrome-binary-plugins-40.0.2202.3_alpha1

Description

Binary plugins from Google Chrome for use in C

Added to portage

2014-10-30

chromium - 38.0.2125.111
Ebuild name:

www-client/chromium-38.0.2125.111

Description

Open-source version of Google Chrome web browser

Added to portage

2014-10-30

chromium - 39.0.2171.42
Ebuild name:

www-client/chromium-39.0.2171.42

Description

Open-source version of Google Chrome web browser

Added to portage

2014-10-30

chromium - 40.0.2202.3
Ebuild name:

www-client/chromium-40.0.2202.3

Description

Open-source version of Google Chrome web browser

Added to portage

2014-10-30

crafty - 24.1
Ebuild name:

games-board/crafty-24.1

Description

Bob Hyatt's strong chess engine

Added to portage

2014-10-30

custom_printf - 111.25.00
Ebuild name:

dev-ml/custom_printf-111.25.00

Description

Syntax extension for printf format strings

Added to portage

2014-10-30

distcc - 3.1-r10
Ebuild name:

sys-devel/distcc-3.1-r10

Description

Distribute compilation of C code across several machines on a network

Added to portage

2014-10-30

distcc - 3.2_rc1-r1
Ebuild name:

sys-devel/distcc-3.2_rc1-r1

Description

Distribute compilation of C code across several machines on a network

Added to portage

2014-10-30

doctrine - 1.2.5
Ebuild name:

dev-php/doctrine-1.2.5

Description

An object relational mapper for PHP5

Added to portage

2014-10-30

eudev - 2.1.1
Ebuild name:

sys-fs/eudev-2.1.1

Description

Linux dynamic and persistent device naming support (aka userspace devfs)

Added to portage

2014-10-30

faillib - 111.17.00
Ebuild name:

dev-ml/faillib-111.17.00

Description

Syntax extension for inserting the current location

Added to portage

2014-10-30

freeipmi - 1.4.6
Ebuild name:

sys-libs/freeipmi-1.4.6

Description

Provides Remote-Console and System Management Software as per IPMI v1.5/2.0

Added to portage

2014-10-30

gdb - 7.8.1
Ebuild name:

sys-devel/gdb-7.8.1

Description

GNU debugger

Added to portage

2014-10-30

geoip - 1.6.3
Ebuild name:

dev-libs/geoip-1.6.3

Description

easily lookup countries by IP addresses, even when Reverse DNS entries don't e

Added to portage

2014-10-30

gnome-hearts - 0.3.1
Ebuild name:

games-board/gnome-hearts-0.3.1

Description

A clone of classic hearts card game

Added to portage

2014-10-30

google-chrome-beta - 39.0.2171.42_p1
Ebuild name:

www-client/google-chrome-beta-39.0.2171.42_p1

Description

The web browser from Google

Added to portage

2014-10-30

google-chrome-unstable - 40.0.2202.3_p1
Ebuild name:

www-client/google-chrome-unstable-40.0.2202.3_p1

Description

The web browser from Google

Added to portage

2014-10-30

kipi-plugins - 4.4.0
Ebuild name:

media-plugins/kipi-plugins-4.4.0

Description

Plugins for the KDE Image Plugin Interface

Added to portage

2014-10-30

kmod - 18-r2
Ebuild name:

sys-apps/kmod-18-r2

Description

library and tools for managing linux kernel modules

Added to portage

2014-10-30

lablgtk - 2.18.3
Ebuild name:

dev-ml/lablgtk-2.18.3

Description

Objective CAML interface for Gtk+2

Added to portage

2014-10-30

libkface - 4.4.0
Ebuild name:

media-libs/libkface-4.4.0

Description

Qt/C++ wrapper around LibFace to perform face recognition and detection

Added to portage

2014-10-30

libv4l - 1.6.0
Ebuild name:

media-libs/libv4l-1.6.0

Description

Separate libraries ebuild from upstream v4l-utils package

Added to portage

2014-10-30

lxc - 1.0.6-r1
Ebuild name:

app-emulation/lxc-1.0.6-r1

Description

LinuX Containers userspace utilities

Added to portage

2014-10-30

macaque - 0.7.1
Ebuild name:

dev-ml/macaque-0.7.1

Description

DSL for SQL Queries in Caml

Added to portage

2014-10-30

nautilus-tracker-tags - 1.0.5
Ebuild name:

gnome-extra/nautilus-tracker-tags-1.0.5

Description

Nautilus extension to tag files for Tracker

Added to portage

2014-10-30

nbwmon - 0.5.1
Ebuild name:

net-analyzer/nbwmon-0.5.1

Description

ncurses bandwidth monitor

Added to portage

2014-10-30

ocamlmod - 0.0.7
Ebuild name:

dev-ml/ocamlmod-0.0.7

Description

Generate OCaml modules from source files

Added to portage

2014-10-30

openresolv - 3.6.1
Ebuild name:

net-dns/openresolv-3.6.1

Description

A framework for managing DNS information

Added to portage

2014-10-30

pa_ounit - 111.28.00
Ebuild name:

dev-ml/pa_ounit-111.28.00

Description

Syntax extension that helps writing in-line test in ocaml

Added to portage

2014-10-30

pa_test - 111.08.00
Ebuild name:

dev-ml/pa_test-111.08.00

Description

Quotation expanders for assertions

Added to portage

2014-10-30

pgocaml - 2.1
Ebuild name:

dev-ml/pgocaml-2.1

Description

PG'OCaml is a set of OCaml bindings for the PostgreSQL database

Added to portage

2014-10-30

rebase - 1411
Ebuild name:

sci-biology/rebase-1411

Description

A restriction enzyme database

Added to portage

2014-10-30

sass-rails - 4.0.4
Ebuild name:

dev-ruby/sass-rails-4.0.4

Description

Official Ruby-on-Rails Integration with Sass

Added to portage

2014-10-30

sexplib - 112.01.00
Ebuild name:

dev-ml/sexplib-112.01.00

Description

Library for automated conversion of OCaml-values to and from S-expressions

Added to portage

2014-10-30

soltys - 1.0
Ebuild name:

games-rpg/soltys-1.0

Description

Classic adventure game

Added to portage

2014-10-30

sqlalchemy - 0.9.8
Ebuild name:

dev-python/sqlalchemy-0.9.8

Description

Python SQL toolkit and Object Relational Mapper

Added to portage

2014-10-30

sudo - 1.8.11_p2
Ebuild name:

app-admin/sudo-1.8.11_p2

Description

Allows users or groups to run commands as other users

Added to portage

2014-10-30

systemd - 217
Ebuild name:

sys-apps/systemd-217

Description

System and service manager for Linux

Added to portage

2014-10-30

systemd-sysv-utils - 216
Ebuild name:

sys-apps/systemd-sysv-utils-216

Description

sysvinit compatibility symlinks and manpages

Added to portage

2014-10-30

systemd-sysv-utils - 217
Ebuild name:

sys-apps/systemd-sysv-utils-217

Description

sysvinit compatibility symlinks and manpages

Added to portage

2014-10-30

tracker - 1.0.5
Ebuild name:

app-misc/tracker-1.0.5

Description

A tagging metadata database, search tool and indexer

Added to portage

2014-10-30

type-conv - 111.13.00
Ebuild name:

dev-ml/type-conv-111.13.00

Description

Mini library required for some other preprocessing libraries

Added to portage

2014-10-30

vanilla-sources - 3.10.59
Ebuild name:

sys-kernel/vanilla-sources-3.10.59

Description

Full sources for the Linux kernel

Added to portage

2014-10-30

vanilla-sources - 3.12.31
Ebuild name:

sys-kernel/vanilla-sources-3.12.31

Description

Full sources for the Linux kernel

Added to portage

2014-10-30

vanilla-sources - 3.14.23
Ebuild name:

sys-kernel/vanilla-sources-3.14.23

Description

Full sources for the Linux kernel

Added to portage

2014-10-30

vanilla-sources - 3.16.7
Ebuild name:

sys-kernel/vanilla-sources-3.16.7

Description

Full sources for the Linux kernel

Added to portage

2014-10-30

vanilla-sources - 3.17.2
Ebuild name:

sys-kernel/vanilla-sources-3.17.2

Description

Full sources for the Linux kernel

Added to portage

2014-10-30

xml-light - 2.2-r3
Ebuild name:

dev-ml/xml-light-2.2-r3

Description

Minimal Xml parser and printer for OCaml

Added to portage

2014-10-30

xmlm - 1.2.0
Ebuild name:

dev-ml/xmlm-1.2.0

Description

Ocaml XML manipulation module

Added to portage

2014-10-30

youtube-dl - 2014.10.29
Ebuild name:

net-misc/youtube-dl-2014.10.29

Description

Download videos from YouTube.com (and more sites...)

Added to portage

2014-10-30

zabbix - 2.2.7
Ebuild name:

net-analyzer/zabbix-2.2.7

Description

ZABBIX is software for monitoring of your applications, network and serve

Added to portage

2014-10-30

zabbix - 2.4.1
Ebuild name:

net-analyzer/zabbix-2.4.1

Description

ZABBIX is software for monitoring of your applications, network and serve

Added to portage

2014-10-30

rdf newsfeed | rss newsfeed | Atom newsfeed
- Powered by LeopardCMS - Running on Gentoo -
Copyright 2004 S&P Softwaredesign
Valid XHTML1.1 : Valid CSS : buttonmaker
- Level Triple-A Conformance to Web Content Accessibility Guidelines 1.0 -
- Copyright and legal notices -
Time to create this page: 12.4 ms
system status display
Stellenangebote