from small one page howto to huge articles all in one place

search text in:




Other .linuxhowtos.org sites: www.linuxhowtos.org
toolsntoys.linuxhowtos.org



Last additions:
How to make X listen on port 6000

How to make X listen on port 6000

words:

34

views:

82225

userrating:

average rating: 1.2 (52 votes) (1=very good 6=terrible)


May, 25th 2007:
April, 26th 2007:
Apr, 10th. 2007:
Druckversion . pdf icon
You are here: Portage


Details of dev-python/fs:

Description: Filesystem abstraction layer
Homepage:
https://github.com/PyFilesystem/pyfilesystem2/ https://pypi.org/project/fs/

available versions:

releasesalphaamd64armhppaia64mipsppcppc64ppc macoss390shsparcx86USE-Flagsdependenciesebuild warnings
fs-2.4.16-r1 ~++~-~++-~-~+none
show
show
Legend:
+ stable
~ testing
- not available
some ebuild warning depend on specific use-flags or architectures, all ebuild-warnings are shown.

Known bugs:
bug IDcomponentassigned tostatusdescriptionlast change
146951Core systemalphaUNCONFIRMEDsys-fs/quota - value too large for defined data type on Alpha systems2011-12-02 19:03:44
366875Ebuildsmaintainer-wantedUNCONFIRMED[new package] sys-fs/gdatafs - Gdatafs is a FUSE implemtation that mount picassa web and youtube to 2011-12-08 06:16:16
366891OpenRCopenrcUNCONFIRMEDsys-apps/openrc-0.8.2-r1 will not restart over a broken NFS share.2011-12-19 18:01:59
367331Ebuildsbase-systemUNCONFIRMEDsys-fs/quotatool-1.4.6: quotatool doesnt skip "rootfs / rootfs" mount entry2011-05-17 18:14:10
369489Ebuildsmaintainer-wantedUNCONFIRMEDsys-fs/boxfs-0.7.ebuild - A FUSE filesystem to access files on box.net accounts2011-06-06 00:29:16
372501GamesgamesUNCONFIRMEDNew ebuilds for Lips Of Suna (lipsofsuna-0.4.0 and git), a dungeon crawl game. Server and Client.2011-08-11 20:35:23
373903genkernelgenkernelUNCONFIRMEDsys-kernel/genkernel: initramfs does not open luks container if gpg-encrypted passphases are used2011-07-08 17:41:51
377461Ebuildsmaintainer-wantedUNCONFIRMEDnew ebuild for AeroFS2013-02-07 05:50:11
379865Ebuildsbase-systemUNCONFIRMEDsys-apps/acl-2.2.51[nfs] fails acl-2.2.42-CITI_NFS4_ALL-2.dif2012-09-04 18:27:25
379975Core systemsbriesenUNCONFIRMED=sys-fs/udev-164-r2: /dev/capi20 missing (*again*)2012-03-22 15:59:34
380795Core systembase-systemUNCONFIRMEDsys-fs/cryptsetup: dm-crypt-start.sh: get keys via custom pipe2011-09-23 15:26:00
380943Ebuildsmaintainer-wantedUNCONFIRMEDsys-apps/udev-discover: Sysfs browsing tool focused on helping udev users and developers (new packag2011-08-28 18:11:10
381973GamesgamesUNCONFIRMEDdev-games/physfs-2.0.2-r1 doesn't support 7z2012-01-07 19:54:58
390231EbuildsalexxyUNCONFIRMEDsys-fs/ocfs2-tools-1.6.4 init scripts not working on kernel 3.X2012-12-25 18:46:59
390245Core systembase-systemUNCONFIRMEDsys-fs/mtools-4.0.15 - mcd fails to mount SD memory card (with all available (tested) card readers)2011-11-20 07:19:18
390293Unspecifiedkernel-miscUNCONFIRMED[enhancement] sys-fs/sshfs-fuse: Improve remote permissions when files and directories are created2011-11-15 00:36:35
390363Core systemhardened-kernelUNCONFIRMEDsys-kernel/hardened-sources-2.6.32-r42/r68/r73 - Problem with support OCFS2 filesystems2011-12-24 02:47:23
390829Ebuildsbase-systemUNCONFIRMEDsys-fs/multipath-tools-0.4.8-r1: Problem with init.d script2011-11-17 15:55:55
391783Applicationssci-geosciencesUNCONFIRMEDsci-geosciences/mapserver-6.0.1 conflicting types for 'msWFSGetCapabilities11'2011-11-26 23:14:21
395529EbuildssambaUNCONFIRMEDnet-fs/samba - add support for samba-virusfilter2011-12-21 17:17:13
396467NetbootreleaseUNCONFIRMEDInstall gentoo via PXE (integrated squashfs.image + init patch)2012-08-24 16:17:54
397355ServersambaUNCONFIRMEDnet-fs/samba cluster flags wrong config file /etc/ctdb/functions2012-01-16 23:57:57
398253Applicationsandrej.filipcicUNCONFIRMEDnet-fs/openafs-1.6.1_pre1/1.6.1 does not build against 3.1.6/3.2.0-r1 kernel and heimdal-1.5.1-r1/12012-10-29 15:36:44
398733Ebuildsmaintainer-wantedUNCONFIRMEDnet-fs/unfs3-0.9.22 A portable user-space implementation of the NFSv3 server specification2012-01-15 19:29:12
400749Applicationsmaintainer-neededUNCONFIRMEDapp-laptop/ibam-0.5.2-r3 - ./ibam-0.5.2/debian/patches/04sysfs.dpatch fails2012-12-14 15:51:56
402245Core systembase-systemUNCONFIRMEDsys-fs/dosfstools-3.0.12 dosfslabel does not work if long file names are used in partition2013-01-23 19:12:35
402343Servernet-fsUNCONFIRMEDnet-fs/netatalk /etc/init.d/afpd needs avahi-daemon even if called with -nozeroconf2012-04-08 21:14:32
402967Applicationskernel-miscUNCONFIRMEDsys-fs/fuse-2.8.7 - ld.gold: error: symbol fuse_new has undefined version2012-12-25 21:39:12
403523Core systemfreedesktop-bugsUNCONFIRMEDsys-power/pm-utils-1.4.1-r2: power.d/xfs_buffer writes wrong/invalid value(s) in battery mode2012-02-14 18:47:19
403913Gamesmaintainer-wantedUNCONFIRMEDgames-emulation/fs-uae - a multi-platform Amiga emulator based on WinUAE/E-UAE/PUAE, with a focus on2012-02-15 17:27:10
406255Sandboxmaintainer-neededUNCONFIRMEDdev-libs/apr-1.4.6 failed test: testlfs : \/bin/bash: line 2: 3428 Segmentation fault (core d2012-12-29 17:08:08
406615Applicationsnet-fsUNCONFIRMEDnet-fs/ncpfs: HOMEPAGE and SRC_URI no longer available2012-03-02 18:26:34
406907Core systemjosejxUNCONFIRMEDsys-fs/diskdev_cmds - fsck.hfsplus segfaults on amd64/hardened2012-10-06 12:32:11
407169Ebuildsfreedesktop-bugsUNCONFIRMEDsys-fs/udisks-1.0.4-r2 - file:///etc/xml/docbook:1: parser make[3]: *** [udisks.7] Fehler 4 parser e2012-10-03 07:06:31
407277Core systemsystemdUNCONFIRMEDsys-fs/mdadm - add support for systemd2013-02-04 15:19:48
407725ApplicationsforensicsUNCONFIRMEDapp-forensics/chkrootkit-0.49 -n option does not recognize nfs4 mounts2012-03-13 10:15:38
407783Ebuildscorvus-gentooUNCONFIRMEDsys-fs/safecopy version bump to 1.72012-03-18 10:43:13
407791Applicationsweb-appsUNCONFIRMEDwww-apps/drupal-7.12 Shows "Illegal string offset" Warning2012-03-13 11:22:43
408047Core systembase-systemUNCONFIRMEDsys-fs/cryptsetup-1.4.1 fails 4 tests : password-hash-test loopaes-test compat-test api-test2013-01-20 10:26:44
408139Core systembase-systemUNCONFIRMEDsys-fs/mdadm-3.2.1 sends ioctl 1261 (BLKFLSBUF) to partition when displaying array details2012-11-11 22:39:56
410605Core systembase-systemUNCONFIRMEDsys-apps/util-linux-2.20-r1: fsck complains about checking file systems mounted ro2013-02-05 14:52:10
411087Core systemmaintainer-wantedUNCONFIRMEDsys-fs/ddumbfs-1.0.11 - An inline data deduplicating filesystem designed with backup in mind2012-04-07 14:35:41
411173Ebuildsmaintainer-wantedUNCONFIRMEDsys-cluster/orangefs-2.8.5 - a branch of the PVFS2 cluster filesystem2012-04-09 18:51:41
412119Ebuildsandrej.filipcicUNCONFIRMEDnet-fs/openafs-1.6.1 should install user-friendly docs (and not docbook files)2012-09-24 06:59:46
413167Prefix SupportprefixUNCONFIRMEDsys-fs/fuse-2.9.0: emerge failed at compile phase.2012-04-22 23:17:14
413173Applicationsnet-fsUNCONFIRMEDnet-fs/nfs-utils - /etc/init.d/nfs and /etc/init.d/nfsmount calculate their dependencies incorrectly2012-05-18 05:15:48
413417EbuildsalexxyUNCONFIRMEDsys-cluster/glusterfs - Stopping glusterd init script should not kill the glusterfsd processes2012-12-07 13:08:00
413649Ebuildsnet-fsUNCONFIRMEDnet-fs/netatalk-2.2.1-r3 broken after upgrade2012-04-27 15:10:49
413979Core systemrobbat2UNCONFIRMEDlvm2create_initrd in sys-fs/lvm2-2.02.95-r1 fails to setup $LVM variable properly in initrd2013-01-17 23:44:45
414259Core systembase-systemUNCONFIRMEDsys-fs/mdadm: handling root-on-raid in init.d on shutdown2012-11-12 11:38:56
414451Ebuildsnet-fsUNCONFIRMEDnet-fs/netatalk-2.2.2 USE=kerberos with app-crypt/heimdal - uams_gss.c:201:37: error: 'gss_nt_servic2012-05-03 16:05:11
415443Ebuildsmaintainer-wantedUNCONFIRMEDnet-fs/junglediskworkgroup-3.16 - Networked storage/backup using Amazon's S3 service2012-07-28 23:06:49
417161Ebuildsmaintainer-wantedUNCONFIRMEDsys-fs/csvfs - file system representation of CSV data2012-06-10 03:48:18
417313Unspecifiedkernel-miscUNCONFIRMEDsys-fs/avfs-1.0.0 ecompressdir stumbles over an symlink2012-05-24 14:13:30
417943Core systembase-systemUNCONFIRMEDsys-apps/util-linux-2.19.1-r1: blkid doesn't escape / in ID_FS_LABEL2012-05-28 12:05:23
418463genkernelgenkernelUNCONFIRMEDlinuxrc in genkernel's initramfs does not properly deal with bind mounts2012-07-21 17:31:55
420771GNOMEgnomeUNCONFIRMEDgnome-base/gvfs-1.12.3 (and apps using it, e.g. Nautilus) corrupt files on copy. Caused by prelink?2012-07-24 08:26:50
421021FreeBSDbsdUNCONFIRMEDsys-libs/e2fsprogs-libs-1.42.3 fails to install because of include 2012-07-15 22:52:36
422491Coredev-portageUNCONFIRMEDemerging updates to nfs-mounted file systems can cause running programs to segfault2012-06-21 02:59:59
423453Unclassifieddev-portageUNCONFIRMEDsys-libs/e2fsprogs-libs-1.42 - invalid /usr/bin/mk_cmds SED2012-07-26 18:50:05
424189Core systemudev-bugsUNCONFIRMEDsys-fs/udev-171-r6: all modules are loaded even with rc_coldplug="NO"2013-02-08 17:46:29
424633EbuildssambaUNCONFIRMEDnet-fs/samba 3 vs. 4 should be SLOTted2013-01-09 17:21:01
425316Applicationskernel-miscUNCONFIRMEDapp-misc/fdutils-5.5-r2 - fdmount.c:25:27: fatal error: linux/ext2_fs.h: No such file or directory2012-12-12 05:51:37
426926Ebuildsmaintainer-wantedUNCONFIRMEDsys-kernel/mkinitramfs-ll-{0.10.8,9999}: consider adding this ebuild to the tree2012-07-30 15:04:36
426986Core systembase-systemUNCONFIRMEDsys-fs/cryptsetup-1.4.1: initscript ignores last line of conf. file2013-01-18 11:31:09
428008Core systemnet-fsUNCONFIRMEDnet-fs/nfs-utils-1.2.3-r1: Issues mapping uids and usernames between RHEL5 server and Gentoo client2012-07-25 15:56:19
428246Ebuildsmaintainer-wantedUNCONFIRMEDapp-backup/jungledisk-server - offsite managed backup for servers2012-07-28 23:06:49
430318OpenRCopenrcUNCONFIRMEDsys-apps/openrc-0.10.5 fails to remounts reiserfs root file system read only on reboot: failed becau2012-11-07 11:40:40
431252Ebuildsnet-fsUNCONFIRMEDnet-fs/nfs-utils unable to run nfs client only (nfs4), without server support in kernel2012-08-14 12:57:57
431976Core systemmaintainer-wantedUNCONFIRMEDnet-fs/pup-volume-monitor - another disk mounter2012-08-20 12:03:46
433074ServersambaUNCONFIRMEDnet-fs/samba: please add systemd unit file2013-02-15 18:19:32
434236DevelopmentrafaelmartinsUNCONFIRMEDdev-lua/luafilesystem-1.5.0 with dev-lang/lua-5.2.1: src/lfs.c:779:30: error: array type has incompl2013-02-03 13:08:19
434266Applicationsnet-fsUNCONFIRMEDnet-fs/davfs2-1.4.5-r1 man pages not Unicode-friendly2012-09-17 16:43:49
434922HardenedhardenedUNCONFIRMEDnet-fs/openafs-1.6.1 doesn't built with sys-kernel/hardened-sources with grsecurity/PaX enabled2013-02-10 14:52:43
434926Applicationsmaintainer-neededUNCONFIRMED>=net-im/skype-4.0.0.7 - login failure, stuck at "signing in" with JFS filesystem2013-01-03 19:31:41
435024Ebuildsmaintainer-wantedUNCONFIRMEDsys-fs/diskdevcmds-540.1 - HFS and HFS+ utils ported from OSX, supplies mkfs and fsck2012-09-14 14:23:28
435570ApplicationssambaUNCONFIRMED>=net-fs/cifs-utils-5.5-r1 - users cannot mount shares2012-09-24 13:00:56
435584KDEkdeUNCONFIRMEDkde-base/kdelibs - patch to fix directory icon breakage for NFS mounts since KDE 4.7.42012-09-28 17:48:44
436278Librarymaintainer-wantedUNCONFIRMEDnet-analyzer/nagios-afs-monitor - Nagios plugins to monitor openafs server status2012-09-26 13:37:17
436596Applicationsandrej.filipcicUNCONFIRMEDnet-fs/openafs-1.6.1-r1: parallel build failure - In file included from db_dump.c:31:0: database.h:12012-09-29 15:38:55
436598Applicationsandrej.filipcicUNCONFIRMEDnet-fs/openafs-1.6.1-r1 USE=doc - dodoc: doc/txt/winnotes is a directory2012-11-19 13:16:17
436992GNOMEgnomeUNCONFIRMEDgnome-base/gvfs-1.12.3-r1 - /usr/share/applications/mount-archive.desktop: warning: key "Encoding" i2012-11-21 18:48:43
437714Core systemrobbat2UNCONFIRMEDsys-fs/lvm2-2.02.97 init stop fails to deactivated lvs and vgs on shutdown2013-02-04 12:49:21
437718Core systemrobbat2UNCONFIRMEDsys-fs/lvm2-2.02.97 /etc/init.d/lvm-monitoring slows down boot and shutdown on systems with multiple2012-12-23 09:48:04
438262Core systemrobbat2UNCONFIRMEDsys-fs/lvm2-2.02.97 /etc/init.d/device-mapper does not support multi-line volumes in /etc/dmtab2013-01-28 12:11:27
438508Core systembluenessUNCONFIRMEDhardened kernel 3.4.9 with ZFS patch - Recursive fault on unsuspending (resuming from RAM) laptop wi2012-10-17 03:55:19
438998Core systembase-systemUNCONFIRMEDsys-fs/cryptsetup[selinux,static]: with sys-libs/libselinux-2.1.12, link fails with pcre missing sym2012-10-23 15:34:25
439214genkernelgenkernelUNCONFIRMEDsys-kernel/genkernel-3.4.44.2 and sys-fs/mdadm-3.2.3-r2; no auto-detection even with mdadm.conf?2013-01-04 19:27:33
439280LibraryvadimkUNCONFIRMEDapp-emulation/vmware-modules-264.4 - missing return carriage in printk in VNetUserIfSetUplinkState()2012-10-23 10:12:15
439660Ebuildsnet-fsUNCONFIRMEDnet-fs/nfs-utils nfsmount init script should drop need net2012-11-19 20:31:41
440558Applicationsrobbat2UNCONFIRMEDsys-fs/lvm2-2.02.88: some elog messages should only be shown when upgrading from an old enough packa2012-10-31 16:24:58
440562Core systembase-systemUNCONFIRMEDsys-fs/cryptsetup-1.4.3: some elog messages should only be shown when upgrading from an old enough p2012-10-31 16:25:30
440580ApplicationssambaUNCONFIRMEDnet-fs/samba-3.5.15: some elog messages should only be shown when upgrading from an old enough packa2012-10-31 16:27:27
440586ApplicationslivecdUNCONFIRMEDsys-fs/squashfs-tools-4.2: some elog messages should only be shown when upgrading from an old enough2012-10-31 16:28:08
441570KernelsecurityUNCONFIRMEDKernel: btrfs: creates world writable files2012-11-29 17:29:18
442052Applicationsfreedesktop-bugsUNCONFIRMEDsys-power/pm-utils-1.4.1-r2 uses deprecated kernel option CONFIG_WIRELESS_EXT_SYSFS2012-11-06 16:06:47
442232Ebuildsmaintainer-wantedUNCONFIRMEDsys-fs/hammer-{linux,read} - a port of the HAMMER File System from DragonFly BSD2012-11-07 19:44:43
442374Applicationsbase-systemUNCONFIRMEDsys-fs/cryptsetup - Replace ${dev} to be more descriptive in * pre_mount: mkswap ${dev} ...2012-11-08 19:02:10
442690baselayoutbase-systemUNCONFIRMEDsys-apps/baselayout - share.BSD/fstab device names have changed with FreeBSD 9.02012-11-12 22:39:21
442708FreeBSDbsdUNCONFIRMEDsys-fs/fuse4bsd -- version bump request2012-12-09 02:14:11
443296HardenedhardenedUNCONFIRMEDcrashes lvm&mkfs.xfs on mdraid10 with sys-kernel/hardened-sources > 3.22012-11-15 18:45:28
443636Core systemnet-fsUNCONFIRMEDnet-fs/davfs2-1.4.7 - User mount does not work, no entry for http://HOST/owncloud/files/webdav.php f2013-02-13 22:40:25
444486Keywording and StabilizationnaotaUNCONFIRMEDPlease stabilize =sys-fs/nilfs-utils-2.1.42013-02-03 13:07:08
444742ApplicationskernelUNCONFIRMEDnet-fs/autofs-5.0.6-r3 unable to mount NFS on HPPA: do_mount_indirect: path to be mounted is to long2013-02-06 04:36:10
444918FreeBSDbsdUNCONFIRMEDapp-arch/libarchive-3.0.4-r1 -- getvfsbyname failed error occurs, doesn't work in x86 chroot on amd62013-01-15 12:22:54
445288Ebuildsnet-fsUNCONFIRMEDnet-fs/nfs-utils-1.2.7 version bump2013-01-03 16:19:34
446018Core systembase-systemUNCONFIRMEDsys-fs/cryptsetup - dmcrypt init script should use keymaps2012-12-05 06:40:34
446190ServersambaUNCONFIRMEDnet-fs/samba-3.5.19: cross compile fixes2012-12-06 05:03:46
446680Ebuildsmaintainer-wantedUNCONFIRMEDsys-fs/snapper - a tool for managing btrfs snapshots2013-02-13 15:38:41
446696Applicationsnet-fsUNCONFIRMEDrevdep-rebuild selectes net-fs/ncpfs - QA Notice: Missing soname symlink(s): usr/lib/libncp.so.2.3 2012-12-10 20:02:00
447328genkernelgenkernelUNCONFIRMEDsys-kernel/genkernel-3.4.45: encrypted filesystems from initramfs.mounts cannot be mounted2012-12-15 11:14:42
447408DevelopmentvoyageurUNCONFIRMEDsys-devel/llvm-3.1r2 - X86ELFWriterInfo.cpp:85:1: interner Compiler-Fehler: Speicherzugriffsfehler2012-12-22 12:30:47
447682Core systemhardened-kernelUNCONFIRMEDsys-kernel/hardened-sources-3.7.0 on ia64 - drivers/built-in.o: In function `show_yoffset': bgrt.c:(2012-12-19 09:12:02
447688Prefix SupportprefixUNCONFIRMEDsys-fs/mtools: ld fails to build because of lost libiconv linkage flag2012-12-18 20:29:17
448156Core systemgenkernelUNCONFIRMEDGenkernel creates broken initramfs image - wrong lvm links blocks booting to a LVM rootfs2013-02-17 02:24:54
448238Core systemrobbat2UNCONFIRMED[PATCH] 2012-12-24 12:42:06
448348Core systemjlecUNCONFIRMEDsys-fs/aufs-util-3.6 fails to crosscompile: ./ver: ./ver: cannot execute binary file2012-12-25 16:14:13
448354Core systemrobbat2UNCONFIRMEDsys-fs/lvm2-2.02.97-r1 fails to crosscompile: configure: error: thin_check not found in path2013-01-19 16:12:30
448790Core systemrobbat2UNCONFIRMEDsys-fs/lvm2 - Please don't depend on udev when USE="+static -udev". (was: static flag requires +udev2013-02-10 16:07:22
449308LibraryenlightenmentUNCONFIRMEDdev-libs/e_dbus-1.7.4 USE=udev depends on sys-power/upower sys-fs/udisks, should be USE=ukit2013-01-20 13:31:49
449990Core systemrobbat2UNCONFIRMEDsys-process/audit - init script doesn't handle /var/lock on tmpfs properly2013-01-03 12:37:09
450024Core systemchutzpahUNCONFIRMEDsys-fs/ntfs3g-2012.1.15-r2: incorrectly built by ld.gold linker2013-01-05 17:10:32
450440Core systemmaintainer-wantedUNCONFIRMEDnet-fs/xtreemfs - XtreemFS is a fault-tolerant distributed file system for all storage needs2013-01-07 02:42:31
451452Core systemrobbat2UNCONFIRMEDsys-fs/lvm2-2.02.97-r1 - Errors on LV create/delete operations in systemd-196 environment.2013-02-07 01:16:09
451460Core systembase-systemUNCONFIRMEDsys-fs/cryptsetup - bashisms in dmcrypt initscript2013-01-13 17:38:46
451478Core systemrobbat2UNCONFIRMEDsys-fs/lvm2 - /etc/init.d/lvm should support multiple volume groups - Command failed with status cod2013-01-31 02:20:00
452048Applicationsmedia-videoUNCONFIRMEDmedia-video/vlc-2.0.5 - drop dependency on smbclient use-flag for >=net-fs/samba-4.0.02013-02-18 07:03:10
452050GNOMEgnomeUNCONFIRMEDgnome-base/gvfs-1.14.2: drop dependency on smbclient use-flag for >=net-fs/samba-4.0.02013-02-18 22:17:40
452776OpenRCopenrcUNCONFIRMEDsys-apps/openrc-0.11.*: system fails to shutdown with automount+nfs2013-02-16 13:44:26
453038Ebuildsbase-systemUNCONFIRMEDsys-fs/reiser4progs-1.0.7 ? w/ patches from reiserfs-devel mailing list2013-02-08 17:27:09
453306Applicationsnet-fsUNCONFIRMEDnet-fs/nfs-utils-1.2.6: mount.nfs: Cannot allocate memory2013-01-31 15:57:57
453778Ebuildsnet-fsUNCONFIRMEDnet-fs/autofs - sandbox violation in `mount -s' touching /run/mount2013-02-16 13:20:27
453880Applicationsnet-fsUNCONFIRMEDnet-fs/autofs-5.0.6-r5: fails to stop and to start:2013-02-16 13:22:48
453962Core systemnet-fsUNCONFIRMEDnet-fs/autofs-5.0.6-r5: umount automounted NFS share fails2013-02-16 13:31:29
454242Core systemandrej.filipcicUNCONFIRMEDnet-fs/openafs-1.6.2_pre3 USE=doc - !!! dodoc: doc/txt/winnotes is a directory2013-02-06 16:08:22
454362Core systemkernel-miscUNCONFIRMEDsys-fs/jfsutils-1.1.15 - Fails to build with +static if sys-apps/util-linux is built without +static2013-01-28 02:04:19
454404Core systembase-systemUNCONFIRMEDsys-fs/static-dev: should also check for devtmpfs mounted at /dev2013-01-29 18:37:25
454504ApplicationssoundUNCONFIRMED>=media-sound/mpg123-1.14.4 x32 ABI built with wrong LFS alias2013-01-29 14:56:43
454582Ebuildsmaintainer-wantedUNCONFIRMEDnet-fs/davenport - an SMB WebDAV front end for SAMBA2013-01-29 22:57:35
454746Core systemrobbat2UNCONFIRMEDsys-fs/lvm2-2.02.97-r1, sys-fs/udev-197-r4: /dev/mapper entries absent for dm-crypt partitions mount2013-02-04 01:37:50
454780Core systemgenkernelUNCONFIRMEDsys-kernel/genkernel-3.4.45 - initramfs unable to switch on real-root on /dev/sdax2013-02-01 22:15:24
455458OpenRCopenrcUNCONFIRMEDsys-apps/openrc - netmount fuser timeout - stopping the netmount script on shutdown. cifs shares won2013-02-06 12:18:47
455516Core systemclusterUNCONFIRMEDsys-fs/gfs2-utils with sys-kernel/hardened-sources-3.7.3 - In file included from conftest.c:84: /usr2013-02-08 16:35:19
455880Core systemkernelUNCONFIRMEDCONFIG_DEVTMPFS default value in kernel configuration (gentoo-sources and potentially others)2013-02-17 19:40:19
456362Libraryarfrever.ftaUNCONFIRMEDnet-libs/neon with >=dev-libs/openssl-1.0.1 - net-fs/davfs2 and net-misc/cadaver fail to connect to 2013-02-12 22:59:56
456662Core systemfreedesktop-bugsUNCONFIRMEDsys-fs/udisks-2.0.91 - memory leak in /usr/lib/udisks2/udisksd2013-02-12 14:59:47
456726Core systemeudevUNCONFIRMEDsys-fs/eudev-1_beta2-r2 has wrong KV_min value2013-02-11 15:02:13
456760GNOMEgnomeUNCONFIRMEDgnome-base/gvfs-1.14.2: segfault in gvfsd-obexftp when trying to browse cell phone via bluetooth2013-02-15 20:53:06
456898ApplicationscardoeUNCONFIRMEDmedia-tv/mythtv with sys-fs/udisks:2 fails to detect DVD drives2013-02-14 00:28:21
457184Applicationsmaintainer-neededUNCONFIRMEDsys-fs/archfs - 1.0.0 version bump and rename to sys-fs/rdiff-backup-fs2013-02-14 04:32:11
457810Core systemjlecUNCONFIRMEDsys-fs/aufs3-3_p20130207 with USE="inotify" and sys-kernel/hardened-sources-3.7.5 doesn't compile - 2013-02-17 09:10:21
457858Core systemwschlichUNCONFIRMEDsys-fs/inotify-tools moved from SourceForge to GitHub2013-02-17 17:03:51
458110Applicationsnet-fsUNCONFIRMEDnet-fs/curlftpfs-0.9.2 fails with special characters in dir names2013-02-19 20:19:03
458196Keywording and Stabilizationkernel-miscUNCONFIRMEDsys-fs/ecryptfs-utils-101 ppc64 keyword request2013-02-20 02:09:24
458262baselayoutrobbat2UNCONFIRMEDsys-fs/lvm2 Failed to find sysfs mount point when starting2013-02-20 16:20:15


back



Support us on Content Nation

New Packages

- as rdf newsfeed
- as rss newsfeed
- as Atom newsfeed
2025-11-30
beartype - 0.22.7
Ebuild name:

dev-python/beartype-0.22.7

Description

Unbearably fast runtime type checking in pure Python

Added to portage

2025-11-30

cpik - 0.7.4_p4-r1
Ebuild name:

dev-embedded/cpik-0.7.4_p4-r1

Description

C compiler for PIC18 devices

Added to portage

2025-11-30

evolution - 3.58.2
Ebuild name:

mail-client/evolution-3.58.2

Description

Integrated mail, addressbook and calendaring functionality

Added to portage

2025-11-30

evolution-data-server - 3.58.2
Ebuild name:

gnome-extra/evolution-data-server-3.58.2

Description

Evolution groupware backend

Added to portage

2025-11-30

evolution-ews - 3.56.2-r1
Ebuild name:

gnome-extra/evolution-ews-3.56.2-r1

Description

Evolution module for connecting to Microsoft Exchange Web Servi

Added to portage

2025-11-30

evolution-ews - 3.58.2
Ebuild name:

gnome-extra/evolution-ews-3.58.2

Description

Evolution module for connecting to Microsoft Exchange Web Services

Added to portage

2025-11-30

gast - 0.7.0
Ebuild name:

dev-python/gast-0.7.0

Description

A generic AST to represent Python2 and Python3's Abstract Syntax Tree (AST)

Added to portage

2025-11-30

gcc - 15.2.1_p20251129
Ebuild name:

sys-devel/gcc-15.2.1_p20251129

Description

The GNU Compiler Collection

Added to portage

2025-11-30

jaconv - 0.4.1
Ebuild name:

dev-python/jaconv-0.4.1

Description

Pure-Python Japanese character interconverter

Added to portage

2025-11-30

ktechlab - 0.51.0_p20251122
Ebuild name:

sci-electronics/ktechlab-0.51.0_p20251122

Description

IDE for microcontrollers and electronics

Added to portage

2025-11-30

kube-apiserver - 1.32.10
Ebuild name:

sys-cluster/kube-apiserver-1.32.10

Description

Kubernetes API server

Added to portage

2025-11-30

kube-apiserver - 1.33.6
Ebuild name:

sys-cluster/kube-apiserver-1.33.6

Description

Kubernetes API server

Added to portage

2025-11-30

kube-apiserver - 1.34.2
Ebuild name:

sys-cluster/kube-apiserver-1.34.2

Description

Kubernetes API server

Added to portage

2025-11-30

kube-controller-manager - 1.32.10
Ebuild name:

sys-cluster/kube-controller-manager-1.32.10

Description

Kubernetes Controller Manager

Added to portage

2025-11-30

kube-controller-manager - 1.33.6
Ebuild name:

sys-cluster/kube-controller-manager-1.33.6

Description

Kubernetes Controller Manager

Added to portage

2025-11-30

kube-controller-manager - 1.34.2
Ebuild name:

sys-cluster/kube-controller-manager-1.34.2

Description

Kubernetes Controller Manager

Added to portage

2025-11-30

kube-proxy - 1.32.10
Ebuild name:

sys-cluster/kube-proxy-1.32.10

Description

Kubernetes Proxy service

Added to portage

2025-11-30

kube-proxy - 1.33.6
Ebuild name:

sys-cluster/kube-proxy-1.33.6

Description

Kubernetes Proxy service

Added to portage

2025-11-30

kube-proxy - 1.34.2
Ebuild name:

sys-cluster/kube-proxy-1.34.2

Description

Kubernetes Proxy service

Added to portage

2025-11-30

kube-scheduler - 1.32.10
Ebuild name:

sys-cluster/kube-scheduler-1.32.10

Description

Kubernetes Scheduler

Added to portage

2025-11-30

kube-scheduler - 1.33.6
Ebuild name:

sys-cluster/kube-scheduler-1.33.6

Description

Kubernetes Scheduler

Added to portage

2025-11-30

kube-scheduler - 1.34.2
Ebuild name:

sys-cluster/kube-scheduler-1.34.2

Description

Kubernetes Scheduler

Added to portage

2025-11-30

kubeadm - 1.32.10
Ebuild name:

sys-cluster/kubeadm-1.32.10

Description

CLI to Easily bootstrap a secure Kubernetes cluster

Added to portage

2025-11-30

kubeadm - 1.33.6
Ebuild name:

sys-cluster/kubeadm-1.33.6

Description

CLI to Easily bootstrap a secure Kubernetes cluster

Added to portage

2025-11-30

kubeadm - 1.34.2
Ebuild name:

sys-cluster/kubeadm-1.34.2

Description

CLI to Easily bootstrap a secure Kubernetes cluster

Added to portage

2025-11-30

kubectl - 1.32.10
Ebuild name:

sys-cluster/kubectl-1.32.10

Description

CLI to run commands against Kubernetes clusters

Added to portage

2025-11-30

kubectl - 1.33.6
Ebuild name:

sys-cluster/kubectl-1.33.6

Description

CLI to run commands against Kubernetes clusters

Added to portage

2025-11-30

kubelet - 1.32.10
Ebuild name:

sys-cluster/kubelet-1.32.10

Description

Kubernetes Node Agent

Added to portage

2025-11-30

kubelet - 1.33.6
Ebuild name:

sys-cluster/kubelet-1.33.6

Description

Kubernetes Node Agent

Added to portage

2025-11-30

kubelet - 1.34.2
Ebuild name:

sys-cluster/kubelet-1.34.2

Description

Kubernetes Node Agent

Added to portage

2025-11-30

libtmux - 0.49.0
Ebuild name:

dev-python/libtmux-0.49.0

Description

Typed library that provides an ORM wrapper for tmux, a terminal multiplex

Added to portage

2025-11-30

nuitka - 2.8.9
Ebuild name:

dev-python/nuitka-2.8.9

Description

Python to native compiler

Added to portage

2025-11-30

planner - 3.42-r1
Ebuild name:

app-emacs/planner-3.42-r1

Description

Maintain a local Wiki using Emacs-friendly markup

Added to portage

2025-11-30

plz - 0.7.2
Ebuild name:

app-emacs/plz-0.7.2

Description

HTTP library with curl backend for GNU Emacs

Added to portage

2025-11-30

pyspellchecker - 0.8.4
Ebuild name:

dev-python/pyspellchecker-0.8.4

Description

Pure python spell checker based on work by Peter Norvig

Added to portage

2025-11-30

renderdoc - 1.36-r1
Ebuild name:

media-gfx/renderdoc-1.36-r1

Description

Standalone graphics debugging tool

Added to portage

2025-11-30

sphinx - 9.0.0_rc3
Ebuild name:

dev-python/sphinx-9.0.0_rc3

Description

Python documentation generator

Added to portage

2025-11-30

stdio-mgr - 1.0.1.1
Ebuild name:

dev-python/stdio-mgr-1.0.1.1

Description

Context manager for mocking/wrapping stdin/stdout/stderr

Added to portage

2025-11-30

systemd - 259_rc2
Ebuild name:

sys-apps/systemd-259_rc2

Description

System and service manager for Linux

Added to portage

2025-11-30

types-psutil - 7.1.3.20251130
Ebuild name:

dev-python/types-psutil-7.1.3.20251130

Description

Typing stubs for psutil

Added to portage

2025-11-30

vivaldi - 7.7.3851.56
Ebuild name:

www-client/vivaldi-7.7.3851.56

Description

A browser for our friends

Added to portage

2025-11-30

vivaldi-snapshot - 7.8.3879.3
Ebuild name:

www-client/vivaldi-snapshot-7.8.3879.3

Description

A browser for our friends

Added to portage

2025-11-30

2025-11-29
aespipe - 2.4j
Ebuild name:

app-crypt/aespipe-2.4j

Description

Encrypts data from stdin to stdout

Added to portage

2025-11-29

ansible - 12.2.0
Ebuild name:

app-admin/ansible-12.2.0

Description

Model-driven deployment, config management, and command execution framewor

Added to portage

2025-11-29

ansible - 13.0.0
Ebuild name:

app-admin/ansible-13.0.0

Description

Model-driven deployment, config management, and command execution framewor

Added to portage

2025-11-29

ansible-core - 2.20.0
Ebuild name:

app-admin/ansible-core-2.20.0

Description

Model-driven deployment, config management, and command execution fra

Added to portage

2025-11-29

anyio - 4.12.0
Ebuild name:

dev-python/anyio-4.12.0

Description

Compatibility layer for multiple asynchronous event loop implementations

Added to portage

2025-11-29

atpublic - 7.0.0
Ebuild name:

dev-python/atpublic-7.0.0

Description

A decorator to populate __all__ and the module globals

Added to portage

2025-11-29

autoconf - 2.72-r5
Ebuild name:

dev-build/autoconf-2.72-r5

Description

Used to create autoconfiguration files

Added to portage

2025-11-29

backports-zstd - 1.1.0
Ebuild name:

dev-python/backports-zstd-1.1.0

Description

Backport of PEP-784 adding Zstandard to the standard library

Added to portage

2025-11-29

dropbox - 237.4.5655
Ebuild name:

net-misc/dropbox-237.4.5655

Description

Dropbox daemon (pretends to be GUI-less)

Added to portage

2025-11-29

ell - 0.81
Ebuild name:

dev-libs/ell-0.81

Description

Embedded Linux Library provides core, low-level functionality for system daemons

Added to portage

2025-11-29

flufl-lock - 9.0.0
Ebuild name:

dev-python/flufl-lock-9.0.0

Description

NFS-safe file locking with timeouts for POSIX systems

Added to portage

2025-11-29

fonttools - 4.61.0
Ebuild name:

dev-python/fonttools-4.61.0

Description

Library for manipulating TrueType, OpenType, AFM and Type1 fonts

Added to portage

2025-11-29

fotocx - 25.5
Ebuild name:

media-gfx/fotocx-25.5

Description

Program for improving image files made with a digital camera

Added to portage

2025-11-29

gcc - 13.4.1_p20251127
Ebuild name:

sys-devel/gcc-13.4.1_p20251127

Description

The GNU Compiler Collection

Added to portage

2025-11-29

gcc - 14.3.1_p20251128
Ebuild name:

sys-devel/gcc-14.3.1_p20251128

Description

The GNU Compiler Collection

Added to portage

2025-11-29

hplip - 3.25.8
Ebuild name:

net-print/hplip-3.25.8

Description

HP Linux Imaging and Printing - Print, scan, fax drivers and service tools

Added to portage

2025-11-29

htslib - 1.22.1
Ebuild name:

sci-libs/htslib-1.22.1

Description

C library for high-throughput sequencing data formats

Added to portage

2025-11-29

incremental - 24.11.0
Ebuild name:

dev-python/incremental-24.11.0

Description

Incremental is a small library that versions your Python projects

Added to portage

2025-11-29

knot - 3.4.9
Ebuild name:

net-dns/knot-3.4.9

Description

High-performance authoritative-only DNS server

Added to portage

2025-11-29

knot - 3.5.2
Ebuild name:

net-dns/knot-3.5.2

Description

High-performance authoritative-only DNS server

Added to portage

2025-11-29

libimobiledevice - 1.3.0_p20240201-r1
Ebuild name:

app-pda/libimobiledevice-1.3.0_p20240201-r1

Description

Support library to communicate with Apple iPhone/iPod T

Added to portage

2025-11-29

librt - 0.6.2
Ebuild name:

dev-python/librt-0.6.2

Description

Mypyc runtime library

Added to portage

2025-11-29

librt - 0.6.3
Ebuild name:

dev-python/librt-0.6.3

Description

Mypyc runtime library

Added to portage

2025-11-29

libtmux - 0.48.0_p0
Ebuild name:

dev-python/libtmux-0.48.0_p0

Description

Typed library that provides an ORM wrapper for tmux, a terminal multip

Added to portage

2025-11-29

libtsm - 4.3.0
Ebuild name:

dev-libs/libtsm-4.3.0

Description

Terminal Emulator State Machine

Added to portage

2025-11-29

loop-aes - 3.8g
Ebuild name:

sys-fs/loop-aes-3.8g

Description

Linux kernel module to encrypt disk partitions with AES cipher

Added to portage

2025-11-29

loop-aes-losetup - 2.41.1
Ebuild name:

app-crypt/loop-aes-losetup-2.41.1

Description

Loop-AES losetup utility

Added to portage

2025-11-29

mac - 11.88
Ebuild name:

media-sound/mac-11.88

Description

Monkey's Audio Codecs

Added to portage

2025-11-29

marksman - 2025.11.25
Ebuild name:

dev-util/marksman-2025.11.25

Description

LSP language server for editing Markdown files

Added to portage

2025-11-29

memtest86+ - 8.00
Ebuild name:

sys-apps/memtest86+-8.00

Description

Memory tester based on PCMemTest

Added to portage

2025-11-29

mypy - 1.19.0
Ebuild name:

dev-python/mypy-1.19.0

Description

Optional static typing for Python

Added to portage

2025-11-29

nbsphinx - 0.9.8
Ebuild name:

dev-python/nbsphinx-0.9.8

Description

Jupyter Notebook Tools for Sphinx

Added to portage

2025-11-29

nginx - 1.28.0-r4
Ebuild name:

www-servers/nginx-1.28.0-r4

Description

Added to portage

2025-11-29

nginx - 1.29.3-r2
Ebuild name:

www-servers/nginx-1.29.3-r2

Description

Added to portage

2025-11-29

plz - 0.9.1
Ebuild name:

app-emacs/plz-0.9.1

Description

HTTP library with curl backend for GNU Emacs

Added to portage

2025-11-29

pycpio - 1.5.6
Ebuild name:

dev-python/pycpio-1.5.6

Description

Python CPIO library

Added to portage

2025-11-29

pytest-check - 2.6.2
Ebuild name:

dev-python/pytest-check-2.6.2

Description

pytest plugin that allows multiple failures per test

Added to portage

2025-11-29

rdflib - 7.5.0
Ebuild name:

dev-python/rdflib-7.5.0

Description

RDF library containing a triple store and parser/serializer

Added to portage

2025-11-29

redis-knot - 3.5.2
Ebuild name:

net-dns/redis-knot-3.5.2

Description

Redis module for Knot DNS

Added to portage

2025-11-29

samtools - 1.22.1
Ebuild name:

sci-biology/samtools-1.22.1

Description

Utilities for analysing and manipulating the SAM/BAM alignment formats

Added to portage

2025-11-29

signal-desktop-bin - 7.80.1
Ebuild name:

net-im/signal-desktop-bin-7.80.1

Description

Allows you to send and receive messages of Signal Messenger on you

Added to portage

2025-11-29

sphinx - 9.0.0_rc2
Ebuild name:

dev-python/sphinx-9.0.0_rc2

Description

Python documentation generator

Added to portage

2025-11-29

sphinx-prompt - 1.10.2
Ebuild name:

dev-python/sphinx-prompt-1.10.2

Description

Sphinx directive to add unselectable prompt

Added to portage

2025-11-29

sphinxcontrib-spelling - 8.0.2
Ebuild name:

dev-python/sphinxcontrib-spelling-8.0.2

Description

Sphinx spelling extension

Added to portage

2025-11-29

sqlparse - 0.5.4
Ebuild name:

dev-python/sqlparse-0.5.4

Description

A non-validating SQL parser module for Python

Added to portage

2025-11-29

translate-toolkit - 3.17.2
Ebuild name:

dev-python/translate-toolkit-3.17.2

Description

Toolkit to convert between many translation formats

Added to portage

2025-11-29

types-psutil - 7.1.3.20251129
Ebuild name:

dev-python/types-psutil-7.1.3.20251129

Description

Typing stubs for psutil

Added to portage

2025-11-29

unicode-segmentation-rs - 0.2.0
Ebuild name:

dev-python/unicode-segmentation-rs-0.2.0

Description

Unicode segmentation and width for Python using Rust

Added to portage

2025-11-29

werkzeug - 3.1.4
Ebuild name:

dev-python/werkzeug-3.1.4

Description

Collection of various utilities for WSGI applications

Added to portage

2025-11-29

wine-staging - 10.20
Ebuild name:

app-emulation/wine-staging-10.20

Description

Free implementation of Windows(tm) on Unix, with Wine-Staging patc

Added to portage

2025-11-29

wine-vanilla - 10.20
Ebuild name:

app-emulation/wine-vanilla-10.20

Description

Free implementation of Windows(tm) on Unix, without external patch

Added to portage

2025-11-29

rdf newsfeed | rss newsfeed | Atom newsfeed
Copyright 2004-2025 Sascha Nitsch Unternehmensberatung GmbH
- Copyright and legal notices -
Time to create this page: 16.3 ms