from small one page howto to huge articles all in one place
 

search text in:




Other .linuxhowtos.org sites: www.linuxhowtos.org
toolsntoys.linuxhowtos.org



Last additions:
How to make X listen on port 6000

How to make X listen on port 6000

words:

34

views:

52532

userrating:

average rating: 1.5 (4 votes) (1=very good 6=terrible)


May, 25th 2007:
April, 26th 2007:
Apr, 10th. 2007:
Druckversion . pdf icon
You are here: Portage


Details of dev-haskell/fail:

Description: Forward-compatible MonadFail class
Homepage:
https://prime.haskell.org/wiki/Libraries/Proposals/MonadFail

available versions:

releasesalphaamd64armhppaia64mipsppcppc64ppc macoss390shsparcx86USE-Flagsdependenciesebuild warnings
fail-4.9.0.0 -+----------+
show
show
Legend:
+ stable
~ testing
- not available
some ebuild warning depend on specific use-flags or architectures, all ebuild-warnings are shown.

Known bugs:
bug IDcomponentassigned tostatusdescriptionlast change
444678FreeBSDbsdUNCONFIRMEDsys-devel/gcc-4.7.2 -- build fails on G/FBSD 9.1 with USE=cxx2012-12-07 11:06:19
386037DevelopmentqtUNCONFIRMEDapp-crypt/qca-ossl-2.0.0_beta3-r2: fails to build x86-abi with portage-multilib enabled2013-01-12 22:18:36
407071ApplicationszerochaosUNCONFIRMEDnet-analyzer/wireshark-1.6.4[lua] fails to run after upgrade to dev-lang/lua-5.2.0 and will not rebu2013-02-16 13:18:51
455122EbuildszerochaosUNCONFIRMEDnet-analyzer/wireshark-1.8.5{,-r1} emerge fails - Can't locate object method "recurse" via package 2013-02-16 13:32:31
458478LibraryyngwinUNCONFIRMEDx11-libs/cairo-9999 failed because cairo-1.10.2-qt-surface.patch outdated2013-02-20 21:19:46
453964ApplicationsyngwinUNCONFIRMEDapp-admin/eselect-lcdfilter fails to remove symlink /etc/env.d/99lcdfilter@ upon removal.2013-01-26 15:34:37
452578DevelopmentyamakuzureUNCONFIRMED[seden overlay] dev-util/eclipse-sdk-3.7.1-r9 fails to start when 2013-01-17 09:24:25
455098ApplicationsxmwUNCONFIRMEDx11-wm/xpra-0.8.0 tries to remove non-existing files and fails2013-02-05 08:03:17
442080Core systemxmwUNCONFIRMEDsys-power/suspend-0.8-r1 fails to suspend to disc (ussusp)2012-11-06 21:02:35
450452DevelopmentxfceUNCONFIRMED[xfce-dev overlay] xfce4-dev-tools-9999.ebuild -- portage patch fail2013-01-09 21:45:53
457588ApplicationsxboxUNCONFIRMEDmedia-tv/xbmc-11.0 with a PaX kernel - xbmc.bin: LLVM ERROR: Allocation failed when allocating new m2013-02-15 15:39:36
373281ApplicationsxemacsUNCONFIRMEDapp-editors/xemacs-21.5.31 fails to emerge, because check-features.el can not be loaded2013-02-17 11:58:08
456028Ebuildsx11UNCONFIRMED[x11 overlay] media-libs/mesa-9999 ld fails after EGIT_COMMIT=4e42e569dd56432013-02-18 12:59:25
456220Applicationsx11UNCONFIRMEDx11-base/xorg-server on hardened - X exits fatally upon failure to enable sys_iopl2013-02-12 14:40:15
444964Applicationsx11UNCONFIRMEDx11-drivers/xf86-video-ati-7.0.0 with x11-base/xorg-server-1.13 - second X server fails to start on 2012-12-15 18:49:10
444064Ebuildsx11UNCONFIRMEDvirtual/glu - sys-apps/paludis' cave fails to resolve a usable depset2012-11-20 18:00:08
437590Libraryx11UNCONFIRMEDmedia-libs/mesa-9.0_pre20120918: libGL error: failed to load driver: nouveau with a ATI graphic cont2012-10-24 20:57:35
428650Libraryx11UNCONFIRMEDmedia-libs/mesa-8.1_rc1_pre20120724 - libGL error: failed to authenticate magic 5 // libGL error: fa2012-11-18 08:31:42
403013Applicationsx11UNCONFIRMEDmedia-libs/mesa-7.11.2 fails to build with sys-devel/llvm-99992012-02-11 03:45:34
386467Applicationsx11UNCONFIRMEDmedia-libs/mesa-7.11 causes X to fail to start2011-10-11 00:34:59
386707Gamesx11UNCONFIRMEDx11-libs/libdrm-2.4.26: assertion fails at intel_bufmgr_gem.c:13612011-10-18 05:30:06
388479Unspecifiedx11UNCONFIRMEDxorg-server-1.9.5-r1 fails to build when docbook-xml-dtd:4.3 is missing2011-10-25 21:12:48
385219Applicationsx11UNCONFIRMED[x11 overlay] x11-drivers/xf86-input-synaptics-9999 compile fails2011-10-02 18:49:08
371841Libraryx11UNCONFIRMEDx11-libs/libdrm-2.4.25 assertion failure triggered by sci-astronomy/stellarium-0.10.62011-06-17 09:33:02
377395Libraryx11UNCONFIRMED[drm:radeon_crtc_page_flip] *ERROR* failed to reserve new rbo buffer before flip2011-08-03 08:59:16
370001EbuildswrobelUNCONFIRMED[kolab overlay] ERROR: net-mail/kolab-resource-handlers-2.1 failed (depend phase): * php-lib.ecla2011-12-31 17:37:47
444368Applicationsweb-appsUNCONFIRMEDwww-apps/lxr fails with current dev-db/mysql. Bump version to 1.0.0?2012-11-23 16:04:59
438086Applicationsweb-appsUNCONFIRMEDwww-apps/gallery-2.3.1 - "Begin Installation" fails with "The requested URL /gallery/install/
<
2012-10-12 16:43:46
442958DevelopmentvoyageurUNCONFIRMEDsys-devel/llvm fails to cross compile2012-11-13 16:20:28
427350ApplicationsvoyageurUNCONFIRMED=dev-lang/perl-5.16.0 fails tests with clang-3.1-r42012-07-21 14:07:00
427352ApplicationsvoyageurUNCONFIRMED=dev-libs/klibc-1.5.25 fails to build with clang-3.1-r42012-07-21 14:07:01
427348ApplicationsvoyageurUNCONFIRMED=dev-db/sqlite-3.7.13 fails test with clang-3.1-r42012-07-21 14:07:01
427342ApplicationsvoyageurUNCONFIRMEDdev-libs/apr fails to build with clang-3.1-r42012-12-29 16:58:30
427316Core systemvoyageurUNCONFIRMED=sys-apps/findutils-4.5.10-r1 fails tests with clang-3.1-r42012-07-21 14:07:00
427318ApplicationsvoyageurUNCONFIRMEDdev-libs/popt fails tests with clang-3.1-r42012-10-09 15:26:37
427322Core systemvoyageurUNCONFIRMEDsys-libs/gpm fails to build with clang-3.1-r42012-07-21 14:07:00
427304ApplicationsvoyageurUNCONFIRMED=dev-libs/mpfr-3.1.1 fails tests with clang-3.1-r42012-10-08 15:16:38
427310ApplicationsvoyageurUNCONFIRMED=dev-libs/ppl-0.12.1 fails tests with clang-3.1-r42012-07-25 14:12:12
427314Core systemvoyageurUNCONFIRMEDsys-apps/sed fails test with clang-3.1-r42012-07-21 14:07:01
393381EbuildsvoyageurUNCONFIRMEDx11-libs/qt-webkit-4.7.4 fails to compile with sys-devel/dragonegg-3.02012-09-28 13:05:52
393383EbuildsvoyageurUNCONFIRMEDsys-devel/llvm-3.0 fails to compile with sys-devel/dragonegg-3.02012-09-28 13:05:52
393385EbuildsvoyageurUNCONFIRMEDmedia-libs/phonon-vlc-0.4.1 fails to compile with sys-devel/dragonegg-3.02012-09-28 13:05:51
393389KDEvoyageurUNCONFIRMED[kde overlay] kde-base/kdelibs-9999 fails to compile with sys-devel/dragonegg-3.02012-09-28 13:05:51
393391KDEvoyageurUNCONFIRMED[kde overlay] kde-base/katepart-9999 fails to compile with sys-devel/dragonegg-3.02012-09-28 13:05:52
393489EbuildsvoyageurUNCONFIRMEDapp-office/libreoffice-3.5.0.0 fails to compile with sys-devel/dragonegg-3.02012-09-28 13:05:51
416691KDEvoyageurUNCONFIRMEDkde-base/nepomuk-4.8.3 fails with undefined references (dragonegg problem)2012-09-28 13:05:52
393379EbuildsvoyageurUNCONFIRMEDx11-libs/qt-qt3support-4.7.4 fails to compile with sys-devel/dragonegg-3.02012-09-28 13:05:51
393373UnspecifiedvoyageurUNCONFIRMEDx11-libs/qt-gui-4.7.4-r1 fails to compile with sys-devel/dragonegg-3.02012-09-28 13:05:52
393377UnspecifiedvoyageurUNCONFIRMEDx11-libs/pixman-0.24.0 fails to compile with sys-devel/dragonegg-3.02012-09-28 13:05:51
386843DevelopmentvoyageurUNCONFIRMEDsys-devel/clang-2.9-r1 fails test PCH/cxx-typeid.cpp2011-10-16 03:36:44
444380ApplicationsvoipUNCONFIRMEDnet-voip/ekiga-3.2.7 - Fails src_test for LINGUAS=en_GB - Document ./en_GB/ekiga.xml does not valida2012-11-22 22:49:37
442628UnspecifiedvoipUNCONFIRMEDnet-voip/ekiga-3.9.90 - Fails to build, ld: cannot find -lQtCore2012-12-12 02:27:31
387283ApplicationsvoipUNCONFIRMEDFailed to emerge net-voip/linphone-3.3.22012-10-23 16:24:00
412695ApplicationsvirtualizationUNCONFIRMED[virtualization overlay] app-emulation/xen-tools-9999 fails to unpack2012-04-21 17:28:46
457564ApplicationsvimUNCONFIRMEDapp-editors/vim-core-7.3.762 fails with ncurses[tinfo]2013-02-14 18:18:53
417921ApplicationsvimUNCONFIRMEDapp-editors/vim - bash completion fails with paths containing spaces2012-05-28 11:50:58
455276DevelopmentvapierUNCONFIRMEDdev-cpp/gmock-1.6.9 with python3 fails to execute test suite2013-02-05 11:28:28
457570ApplicationstoveUNCONFIRMEDapp-shells/zsh fails to compile with ncurses[tinfo]2013-02-14 19:59:26
398089ApplicationstristanUNCONFIRMEDx11-misc/revelation-0.4.11-r2 USE=applet - configure:13842: error: failed to find module gnomeapplet2012-01-10 00:03:01
434574Toolstools-portageUNCONFIRMEDapp-portage/genlop: bashcomp script fails when make.conf is in /etc/portage/2012-12-13 16:13:07
435110Core systemtoolchainUNCONFIRMEDsys-devel/binutils: ar mishandles 4GB files (causing net-libs/webkit-gtk build to fail with debug fl2013-01-01 20:56:38
436636JavatoolchainUNCONFIRMEDsys-devel/gcc-{4.5,4.6,4.7?}: gcj fails to compile java source code on ia64 (hardened) - Exception i2012-12-14 08:15:05
451922Core systemtoolchainUNCONFIRMEDsys-libs/glibc-2.15-r3 installs despite test failures2013-01-16 02:40:16
453100Core systemtoolchainUNCONFIRMEDsys-devel/binutils-2.23.1: 43 unexpected failures2013-01-21 11:57:21
453514Core systemtoolchainUNCONFIRMEDsys-libs/glibc-2.15-r3: nscd initscript fails while daemon starts2013-01-22 22:51:57
448024Core systemtoolchainUNCONFIRMEDdev-libs/cloog-ppl-0.15.10 fails with >=dev-libs/ppl-1.02013-01-07 00:30:36
447708Core systemtoolchainUNCONFIRMEDsys-devel/gcc-4.7.2 fails to crosscompile for mingw64: options.c:952:3: error: ‘HAVE_GAS_ALIGNED_COM2013-02-18 16:35:04
445132Core systemtoolchainUNCONFIRMEDsys-devel/gdb-7.5: build fails w/-ftracer on amd64: linux-x86-low.c:2939: Error: symbol 'start_i386_2012-11-29 19:36:23
433056Core systemtoolchainUNCONFIRMEDsys-devel/gcc-4.7.1 fails to crosscompile with cross-powerpc64-unknown-linux-gnu/gcc-4.6.3: cc1: err2012-10-03 01:27:13
432300Core systemtoolchainUNCONFIRMEDsys-devel/gcc-4.5.3-r2 fails to crosscompile: gcc-4.5.3/libstdc++-v3/src/atomic.cc:91:62: error: inv2012-08-22 14:43:31
426306Core systemtoolchainUNCONFIRMEDsys-libs/glibc-2.14.1-r3: tests failed2012-11-10 09:00:26
391793Core systemtoolchainUNCONFIRMEDsys-devel/binutils-2.22 fails tests2013-01-15 14:18:56
393159Core systemtoolchainUNCONFIRMEDsys-libs/glibc-2.13-r4: fails tests2012-08-14 16:22:49
395481Core systemtoolchainUNCONFIRMEDsys-libs/glibc-2.14.1-r1: stdlib/tst-putenv.out test failure2012-08-14 16:23:11
395491Core systemtoolchainUNCONFIRMEDdev-util/dejagnu-1.5 failed (test phase)2013-01-23 05:24:15
407077Core systemtoolchainUNCONFIRMEDsys-devel/autogen-5.12: Fails cond.test.2012-03-06 17:01:37
409041Core systemtoolchainUNCONFIRMEDcross-x86_64-linux-uclibc/gcc-4.6.2: fails on gcc-stage1 - work/gcc-4.6.2/libgcc/generic-morestack-t2012-03-20 21:02:01
418209Core systemtoolchainUNCONFIRMEDcross-armv7m-none-eabi/gcc-4.5.3 stage1 cross-compiler fails2012-11-06 07:23:57
420065LibrarytommyUNCONFIRMEDsci-libs/naga-2.1 fails to connect to server (http://naga.googlecode.com) behind a proxy using subv2013-01-20 10:45:59
417927ApplicationstexUNCONFIRMEDdev-tex/latexmk - bash completion fails with paths containing spaces2012-05-28 11:51:57
394957UnspecifiedtexUNCONFIRMED=dev-tex/chktex-1.6.4 fails tests2012-07-07 13:07:17
379147UnspecifiedtcltkUNCONFIRMEDdev-tcltk/iwidgets-4.0.1-r3 fails to configure with et_EE locale2011-08-15 01:54:59
438464UnspecifiedsysadminUNCONFIRMEDnet-analyzer/nagios-3.3.1: apache-2.4.3 fails to start with Syntax error on line 6 of /etc/apache2/2012-12-14 16:11:32
442092ApplicationsspingUNCONFIRMEDmedia-gfx/gimp-9999 - Portage patch failed to apply (ltmain.sh version 2.4.2)!2012-11-10 00:24:49
448112ApplicationsspingUNCONFIRMEDmedia-gfx/gimp-2.8.2-r1 has several test failures.2012-12-24 00:28:37
410553UnspecifiedswaponUNCONFIRMEDx11-drivers/xf86-video-virtualbox / app-emulation/virtualbox-guest-additions fail to cross-compile2012-04-03 15:23:22
457560ApplicationssoundUNCONFIRMEDmedia-sound/lame-3.99.5 fails with ncurses[tinfo]2013-02-14 18:18:05
443600ApplicationssoundUNCONFIRMEDmedia-libs/libsndfile-1.0.25 - Fails test with SyntaxError: invalid syntax in binheader_writef_check2012-11-17 18:45:12
442614EbuildssoundUNCONFIRMEDmedia-sound/trommler-3.8 - Fails when python3 is set.2012-11-11 11:10:35
434528ApplicationssoundUNCONFIRMEDmedia-sound/dagrab fails with buffer overflow detected when using cddb2012-09-10 11:44:45
418185ApplicationssoundUNCONFIRMEDmedia-sound/xmp-3.5.0 fails to play LZMA compressed module2012-06-03 13:36:25
395817ApplicationssoundUNCONFIRMEDmedia-libs/libsndfile-1.0.25: fails tests with python-32012-01-18 16:03:11
454062Applicationsshell-toolsUNCONFIRMEDapp-misc/byobu-5.27 - create window failed: /bin/bash no such file or directory2013-02-06 16:13:05
454478SELinuxselinuxUNCONFIRMEDsys-apps/busybox-1.20.2 fails to merge on selinux profile with USE="static"2013-02-17 09:37:40
424041ApplicationssgmlUNCONFIRMEDapp-text/sgml-common-0.6.3-r5 fails with automake-1.12 - mkdir -p2012-10-13 18:56:21
417717Unspecifiedshell-toolsUNCONFIRMED[Tracker] bash completion files that fail with paths containing spaces2012-05-28 10:15:02
417925Applicationsshell-toolsUNCONFIRMEDapp-shells/gentoo-bashcomp - bash completion fails with paths containing spaces2012-05-28 11:51:25
417945Applicationsshell-toolsUNCONFIRMEDapp-misc/devtodo - bash completion fails with paths containing spaces2012-05-28 12:08:16
418567Applicationsshell-toolsUNCONFIRMEDapp-misc/byobu-5.18: create session failed: /usr/bin/byobu-shell: Too many open files2013-02-06 16:13:27
427378Applicationssci-geosciencesUNCONFIRMEDsci-libs/gdal-1.9.1 gdalinfo fails to recognize classic netcdf (3) files2012-12-26 13:37:25
392061Ebuildssci-chemistryUNCONFIRMEDsci-chemistry/platon-20110126 checksum failure - version bump ?2011-11-29 15:58:48
405035Applicationssci-biologyUNCONFIRMED[science overlay] sci-biology/embassy-6.3.1 fails to emerge because of dependency on embassy-domaina2012-02-20 14:33:45
442270Ebuildssci-astronomyUNCONFIRMEDsci-astronomy/aatm-0.4.3.1: fails to build2012-12-06 23:52:28
368473Applicationssci-biologyUNCONFIRMEDsci-biology/hmmer-3.0 fails to build with "mpi.c:27:23: error: impl_dummy.: No such file or director2011-06-21 09:31:43
442838EbuildssciUNCONFIRMEDsci-libs/netcdf-cxx-4.2: fails tests2012-11-13 06:16:03
447502LibrarysciUNCONFIRMEDdev-python/numpy-1.6.2 - FAIL: test_pareto (test_random.TestRandomDist)2013-01-05 08:15:18
447974ApplicationssciUNCONFIRMED[science overlay] sci-libs/gmsh-2.5.0-r1 fails to build2012-12-20 17:51:40
448110DevelopmentsciUNCONFIRMEDdev-python/rpy-2.2.6-r1 fails test testInterruptR - AssertionError: True is not false2013-01-23 17:03:53
449232ApplicationssciUNCONFIRMED[science overlay] sci-libs/cholmod-2.0.1: pkg-config fails to find lapack libraries installed from s2013-01-29 19:26:55
433647ApplicationssciUNCONFIRMEDsci-libs/netcdf-4.1.3 fails with -l-L/usr/lib/gcc/x86_64-pc...2012-10-08 19:14:17
424461EbuildssciUNCONFIRMED[science overlay] app-portage/g-octave-9999 fails running with ImportError: cannot import name Confi2012-07-02 10:57:20
427028ApplicationssciUNCONFIRMED[science overlay] media-gfx/librecad-9999 fails in install phase again2012-07-19 15:39:20
423399EbuildssciUNCONFIRMEDsci-libs/parmetis-3.2.0: fails tests2012-09-25 10:57:08
413515DevelopmentsciUNCONFIRMEDsci-libs/scipy - import failures due to missing symbols in clapack.so2013-02-07 13:44:35
413041ApplicationssciUNCONFIRMEDsci-misc/boinc fails(?) when ntpdate (/etc/init.d/ntp-client) is used to abruptly change the system 2012-04-24 20:13:47
396437JavasciUNCONFIRMED[science overlay] dev-java/hdf-java-2.7 fetch of hdf-java-2.7-src.tar fails2012-04-11 01:14:55
396657ApplicationssciUNCONFIRMED[science-overlay] dev-perl/Bio-BigFile-1.06 fails to emerge due to missing jkweb.a2012-02-11 16:02:44
396065ApplicationssciUNCONFIRMED[science-overlay] embassy-topo fails to emerge due to wrong filesize2012-02-20 14:33:52
396091ApplicationssciUNCONFIRMED[science-overlay] dev-perl/Bio-BigFile-1.06 fails to emerge because of relocation problem2012-01-01 08:50:47
396063ApplicationssciUNCONFIRMED[science-overlay] embassy-mse fails to emerge due to wrong filesize2012-02-20 14:33:56
396057ApplicationssciUNCONFIRMED[science-overlay] embassy-phylipnew-3.69 fails to emerge due to wrong filesize2012-02-20 14:34:00
395969EbuildssciUNCONFIRMED[science-overlay] embassy-vienna-1.7.2-r2 fails to fetch embassy-vienna-1.7.2-r2.tar.gz2012-02-20 14:34:03
395901EbuildssciUNCONFIRMED[science-overlay] embassy-hmmer fails to fetch embassy-hmmer-2.3.2-r4.tar.gz2012-02-20 14:34:18
395905EbuildssciUNCONFIRMED[science-overlay] embassy-esim4-1.0.0-r7 fails to fetch embassy-esim4-1.0.0-r7.tar.gz2012-02-20 14:34:14
395907EbuildssciUNCONFIRMED[science-overlay] embassy-emnu-1.05-r7 fails to fetch embassy-emnu-1.05-r7.tar.gz2012-02-20 14:34:11
395967EbuildssciUNCONFIRMED[science-overlay] embassy-structure-0.1.0-r5 fails to fetch embassy-structure-0.1.0-r5.tar.gz2012-02-20 14:34:07
395889EbuildssciUNCONFIRMED[science-overlay] embassy-domalign-0.1.0-r5 fails to fetch embassy-domalign-0.1.0-r5.tar.gz2012-02-20 14:34:34
395891ApplicationssciUNCONFIRMED[science overlay] sci-biology/embassy-memenew-4.0.0-r1 fails to fetch embassy-memenew-4.0.0-r1.tar.g2012-02-20 14:34:30
395895EbuildssciUNCONFIRMED[science-overlay] embassy-domsearch-0.1.0-r5 fails to fetch embassy-domsearch-0.1.0-r5.tar.gz2012-02-20 14:34:26
395899EbuildssciUNCONFIRMED[science-overlay] embassy-signature-0.1.0-r5 fails to fetch embassy-signature-0.1.0-r5.tar.gz2012-02-20 14:34:23
386269UnspecifiedsciUNCONFIRMEDsci-libs/scipy-0.9.0-r2 fails to emerge due to missing blas2012-06-03 10:35:59
392243JavasciUNCONFIRMED[science overlay] dev-java/jlatexmath-0.9.4 fails to emerge because of ACCESS VIOLATION at /root/.ja2011-12-04 02:58:03
381595EbuildssciUNCONFIRMEDsci-libs/mkl-10.0.5.025 tarball verification fails2011-09-03 10:33:04
372995LibrarysciUNCONFIRMED[sci-overlay] sci-misc/salome-yacs-5.1.4 fails to build with swig 2.0.22011-07-08 18:42:44
427346ApplicationsschemeUNCONFIRMED=dev-scheme/guile-1.8.8-r1 fails to build with clang-3.1-r42013-02-02 12:44:30
366975ApplicationssciUNCONFIRMED[science overlay] sci-biology/gbrowse-2.33 fails to install, due to ACCESS VIOLATION2012-01-04 08:07:11
421665SandboxsandboxUNCONFIRMEDsys-apps/busybox-1.20.1 fails with sandboxing enabled2012-11-26 17:24:29
458022Core systemryaoUNCONFIRMEDsys-block/iscsitarget-1.4.20.2 - 1 out of 1 hunk FAILED -- saving rejects to file kernel/conn.c.rej2013-02-17 19:02:08
448780DevelopmentrubyUNCONFIRMED=dev-ruby/webmock-1.7.4 - Many tests failed.2013-02-20 06:24:05
417709UnspecifiedrubyUNCONFIRMEDdev-ruby/ruby-opengl-0.60.1-r2 fails configure with ruby1.9 - cannot load such file -- mkrf2012-05-27 06:43:59
423589EbuildsrubyUNCONFIRMEDdev-ruby/rdoc-3.12: fails to build (racc fails to load properly)2012-06-27 04:42:59
417033UnspecifiedrubyUNCONFIRMEDdev-ruby/childprocess-0.3.2 fails to emerge due to missing rspec/core/rake_task2012-05-25 08:09:51
458262baselayoutrobbat2UNCONFIRMEDsys-fs/lvm2 Failed to find sysfs mount point when starting2013-02-20 16:20:15
451478Core systemrobbat2UNCONFIRMEDsys-fs/lvm2 - /etc/init.d/lvm should support multiple volume groups - Command failed with status cod2013-01-31 02:20:00
448354Core systemrobbat2UNCONFIRMEDsys-fs/lvm2-2.02.97-r1 fails to crosscompile: configure: error: thin_check not found in path2013-01-19 16:12:30
448238Core systemrobbat2UNCONFIRMED[PATCH] 2012-12-24 12:42:06
437714Core systemrobbat2UNCONFIRMEDsys-fs/lvm2-2.02.97 init stop fails to deactivated lvs and vgs on shutdown2013-02-04 12:49:21
439614GNOMErobbat2UNCONFIRMEDsys-apps/vbetool-1.1: Failed Running automake2013-02-06 22:06:33
434110Applicationsrobbat2UNCONFIRMEDapp-admin/cancd-0.1.0-r2: netconsole init script fails to start due to wrong ifconfig path2012-09-06 14:20:31
421435Unspecifiedrobbat2UNCONFIRMEDg-cpan fails to install perl-gcpan/Cv-0.12 after perl to 5.16.0 upgrade to and opencv upgrade to 2.42012-06-29 16:39:10
421741Developmentrobbat2UNCONFIRMEDdev-vcs/git-1.7.3.4-r1: test t7508-status.sh failed with FEATURES="sandbox -userpriv"2012-06-19 15:11:50
409011Applicationsrobbat2UNCONFIRMEDapp-portage/g-cpan-0.16.4 'g-cpan -u' fails with Invalid ebuild name: /var/lib/cpan/perl-gcpan/Best/2012-03-23 07:38:06
413979Core systemrobbat2UNCONFIRMEDlvm2create_initrd in sys-fs/lvm2-2.02.95-r1 fails to setup $LVM variable properly in initrd2013-01-17 23:44:45
405265Developmentrobbat2UNCONFIRMED"git svn clone/fetch/rebase" fail with dev-vcs/subversion[webdav-serf]2012-03-15 13:31:46
402645Developmentrobbat2UNCONFIRMEDapp-portage/g-cpan-0.16.4 fails to install Spreadsheet::XLSX due to "[in]correct package syntax"2012-02-13 21:18:27
368001Applicationsrobbat2UNCONFIRMEDapp-portage/g-cpan fails to install Sys::Filesystem2011-05-19 16:12:27
373795Applicationsrobbat2UNCONFIRMEDapp-text/convmv-1.10 fails tests2012-11-07 11:19:40
449352Gamesrich0UNCONFIRMEDgames-rpg/eternal-lands Assertion `self' failed (runtime error)2013-01-03 00:24:17
458186ApplicationsreavertmUNCONFIRMED=dev-util/ddd-3.3.12-r3: fails to compile with ncurses[tinfo]2013-02-19 20:20:58
425220InstallCDreleaseUNCONFIRMEDinstall-powerpc-minimal-20120624.iso fails to boot on Power Mac G5 late 2005 2x2Ghz2012-12-24 09:36:09
435266EbuildsrafaelmartinsUNCONFIRMEDdev-vcs/mercurial-server-1.2 refresh-auth fails with a syntax error2012-09-17 11:51:10
373891EbuildsramerethUNCONFIRMEDnet-misc/stunnel build fails: #error OpenSSL library compiled without thread support2012-12-25 04:27:10
399843UnspecifiedrafaelmartinsUNCONFIRMEDg-octave/optiminterp-0.3.2 fails to install package database2012-01-25 13:24:50
373473UnspecifiedrafaelmartinsUNCONFIRMEDg-octave/optiminterp-0.3.2 fails to emerge if MAKEOPTS is not "-j1"2011-07-08 21:19:20
432106DevelopmentradhermitUNCONFIRMEDdev-libs/protobuf-2.4.0a fails to crosscompile: …/protoc: cannot execute binary file2013-01-01 20:30:56
419389ApplicationsradhermitUNCONFIRMEDwww-client/lynx-2.8.8_pre12 fails to build: ../../../WWW/Library/Implementation/HTUtils.h:735:17: fa2012-06-16 09:40:28
449092LibraryqtUNCONFIRMED[qt overlay] x11-libs/qt-webkit-5.0.0 fails to build: undefined reference to `JSC::JSCell::classInfo2013-02-16 10:09:49
435334Applicationsqmail-bugsUNCONFIRMEDmail-mta/netqmail-1.06 - pkg_postinst(): queue-repair failed2012-10-14 19:09:10
410325LibraryqtUNCONFIRMED=x11-libs/qt-gui-4.8.1[c++0x] fails to build on arm2012-12-27 09:07:19
370611Serverqmail-bugsUNCONFIRMEDmail-mta/netqmail-1.06 build failure: missing dependency - sys-apps/groff2011-06-08 06:31:17
442326ApplicationsqemuUNCONFIRMEDsys-firmware/sgabios-0.1_pre8 - Compile phase failure - ld: i386:x86-64 architecture of input file `2012-11-08 10:43:27
449354ApplicationsqemuUNCONFIRMEDapp-emulation/qemu-guest-agent fails to shutdown the guest2013-01-01 20:32:37
456814EbuildsqemuUNCONFIRMEDapp-emulation/qemu-1.2.2-r3[ncurses] fails configure with sys-libs/ncurses[tinfo]2013-02-14 14:14:03
455104DevelopmentpythonUNCONFIRMEDdev-python/nose-1.2.1_p2012 fails tests (fails to parse coverage output)2013-02-06 10:00:25
455210DevelopmentpythonUNCONFIRMEDdev-lang/python-3.2.3 fails to build native Parser/pgen while crosscompiling2013-02-04 19:42:53
453800Eclasses and ProfilespythonUNCONFIRMEDpython.eclass: dev-python/cython fails to install in environment that contains coreutils on Gentoo/F2013-01-29 23:58:29
420271ApplicationspythonUNCONFIRMED=dev-python/twisted-11.0.0: fails test wrt twisted.test.test_udp.Server2012-06-11 10:59:36
402027EbuildspythonUNCONFIRMEDdev-python/django-1.3.1 with dev-python/psycopg-2.4.2 fails app/project tests2012-04-28 20:35:29
386163Core systempythonUNCONFIRMEDEmerging app-admin/eselect-python-20100321 fails with 2011-10-09 11:37:24
372933ApplicationspythonUNCONFIRMEDgnome-base/libglade binpkg fails after python upgrade2011-06-29 16:11:40
395495ApplicationspythonUNCONFIRMEDdev-lang/python-3.2.2 failed (test phase)2011-12-22 08:56:37
381809EbuildspythonUNCONFIRMEDgames-simulation/singularity-0.30c fails to run with Python32012-12-29 15:00:48
371009DevelopmentpythonUNCONFIRMEDdev-lang/python-2.7.1-r1 fails to cross compile on mipsel-r3000-linux-uclibc2011-10-02 21:07:28
442168ApplicationsproaudioUNCONFIRMEDmedia-sound/patchage - Build failure when python-3 is set as active version2012-12-23 21:12:37
455238LibraryprintingUNCONFIRMEDmedia-libs/vigra-1.7.1-r1 failed (compile phase): ImportError: No module named nose2013-02-05 01:00:18
430498PrintingprintingUNCONFIRMEDnet-print/cups-bjnp-1.0 and net-print/cups-1.6.1: Failed to read side-channel request!2012-08-09 23:40:25
419787PrintingprintingUNCONFIRMEDnet-print/foo2zjs-99999999 with app-text/ghostscript-gpl-9.05-r1 fails tests2012-10-09 09:27:44
420623PrintingprintingUNCONFIRMEDnet-print/foo2zjs-99999999 fails emerge with permission denied, access attempt outside the sandbox2013-01-27 23:07:16
383447PrintingprintingUNCONFIRMEDapp-text/ghostscript-gpl-9.05 fails to build2012-02-20 00:09:31
389665PrintingprintingUNCONFIRMEDnet-print/foo2zjs-99999999 fails to build osx-hplj-hotplug2012-06-13 20:01:41
451488Prefix SupportprefixUNCONFIRMEDbootstrap tar-1.26 fails with glibc 2.16 (no gets)2013-02-03 08:06:36
455512Prefix SupportprefixUNCONFIRMEDsys-libs.readline has an incorrect install_name which trigger install failure because of QA2013-02-05 01:02:35
450176Prefix SupportprefixUNCONFIRMEDbuild of gcc-4.2.4-r01.4 fails2013-01-07 08:24:34
450388Prefix SupportprefixUNCONFIRMEDsci-libs/dsdp-5.8-r2: emerge fails in make_shared_library on OS X2013-01-05 14:03:11
450012Prefix SupportprefixUNCONFIRMEDwww-servers/lighttpd-1.4.31 fails to emerge2013-01-03 15:45:21
447796Prefix SupportprefixUNCONFIRMEDsys-apps/util-linux-2.20.1: fails to emerge2012-12-19 09:19:08
449084UnspecifiedprefixUNCONFIRMEDwww-client/firefox-17.0.1 fails to build due to missing dependencies2013-01-14 17:53:42
447688Prefix SupportprefixUNCONFIRMEDsys-fs/mtools: ld fails to build because of lost libiconv linkage flag2012-12-18 20:29:17
447556Mac OSXprefixUNCONFIRMEDdev-python/virtualenv-1.8.4 emerge failed with error virtualenv-3.3 already exists2013-01-19 18:48:58
447348Prefix SupportprefixUNCONFIRMEDbootstrap-prefix fails on emerge 'sed'2012-12-18 16:15:59
442992Prefix SupportprefixUNCONFIRMED2012-12-08 09:11:17
446200Prefix SupportprefixUNCONFIRMED~x86-linux prefix: emerge --config =dev-db/mysql-5.5.28 fails2013-01-31 15:13:09
437782Prefix SupportprefixUNCONFIRMEDdev-util/cscope-15.8a fails to build in gentoo-prefix2012-10-10 01:40:54
430266Prefix SupportprefixUNCONFIRMEDapp-arch/xz-utils fails to build on NetBSD2012-08-10 06:38:46
433972Prefix SupportprefixUNCONFIRMEDapp-text/tree-1.6.0-r1: failed to compile on Mac OSX Mountain Lion2012-10-10 01:23:24
435044Prefix SupportprefixUNCONFIRMEDbootstrap-prefix.txt fails on comilation of portage/app-editors/nano-2.3.1-r22012-10-01 14:08:25
437362Prefix SupportprefixUNCONFIRMEDdev-libs/jemalloc-3.0.0 fails to build because of double prefix2012-10-06 16:47:56
437214Prefix SupportprefixUNCONFIRMEDdev-python/PyQt4-4.9.4-r1 fails to emerge2013-01-17 05:38:43
437020Prefix SupportprefixUNCONFIRMEDbootstrap-prefix failed on gcc-4.2.4 in stage 32012-10-03 15:44:28
427616Prefix SupportprefixUNCONFIRMEDdev-lisp/sbcl-1.0.55-r1 fails to install on OS X (with FEATURES=test)2012-10-22 18:12:45
422541Prefix SupportprefixUNCONFIRMEDgtk+-3.4.3 fails QA checks on Mac OS 10.7(.4)2012-07-17 08:16:01
422535Prefix SupportprefixUNCONFIRMEDdev-lisp/sbcl-1.0.55-r1: Fail to compile on x64 OS X due to missing binary2012-06-21 05:23:34
419793Prefix SupportprefixUNCONFIRMEDapp-emulation/hercules-3.07: install failed due to chown root2012-08-25 06:35:42
416147Prefix SupportprefixUNCONFIRMEDeix-0.25.4 fails to install with chown: invalid user: ‘portage:portage’2012-05-22 16:31:08
416269Prefix SupportprefixUNCONFIRMEDdev-python/reportlab-2.5-r1 fails to build : libart.h : No such file or directory2012-05-23 15:49:39
416465Prefix SupportprefixUNCONFIRMEDFailed to emerge dev-libs/protobuf-2.4.1 "No suitable threading library available."2012-08-12 20:11:24
416501Prefix SupportprefixUNCONFIRMEDdev-java/jffi-1.0.0 and jffi-1.0.11 failed to build: No rule to make target2012-05-18 14:04:04
416983Prefix SupportprefixUNCONFIRMEDx11-libs/libpciaccess fails to build on OS X due to missing sys/endian.h2012-05-21 22:07:00
413167Prefix SupportprefixUNCONFIRMEDsys-fs/fuse-2.9.0: emerge failed at compile phase.2012-04-22 23:17:14
404207Prefix SupportprefixUNCONFIRMEDcheck-reqs.eclass fails to check memory size2012-02-19 13:27:22
400843Prefix SupportprefixUNCONFIRMEDdev-python/pygtk-2.24.0-r2 fails to build on OS 10.7 with numerous errors2012-07-13 10:10:03
390669Prefix SupportprefixUNCONFIRMEDdev-lang/ocaml-3.12.0 emerge fails with ocamlopt useflag2011-11-29 19:27:40
392979Prefix SupportprefixUNCONFIRMEDmedia-gfx/fontforge-20110222-r1 fails to compile on x86-macos2012-05-31 12:28:59
387733Prefix SupportprefixUNCONFIRMEDmedia-video/mplayer2-9999 fails to build on MacOS X in gentoo prefix2012-05-13 21:53:31
384581Mac OSXprefixUNCONFIRMEDapp-editors/emacs-23.3-r2: emerge failed with error unexec: my_endbss_static is not in section __bss2011-10-31 03:04:33
456354Applicationspolynomial-cUNCONFIRMEDapp-emulation/virtualbox-4.2.6-r1 fails to build. kmk_builtin_mv shows options help. kmk error 642013-02-11 17:25:35
382413Prefix SupportprefixUNCONFIRMEDx11-lib/qt-webkit fails to link against media-libs/phonon on Mac OS X (framework is missing)2011-09-09 18:29:43
381105Prefix SupportprefixUNCONFIRMEDdev-lang/nasm-2.09.10: failed to compile in prefix/linux-amd642011-08-30 04:04:34
371785Prefix SupportprefixUNCONFIRMEDBootstrapping gcc fails on SUSE Enterprise 11 SP02011-06-15 15:13:04
371729Prefix SupportprefixUNCONFIRMEDBootstrapping tar fails on SUSE Enterprise 11 SP02011-06-15 14:17:54
371601Prefix SupportprefixUNCONFIRMEDmedia-libs/gegl fails to compile2012-06-23 20:46:50
428124Applicationspolynomial-cUNCONFIRMEDapp-emulation/virtualbox-4.1.12: "Failed to create the VirtualBox COM object"2012-09-21 15:25:00
420291Applicationspolynomial-cUNCONFIRMEDnet-irc/xchat-2.8.8-r2 fails to build2012-06-11 18:44:41
413467Applicationspolynomial-cUNCONFIRMEDapp-emulation/virtualbox-4.1.12: parallel build sometimes fails2013-01-07 06:25:45
383669Applicationspolynomial-cUNCONFIRMEDapp-emulation/virtualbox-4.1.2: fails to compile due to Java name clash2011-12-21 14:52:14
375565Serverpolynomial-cUNCONFIRMEDnet-ftp/pure-ftpd init script fails with UPLOADSCRIPT set2011-09-06 09:49:17
456820Developmentphp-bugsUNCONFIRMEDdev-lang/php-5.3.21-r2 fails to compile with USE="ssl"2013-02-12 08:54:30
437064Applicationsphp-bugsUNCONFIRMEDdev-lang/php (5.4.6 and 5.4.7) fail to build under x32 profile2012-10-03 13:16:23
435742Applicationsphp-bugsUNCONFIRMEDdev-php/igbinary-1.1.1-r1 with dev-lang/php[threads] compilation fails with: apc_serializer.h:57:5: 2012-09-21 16:43:14
423167Developmentphp-bugsUNCONFIRMEDdev-php/pecl-http-1.7.4 fails at runtime with "undefined symbol: gcry_control" when using net-libs/g2012-08-01 12:00:35
456938DevelopmentperlUNCONFIRMEDdev-perl/XML-SAX-0.990.0, dev-perl/XML-SAX-Base-1.80.0: Fail to remove vendor_perl/.../ParserDetails2013-02-13 19:14:50
455604ApplicationsperlUNCONFIRMEDmail-filter/spamassassin-3.3.2-r1 initd script fails because checkpath is missing2013-02-05 21:53:32
454450DevelopmentperlUNCONFIRMEDperl ebuilds could warn if they fail AND PERL5LIB is set2013-01-29 20:48:01
448104DevelopmentperlUNCONFIRMEDdev-perl/PortageXS-0.02.10-r2 - test-suite fails - Cannot open file /etc/portage/make.conf at lib//P2012-12-24 09:37:14
437484DevelopmentperlUNCONFIRMEDdev-lang/perl-5.16.1 - Pod::Perldoc (perldoc) failures caused by typo2012-10-08 11:15:54
420033DevelopmentperlUNCONFIRMEDdev-perl/MooseX-Types-DateTimeX fails tests with MooseX-Types-DateTime-ButMaintained-0.140.02012-06-07 09:09:11
408151LibraryperlUNCONFIRMEDdev-perl/Cairo-1.90.0 with dev-lang/perl-5.14.2 - Failed 1/8 test programs. 6/270 subtests failed.2012-04-03 19:32:36
381711ApplicationsperlUNCONFIRMEDdev-perl/IO-Tty-1.100.0 fails tests on amd642011-09-04 07:54:02
384137EbuildsperlUNCONFIRMEDdev-perl/Inline-0.480.0: fails tests with parallel make2011-09-27 16:26:48
374925ApplicationsperlUNCONFIRMEDmail-filter/spamassassin-3.3.2-r1 fails test spamd_ssl_v2.t2012-04-27 08:36:13
375837EbuildsperlUNCONFIRMEDmail-filter/spamassassin-3.3.2 fails to build (Sandbox violation)2011-10-11 15:56:38
378645DevelopmentperlUNCONFIRMEDdev-perl/math-pari ignores profile, and fails when compiling on2011-08-20 17:10:38
431036ApplicationspchristUNCONFIRMEDdev-lisp/sbcl fails to compile (when the build system is testing "sb-posix")2012-08-30 18:50:48
445120LibrarypatrickUNCONFIRMEDsys-libs/tdb-1.2.10 - Compilatin phase failed - [Errno 2] No such file or directory: '/var/tmp/porta2012-12-08 15:46:16
444218ApplicationspatrickUNCONFIRMEDwww-servers/apache-2.4.3 - init script doesn't handle failed start correctly2013-02-16 13:19:08
432964ApplicationspatrickUNCONFIRMEDwww-servers/apache - init.d script fails to detect server check/startup problem2013-02-16 13:23:59
424816ApplicationspatrickUNCONFIRMEDapp-emulation/virtualbox-guest-additions-4.1.12 and x11-drivers/xf86-video-virtualbox-4.1.12 fail to2012-12-26 21:09:46
411471ServerpatrickUNCONFIRMEDapp-admin/apache-tools-2.2.22 fails on '--param keyword=value' in CFLAGS2013-02-16 13:33:09
405151ApplicationspatrickUNCONFIRMEDapp-emulation/virtualbox-guest-additions-4.1.4-r1: Failure to build with 3.2 kernel2012-04-02 07:44:24
392769ApplicationspatrickUNCONFIRMEDapp-emulation/virtualbox-guest-additions-4.1.6-r1 fails to build from /etc/kernel/postinst.d - make[2012-03-14 22:38:37
379003LibrarypatrickUNCONFIRMEDsys-libs/tevent-0.9.12 fails on portage-multilib because of waflib module's python support2012-12-25 21:03:18
456908Core systempam-bugsUNCONFIRMEDsys-libs/pam-1.1.6-r2: /usr/lib64/portage/bin/isolated-functions.sh: line 215: wait: `Failed Running2013-02-16 21:10:14
446172Core systempam-bugsUNCONFIRMEDsys-libs/pam-1.1.5 fails to cross-compile because flex is not installed in the target2013-01-09 09:31:35
452776OpenRCopenrcUNCONFIRMEDsys-apps/openrc-0.11.*: system fails to shutdown with automount+nfs2013-02-16 13:44:26
430318OpenRCopenrcUNCONFIRMEDsys-apps/openrc-0.10.5 fails to remounts reiserfs root file system read only on reboot: failed becau2012-11-07 11:40:40
417365OpenRCopenrcUNCONFIRMEDsys-apps/openrc: parameter "-1" passed to dhclient, causing dhclient not to retry when failing2012-12-07 11:49:41
411461OpenRCopenrcUNCONFIRMEDsys-apps/openrc-0.9.8.4: services fail to start at boot because of "stalled" deptree cache2012-04-10 12:21:07
410271OpenRCopenrcUNCONFIRMEDnet init scripts fail to add route source address to tunnel interface: "RTNETLINK answers: Invalid a2012-04-02 01:31:02
402347OpenRCopenrcUNCONFIRMEDnet.wlan0 fails to auto-start with 2013-02-03 08:30:09
456980ApplicationsopenofficeUNCONFIRMEDapp-office/libreoffice-4.0.0.3 - inserting movie or sound in impress fails with "The format of the s2013-02-13 19:08:21
430224ApplicationsopenofficeUNCONFIRMEDapp-office/libreoffice-bin-3.5.4.2 - printing to CUPS fails before the job has been submitted2012-08-08 18:24:36
448764ApplicationsopenofficeUNCONFIRMEDapp-office/libreoffice-3.6.4.3 fails with dev-libs/boost-1.52.0-r5 (bug 425356 strikes again!)2012-12-27 05:37:52
457562ApplicationsneurogeekUNCONFIRMEDapp-accessibility/speech-tools-2.1-r2 fails with ncurses[tinfo]2013-02-14 18:21:15
407075ApplicationsnetmonUNCONFIRMEDnet-analyzer/nmap USE=lua fails to run after upgrade to dev-lang/lua-5.2.0 and will not rebuild2013-01-15 17:07:41
408263ApplicationsnetmonUNCONFIRMED=net-analyzer/fail2ban-0.8.6 iptables bans lost on restart2012-03-15 15:16:00
420473ApplicationsnetmonUNCONFIRMEDnet-analyzer/fail2ban-0.8.6 violates Date-Mailheader standards when using sendmail*-actions and havi2012-12-17 11:17:57
435982ApplicationsnetmonUNCONFIRMEDnet-analyzer/tcpdump-4.3.0 fails tests: esp4, esp5, isakmp4, ikev2pI22012-10-12 10:51:32
396353Prefix SupportnetmonUNCONFIRMEDnet-analyzer/nmap fails with LDFLAGS="-Wl,--as-needed" on sparc64-solaris2013-01-15 17:08:42
383055EbuildsnetmonUNCONFIRMEDnet-analyzer/rrdtool[ruby] - fails to compile2011-09-16 22:56:02
446184Applicationsnet-p2pUNCONFIRMEDnet-libs/libtorrent-0.13.2: fails to cross compile2012-12-06 05:02:50
450392Librarynet-p2pUNCONFIRMEDnet-libs/gupnp-igd-0.2.2 fails to build with USE_PYTHON="... 2.7-pypy-1.9"2013-01-05 17:56:48
433942Applicationsnet-p2pUNCONFIRMEDnet-p2p/amule - amule fails to start when an empty ~/.aMule/statistics.dat file is present2012-09-04 15:33:37
388879Servernet-p2pUNCONFIRMEDnet-p2p/mldonkey-3.1.0: Exception setgid failed: Operation not permitted trying to set group_gid2011-11-21 00:31:52
394885Applicationsnet-p2pUNCONFIRMEDnet-p2p/rtorrent-0.8.9 fails to link because of missing lpthread for LIBS2011-12-16 02:48:12
378413Applicationsnet-newsUNCONFIRMED[patch] net-news/yarssr-0.2.2-r1: URL Handler fails to launch correct URL in web browser2011-08-11 15:04:02
448352Core systemnet-mailUNCONFIRMEDdev-libs/cyrus-sasl-2.1.25-r3 fails to crosscompile: ./makemd5: ./makemd5: cannot execute binary fil2012-12-25 18:07:35
448574Applicationsnet-mailUNCONFIRMEDmail-client/etpan-ng-0.7 fails to recognize address book when composing message2012-12-26 02:54:28
400609Unspecifiednet-mailUNCONFIRMEDnet-mail/perdition-1.18 - fails to build with errors because of a multi line macro in net-libs/vanes2012-12-04 18:16:40
458162Applicationsnet-ircUNCONFIRMEDnet-irc/bopm init script failure2013-02-20 14:41:19
369159Servernet-mailUNCONFIRMEDmail-filter/postgrey init script fails startup under sys-apps/openrc-0.8.2-r12013-01-14 07:23:32
453642Applicationsnet-imUNCONFIRMEDnet-im/empathy-2.34.0-r2 - accounts window fails to open2013-01-23 16:38:50
449526Applicationsnet-imUNCONFIRMEDnet-im/pidgin-2.10.6 fails to compile with USE="eds" and gnome-extra/evolution-data-server-3.62013-02-12 16:15:52
458110Applicationsnet-fsUNCONFIRMEDnet-fs/curlftpfs-0.9.2 fails with special characters in dir names2013-02-19 20:19:03
399489Applicationsnet-imUNCONFIRMEDnet-im/pidgin XMPP/SASL authentication fail with >=dev-libs/cyrus-sasl-2.1.252012-02-07 20:53:55
423801Applicationsnet-imUNCONFIRMEDnet-im/pidgin-2.10.4[gnutls] fails configure with net-libs/gnutls[nettle]2013-02-13 20:41:47
453962Core systemnet-fsUNCONFIRMEDnet-fs/autofs-5.0.6-r5: umount automounted NFS share fails2013-02-16 13:31:29
453880Applicationsnet-fsUNCONFIRMEDnet-fs/autofs-5.0.6-r5: fails to stop and to start:2013-02-16 13:22:48
372717Ebuildsnet-fsUNCONFIRMEDsys-libs/lwp-2.6: Rdsinit fails to initialize data and log2011-07-01 11:45:25
424892Applicationsnet-dialupUNCONFIRMEDnet-dialup/capisuite-0.4.5-r6 fails to build with automake >= 1.12.12013-01-10 17:40:24
436122Ebuildsnet-dialupUNCONFIRMEDnet-dialup/ppp-2.4.5-r3 - Failed Patch: 80_all_eaptls-mppe-0.991-gentoo.patch !2012-11-09 04:09:40
373369Applicationsnet-dialupUNCONFIRMEDnet-dialup/freeradius-client fail to cross-compile2011-07-03 16:45:23
374667Applicationsnet-dialupUNCONFIRMEDnet-dialup/rp-pppoe fail to cross compile2011-07-10 18:06:14
373347Applicationsnet-dialupUNCONFIRMEDnet-dialup/radiusclient fail to cross-compile2011-07-01 19:11:18
373365Applicationsnet-dialupUNCONFIRMEDnet-dialup/radiusclient-ng fail to cross-compile2011-07-01 19:11:38
453480Applicationsmysql-bugsUNCONFIRMEDdev-db/mysql-5.1.66 - emerge --config fails after change of datadir in my.cnf2013-01-22 19:11:18
442346Applicationsmysql-bugsUNCONFIRMEDdev-db/mysql-5.5.28 - InnoDB: Assertion failure in thread 140230384047936 in file trx0rseg.c line 332012-11-08 22:04:30
385513Developmentmysql-bugsUNCONFIRMEDdev-db/mariadb-5.1.50: failed to compile x86-libs with multilib-overlay enabled2011-10-30 04:20:27
442322Ebuildsmysql-bugsUNCONFIRMEDdev-db/myodbc-5.1.6 - Build fails against dev-db/mysql-5.5.28 - error: too many arguments to functio2013-02-09 20:29:48
370703Applicationsmysql-bugsUNCONFIRMEDdev-db/myodbc-5.1.6 - emerge --config fails: odbcinst: SQLWritePrivateProfileString failed with Gene2011-06-10 02:05:40
417947Applicationsmr_bones_UNCONFIRMEDapp-misc/figlet - bash completion fails with paths containing spaces2012-05-28 12:08:37
451504ApplicationsmozillaUNCONFIRMEDwww-client/firefox-18.0/www-client/seamonkey-2.15 failed (install phase) [to emerge]; incorrect pag2013-02-07 15:47:44
451544ApplicationsmozillaUNCONFIRMEDwww-client/firefox-18.0 fails to build without dbus flag2013-01-13 02:21:35
439558EbuildsmozillaUNCONFIRMEDdev-lang/spidermonkey-1.8.5-r1 x32 fails to build2012-10-24 21:49:59
431560DevelopmentmozillaUNCONFIRMEDdev-lang/spidermonkey-1.8.2.15: building w/uClibc fails due to finite() vs isfinite()2013-02-18 06:26:46
427048ApplicationsmozillaUNCONFIRMEDwww-client/firefox-14.0.1 fails to build with ABI x32 - /usr/include/bits/sysctl.h:19:3: error: #err2013-01-16 13:49:43
416047ApplicationsmozillaUNCONFIRMEDdev-libs/nss-3.13.{3,4} - die "Failed to detect whether your arch is 64bits or 32bits, disable distc2012-05-16 02:51:26
409295ApplicationsmozillaUNCONFIRMEDmail-client/thunderbird-bin-10.0.2 - HTTP links cannot be opened - Failed to load native module at p2012-03-23 15:08:47
377079ApplicationsmmokrejsUNCONFIRMEDsci-biology/GBrowse-2.39 fails to compile2011-08-02 20:22:32
452558DevelopmentmlUNCONFIRMEDdev-lang/mlton-20100608 fails to build, unknown type name '__gmp_const'2013-01-25 08:43:11
446304DevelopmentmlUNCONFIRMEDdev-lang/ocaml-4.00.1 +ocamlopt fails w/ *** [camlp4opt] Error 2552012-12-07 11:36:00
409415Eclasses and ProfilesmgornyUNCONFIRMEDgit-2.eclass fails to clone bare repository into working directory using specific EGIT_REPO_URI2012-04-03 10:30:48
448094Eclasses and ProfilesmgornyUNCONFIRMEDgit-2_update_repo fails if HEAD file is missing2012-12-24 09:48:06
455058Applicationsmedia-videoUNCONFIRMEDmedia-video/gxine with dev-lang/spidermonkey-1.8.8 - build fails to find mozjs2013-02-05 11:27:23
447746Librarymedia-videoUNCONFIRMED[PATCH] media-libs/mlt-0.8.2 builds with -DARCH_X86_64 even though CHOST=i686-pc-linux-gnu and fails2012-12-24 10:27:50
448706Applicationsmedia-videoUNCONFIRMEDmedia-plugins/frei0r-plugins-1.3 - defish0r plugin makes kdenlive rendering fail2013-02-01 10:32:02
445544Applicationsmedia-videoUNCONFIRMEDmedia-video/dvdstyler-2.3.4 - Fails to generate iso, consider to hard-mask this version.2012-12-03 05:50:21
437258Applicationsmedia-videoUNCONFIRMEDmedia-video/vlc-9999 - Failed Patch: 300_all_pic.patch !2012-10-06 13:33:40
435102Ebuildsmedia-videoUNCONFIRMEDmedia-video/vlc-9999 - 300_all_pic.patch fails to apply2012-09-18 20:17:27
433375Applicationsmedia-videoUNCONFIRMEDmedia-video/cinelerra ignores LDFLAGS, causing multilib compile failure2012-11-20 12:23:36
418037Applicationsmedia-videoUNCONFIRMEDmedia-video/subtitlecomposer-0.5.3 USE=xine fails due to underlinking: ld: CMakeFiles/subtitlecompos2012-05-29 00:01:02
411443Applicationsmedia-videoUNCONFIRMEDmedia-libs/libcaca-0.99_beta18 - java-pkg_newjar java/libjava.jar fails2012-12-30 03:36:17
388849Ebuildsmedia-videoUNCONFIRMEDmedia-video/dirac-1.0.2 fails with gcc-4.5.32011-12-06 17:32:25
378557Librarymedia-videoUNCONFIRMEDmedia-libs/libvpx-0.9.7: Compile failure with debug USE flag - "No rule to make target libvpx_g.so, 2012-09-15 05:01:43
383295Librarymedia-videoUNCONFIRMEDmedia-libs/libdc1394-2.1.3-r1 fails to link (undefined references to yuy2_to_yv16 and yuy2_to_yv12)2011-10-05 09:12:28
416021Applicationsmedia-tvUNCONFIRMEDapp-misc/lirc-*: livedrive_midi.c: livedrive_rec_midi fails to see SYSEX_END until logprintf(…) is a2012-12-02 02:09:04
370287Applicationsmedia-tvUNCONFIRMEDapp-misc/lirc-0.9.0 fails to emerge, because 'struct i2c_adapter’ has no member named ‘id’2012-07-17 20:40:06
369987Ebuildsmedia-tvUNCONFIRMEDapp-misc/lirc-0.9.0 emerge error econf failed2012-07-17 20:43:17
430894Core systemmattmUNCONFIRMEDsys-power/apcupsd-3.14.10-r1[snmp] fails to build with latest net-snmp2013-02-02 23:16:04
418007DevelopmentmaksbotanUNCONFIRMEDdev-python/scrapy-0.14.4 fails in setup while parsing urlparse_monkeypatches.py2012-06-14 16:40:49
456256Librarymaintainer-neededUNCONFIRMEDdev-libs/libical fails when cross compiling2013-02-12 02:26:18
448742Ebuildsmaintainer-neededUNCONFIRMEDapp-misc/multimon-1.0-r3: fails to build2013-01-12 22:37:15
443856Applicationsmaintainer-neededUNCONFIRMEDmedia-gfx/splashutils-1.5.4.4-r2 failed to build - asm/posix_types.h: No such file or directory2013-01-27 08:05:31
432296Developmentmaintainer-neededUNCONFIRMEDdev-libs/apr-1.4.5 fails to crosscompile: configure: error: cannot run test program while cross comp2013-01-03 18:43:02
434926Applicationsmaintainer-neededUNCONFIRMED>=net-im/skype-4.0.0.7 - login failure, stuck at "signing in" with JFS filesystem2013-01-03 19:31:41
426980Ebuildsmaintainer-neededUNCONFIRMEDdev-lang/gforth-0.7.0: fails to build2012-07-23 17:43:24
415073Applicationsmaintainer-neededUNCONFIRMEDmedia-gfx/freecad-0.12.5284-r2 fails multilib-strict2012-08-24 18:17:55
406255Sandboxmaintainer-neededUNCONFIRMEDdev-libs/apr-1.4.6 failed test: testlfs : \/bin/bash: line 2: 3428 Segmentation fault (core d2012-12-29 17:08:08
400749Applicationsmaintainer-neededUNCONFIRMEDapp-laptop/ibam-0.5.2-r3 - ./ibam-0.5.2/debian/patches/04sysfs.dpatch fails2012-12-14 15:51:56
389391Servermaintainer-neededUNCONFIRMEDwww-apache/mod_authnz_external-3.2.6 fails with method checkpassword2013-01-01 19:43:11
375825Applicationsmaintainer-neededUNCONFIRMEDapp-admin/ulogd-2.0.0_beta4 fails to build with +doc USE flag if latex is not installed2012-09-16 09:14:45
433002ApplicationslxnayUNCONFIRMEDnet-libs/libgrss-0.3.0 fails to build without gnome-doc-utils2012-12-19 08:18:58
445484SELinuxlxnayUNCONFIRMEDnet-nds/389-ds-base-1.2.11.15 fails to build in hardened selinux profile2012-12-04 19:58:35
456784ApplicationslxnayUNCONFIRMED[sabayon overlay] net-wireless/blueman-1.23-r2: Failed Patch: blueman-1.21-fix-segfault-startup.patc2013-02-12 15:10:18
395109Unspecifiedlu_zeroUNCONFIRMEDmedia-video/lives-1.4.6 "Capture External Window" fails to render video; errors in console2011-12-19 12:16:42
416903ApplicationslivecdUNCONFIRMEDsys-block/parted-3.1 fails tests [t8001-loop-blkpg.sh t2100-zerolen.sh]2012-05-21 14:59:50
447996Applicationsldap-bugsUNCONFIRMEDnet-nds/openldap tries to start before net.eth0 and fails2012-12-22 13:00:56
454362Core systemkernel-miscUNCONFIRMEDsys-fs/jfsutils-1.1.15 - Fails to build with +static if sys-apps/util-linux is built without +static2013-01-28 02:04:19
458426EbuildskernelUNCONFIRMED=sys-kernel/gentoo-sources-3.8.0 fails to compile: invalid operands to binary == (have ‘kuid_t’ and 2013-02-20 11:26:46
458402KDEkdeUNCONFIRMEDkde-base/kig-4.10.0 fails to emerge with USE=scripting2013-02-20 05:25:24
458224KDEkdeUNCONFIRMEDkmail fails to obtain a lock2013-02-19 05:54:24
457640KDEkdeUNCONFIRMEDkdelibs 4.10.0 fails with giflib-52013-02-17 22:30:10
455456LibrarykdeUNCONFIRMEDmedia-libs/phonon-gstreamer fails with gentoo-multilib - /usr/lib64/libphonon.so.4.6.0: could not re2013-02-05 06:18:13
455274KDEkdeUNCONFIRMED[kde overlay] =kde-base/blogilo-9999 fails to build because kdepim-common-libs doesn't build and ins2013-02-15 15:52:57
450386DevelopmentkdeUNCONFIRMEDdev-util/cmake: FindBLAS patch doesn't correctly use pkg-config results and may fail2013-01-08 12:36:44
436290KDEkdeUNCONFIRMEDkde-base/okular-4.9.1 - hpcups[7483]: prnt/hpcups/HPCupsFilter.cpp 536: cupsRasterOpen failed, fd = 2013-01-10 19:35:12
432976KDEkdeUNCONFIRMEDnet-libs/telepathy-logger-qt-0.5.0: fails to build with >=dev-libs/boost-1.50.0-r22013-01-18 10:48:33
430938KDEkdeUNCONFIRMEDkde-base/plasma-workspace-4.8.5 fails with parallel build: fatal error: ui_killrunner_config.h: No s2012-10-24 16:55:05
430968KDEkdeUNCONFIRMEDdev-libs/grantlee-0.2.0 fails to build on arm hardfp2012-08-24 23:31:13
423827KDEkdeUNCONFIRMEDkde-base/kdm fails to start using binpkgs2013-02-17 22:50:42
451056DevelopmentjsbronderUNCONFIRMEDsys-cluster/mpich2-1.2.1_p1-r1 fails to crosscompile: configure: error: Unable to determine Fortran 2013-01-09 15:17:48
415701Core systemjsbronderUNCONFIRMEDsys-cluster/torque-3.x[cpusets] fails on 3.2.x kernels2012-11-02 17:51:04
407155UnspecifiedjsbronderUNCONFIRMEDsys-cluster/openmpi - Rmpi fails to install under dev-lang/R-2.14.2 due to undefined symbol: mca_bas2012-05-11 12:13:24
373923LibraryjsbronderUNCONFIRMEDsys-cluster/openmpi-1.5.3-r1: mpirun hangs or fails with Segmentation faults2012-02-06 19:20:57
448348Core systemjlecUNCONFIRMEDsys-fs/aufs-util-3.6 fails to crosscompile: ./ver: ./ver: cannot execute binary file2012-12-25 16:14:13
420393ApplicationsjlecUNCONFIRMEDapp-arch/p7zip-9.20.1-r2 fails to build 7zG/7zFM with "-l" in MAKEOPTS2012-06-09 14:44:20
415789ApplicationsjlecUNCONFIRMEDapp-arch/p7zip-9.20.1-r1 fails tests2012-05-30 19:15:06
456718LibraryjdhoreUNCONFIRMEDmedia-plugins/audacious-plugins-3.3.4 is incompatible with media-video/libav, fails during configure2013-02-11 17:14:50
422483ApplicationsjdhoreUNCONFIRMEDdev-lang/pike-7.8.352-r2 multilib-strict check failed!2012-12-21 03:51:15
428656EbuildsjdhoreUNCONFIRMEDapp-accessibility/gnome-mag-0.16.3: fails to build2012-11-25 14:44:01
456932JavajavaUNCONFIRMEDERROR: dev-java/netbeans-javafx-7.2 failed (compile phase)2013-02-13 20:19:37
438834JavajavaUNCONFIRMEDdev-java/icedtea-6.1.11.4 fails to build with java.lang.OutOfMemoryError2012-10-18 18:57:31
434222JavajavaUNCONFIRMEDdev-java/ant-ivy-2.0.0 compilation failed2012-09-07 15:04:44
427932JavajavaUNCONFIRMED[java-overlay] dev-java/j3d-core-1.5.1: compile phase fails with image resolution errors2012-07-24 19:35:50
421077JavajavaUNCONFIRMEDdev-java/icedtea-7.2.2 compilation fails with Unrecognised option: -XX:-PrintVMOptions2012-10-18 16:15:26
390663JavajavaUNCONFIRMEDicedtea-bin-1.10.4 fails to use Asian fonts automatically2012-01-10 19:16:30
389709JavajavaUNCONFIRMEDdev-java/icedtea-7.2.0-r1: failed to emerge due to SIGSEGV in the build process2012-11-02 14:42:48
381693ServerjavaUNCONFIRMEDtomcat-6 init fails when CATALINA_TMPDIR does not exist2011-10-24 21:05:19
378935JavajavaUNCONFIRMED[java-overlay] msv-20090415 fails QA2011-08-12 16:13:22
373561UnspecifiedjavaUNCONFIRMED[java-overlay] dev-java/testng-5.2 fails to download testng-5.2.zip2012-07-10 09:51:53
373105ApplicationsjavaUNCONFIRMEDdev-util/eclipse-sdk-3.5.1-r1 GLib, Gtk, Gdk assertions fail2013-02-04 12:40:26
368049JavajavaUNCONFIRMEDdev-java/jjtraveler-0.4.3-r2 does not emerge, fails unpack2012-06-26 02:05:17
365463JavajavaUNCONFIRMEDJRuby's Ant fails to call javac2012-06-03 10:28:27
454218CVS/SVN/Gitinfra-bugsUNCONFIRMEDUnconfirmed reports of anonvcs (specifically cvs) failing to sync entirely2013-01-26 22:06:35
366809Serveridl0rUNCONFIRMEDwww-apache/mod_perl-2.0.5 fails tests2011-05-12 23:01:20
454354Applicationsidella4UNCONFIRMEDapp-emulation/xen-tools-4.2.1 - Fails to compile with KeyError: '.text.asm.out/../src/smp.c.68'2013-02-01 21:20:22
446934Eclasses and ProfileshattyaUNCONFIRMEDsubversion.eclass v1.83 drops local checkout if svn client fails (on transport errors)2012-12-12 01:48:29
457728ApplicationshasufellUNCONFIRMEDx11-misc/spacefm fails by opeining files with ö ä ü or pdf file with acroread.2013-02-16 17:18:18
456970Applicationshardened-kernelUNCONFIRMEDapp-editors/emacs-24.2 failed to emerge with a segmentation fault on hardened-sources-3.7.4-r12013-02-12 22:17:52
417409Core systemhardened-kernelUNCONFIRMEDsys-kernel/hardened-sources-3.2.11 - beam: page allocation failure: order:1, mode:0x20 or swapper: p2012-05-28 10:16:10
444892Hardenedhardened-kernelUNCONFIRMEDNetwork failure with >sys-kernel/hardened-sources-3.4.5 tulip driver (DECchip 21140)2013-01-24 14:11:59
447702Core systemhardened-kernelUNCONFIRMEDsys-kernel/hardened-sources-3.7.0 fails to crosscompile for Ski-Simulator: include/linux/gfp.h:295:22012-12-19 09:10:48
456364HardenedhardenedUNCONFIRMEDsys-kernel/hardened-sources-3.7.5 ppc64 xics-common.c fails with "assignment of member 'cause_ipi' i2013-02-10 01:31:44
448322HardenedhardenedUNCONFIRMEDmake fails on kernel/sched/core.o when trying to build sys-kernel/hardened-sources-3.5.4-r12013-01-18 21:53:13
446850HardenedhardenedUNCONFIRMEDthunderbird-17.0-r2 fails to install with CONFIG_PAX_MPROTECT enabled2012-12-14 17:52:48
416415HardenedhardenedUNCONFIRMEDsys-apps/v86d-0.1.10 fails to read EBDA with GRKERNSEC_KMEM=y on some configurations2012-06-11 17:44:30
391839HardenedhardenedUNCONFIRMEDcompiling external module which is using file_operations fails2011-11-25 08:09:59
416587LibraryhannoUNCONFIRMEDmedia-libs/gegl-0.2.0: fails to compile with USE="introspection"2012-11-17 12:46:15
407729LibraryhannoUNCONFIRMEDnet-analyzer/openvas-libraries-4.0.5 fails with gnutls 3.x - work/openvas-libraries-4.0.5/misc/netwo2013-02-04 18:28:58
392261UnspecifiedhannoUNCONFIRMEDapp-emulation/dosemu -fno-pic causes build failure when using hardened compiler with PIE2012-12-23 17:38:30
431522ApplicationsgstreamerUNCONFIRMEDmedia-video/flumotion: fails to build with python3* as system interpreter2012-12-28 00:22:54
418199ApplicationsgrozinUNCONFIRMEDsci-libs/mathgl-1.11.2 install phase - ln: failed to create symbolic link './mathgl-1.11.2/ChangeLog2012-06-04 09:41:36
383995ApplicationsgstreamerUNCONFIRMEDmedia-plugins/gst-plugins-ffmpeg-0.10.12 fails test2012-09-06 23:05:53
382463DevelopmentgrozinUNCONFIRMEDdev-lisp/cmucl-20b_p001 fails to install due to (I think) a broken sed script.2012-05-07 02:56:52
449086ApplicationsgraphicsUNCONFIRMEDmedia-libs/lensfun-0.2.5-r2 fails using multiple jobs2013-01-10 07:44:47
427392EbuildsgraphicsUNCONFIRMEDmedia-gfx/graphviz-2.26.3-r{3,4}: build fails at link time2012-07-23 18:43:29
385897ApplicationsgraphicsUNCONFIRMEDmedia-gfx/enblend-4.0 fails compilation with use="+image-cache"2011-10-07 00:52:55
382111LibrarygraphicsUNCONFIRMEDmedia-libs/libpgf-6.11.28: fails to build on ppc2011-09-09 00:09:11
373387ApplicationsgraphicsUNCONFIRMEDmedia-gfx/hugin-2011.0.0 fail to compile; ld cannot find -lwx_gtk2_gl-2.82012-03-26 20:18:36
455938GNOMEgnomeUNCONFIRMED=gnome-base/gdm-3.6* - Fails to start when access to /proc is restricted.2013-02-07 02:11:03
450260GNOMEgnomeUNCONFIRMEDnet-im/empathy-3.6.2-r2 fails to compile2013-01-04 21:31:54
448964GNOMEgnomeUNCONFIRMEDgnome-extra/bug-buddy-2.32.0-r2 eds build fails with gnome-extra/evolution-data-server-3.62012-12-27 23:11:40
449044GNOMEgnomeUNCONFIRMED[gnome overlay] x11-terms/gnome-terminal-9999 fails to install : README does not exist2012-12-28 14:04:18
448770GNOMEgnomeUNCONFIRMED[gnome overlay] app-accessibility/at-spi2-atk-9999 fails to build due to failed patch "at-spi2-atk-2012-12-27 05:56:05
448772GNOMEgnomeUNCONFIRMED[gnome overlay] x11-libs/gtk+-9999 fails to build due to failed patch "gtk+-3.3.18-fallback-theme.2012-12-27 05:55:29
438620GNOMEgnomeUNCONFIRMEDdev-libs/glib-2.32.4-r1 - src_test(): FAIL: run-assert-msg-test.sh2012-10-17 17:36:06
427042GNOMEgnomeUNCONFIRMEDnet-libs/webkit-gtk-1.8.1-r301 ABI=x32 - (?fails to build?)2013-01-16 09:49:18
435488GNOMEgnomeUNCONFIRMEDmedia-libs/cogl-1.10.4 fails all tests2013-01-13 16:14:42
379001LibrarygnomeUNCONFIRMEDsys-libs/ldb-1.1.4 fails on portage-multilib because of waflib module's python support2013-01-01 18:40:16
389813GNOMEgnomeUNCONFIRMEDgnome-base/nautilus-3.2.1 fails to mount volumes correctly2012-10-28 10:29:55
393497GNOMEgnomeUNCONFIRMEDgnome-base/gnome-applets-3.2.1 fails to install if sys-apps/linux-misc-apps is installed2012-08-07 17:34:06
415801GNOMEgnomeUNCONFIRMEDwww-client/epiphany-3.4.1 fails test test-ephy-embed-single2012-09-16 08:52:40
422695GNOMEgnomeUNCONFIRMEDmail-client/evolution-3.2.3-r1 fails to compile with USE flag clutter2012-06-20 19:07:36
368731ApplicationsgnomeUNCONFIRMEDx11-libs/gdk-pixbuf-2.22.1: parallel install fails sometimes2012-01-30 10:16:01
420949genkernelgenkernelUNCONFIRMEDGenkernel fails to build busybox for non-default linker ABI2012-11-11 20:22:02
389775Core systemgenkernelUNCONFIRMEDsys-kernel/gentoo-sources: install fails with FIRMWARE_IN_KERNEL = y2012-10-27 18:39:39
451674ApplicationsgamesUNCONFIRMEDgames-strategy/xconq-7.4.1 fails to build with dev-lang/tcl-8.6.02013-01-14 07:03:16
436600GamesgamesUNCONFIRMEDgames-simulation/fgrun-1.6.0 fails to find dev-games/openscenegraph libs during linking2012-11-08 21:11:12
429604GamesgamesUNCONFIRMEDgames-puzzle/krosswordpuzzle-0.15.6.2.1259326 fails to configure with KDE 4.92012-12-21 22:55:29
424445GamesgamesUNCONFIRMEDufo-ai-2.4 fails with Com_EParseValue: Illegal color statement '1 .874 .294 1'2012-08-02 20:55:27
377177ApplicationsfuzzyrayUNCONFIRMEDapp-portage/elogviewer-0.6.2-r1 - elogviewer fails to start for ordinary user in the portage group2011-08-27 17:52:02
409583GNOMEfreedesktop-bugsUNCONFIRMEDapp-misc/tracker-9999 fails to compile with sys-devel/gettext-0.182012-04-02 12:35:18
378067ApplicationsforensicsUNCONFIRMEDapp-forensics/aide-0.14.2 - aide fails if non-standard paths are used2013-02-03 13:02:31
406891ApplicationsfontsUNCONFIRMEDmedia-libs/freetype-1.4_pre20080316-r2 compile failure: make[2]: execvp: ../libtool: Permission deni2012-03-05 20:19:14
406085ServerfloppymUNCONFIRMEDnet-misc/openswan-2.6.37 with USE +caps fails to find cacert (X.509)2012-04-06 22:44:01
438778EbuildsevermindUNCONFIRMED[pro-audio overlay] media-sound/non-things - git structure change causing configure fail and eutils 2012-10-25 13:48:06
419685ServererasUNCONFIRMED=net-proxy/squid-3.1.19: eautoreconf in src_prepare() fails in libltdl/2013-01-08 02:24:49
410065ServererasUNCONFIRMEDnet-mail/dovecot-2.1.3 fails at parallel make: fatal error: ../../../src/plugins/quota/rquota.h: No 2012-07-12 15:51:16
412909EbuildsembeddedUNCONFIRMEDx11/libxcb: xcb-proto should be RDEPEND instead of DEPEND or cross compiling fail2012-05-10 03:29:04
444524DevelopmentembeddedUNCONFIRMEDcrossdev: emerge-wrapper: arm-unknown-linux-gnueabi-emerge virtual/init fail becaus of missing USE-f2012-11-26 17:26:27
426444ApplicationsemacsUNCONFIRMEDapp-editors/emacs-23.4-r3 fails to build in parallel (--jobs=64)2012-07-18 15:26:44
426640EbuildsdotnetUNCONFIRMEDdev-dotnet/smartirc4net-0.4.5.1: fails to build2012-07-21 10:25:06
435168EbuildsdotnetUNCONFIRMEDdev-lang/mono-2.10.9-r2 merge fails with configure error2012-10-04 18:38:09
451996ApplicationsdjcUNCONFIRMEDdev-vcs/hgsubversion-1.4: compilation failure with Python 2.52013-01-15 12:37:58
442162ApplicationsdjcUNCONFIRMEDnet-misc/openvpn-2.1.4 - src_install: rmdir: failed to remove ‘/var/tmp/portage/net-misc/openvpn-2.12012-11-07 14:09:59
440794ApplicationsdilfridgeUNCONFIRMEDmedia-gfx/digikam 2.9.0 - digikam (core): Failed to detect camera with GPhoto2 from Solid (canon ixu2013-01-27 16:08:36
458006Applicationsdev-zeroUNCONFIRMEDx11-drivers/xf86-video-vmware with media-libs/mesa-9.1_rc1 - module fails to load2013-02-20 00:43:23
447638Coredev-portageUNCONFIRMEDBuilding packages as normal user with fakeroot sometimes fails due to tar complaining about "Too man2012-12-18 19:12:05
427748Core systemdev-portageUNCONFIRMEDsys-apps/portage-2.2.0_alpha120 crashing when compile fails2012-07-23 18:57:51
420459Enhancement/Feature Requestsdev-portageUNCONFIRMEDemerge --keep-going should leave behind --resume state for skipped/failed builds2012-09-07 04:13:06
399577Core - Dependenciesdev-portageUNCONFIRMEDportage/emerge fails to compute dependencies and fails to report what triggered the problem2012-01-22 15:26:36
389735Core - Dependenciesdev-portageUNCONFIRMEDsys-apps/portage-2.2.0_alpha72 fails to do --deep correctly2011-11-08 16:17:05
366513Unclassifieddev-portageUNCONFIRMEDportage-2.1.9.48 fails to install after successfull build.2011-05-09 07:41:30
374471LibrarycppUNCONFIRMEDdev-libs/Ice-3.4.1 failed to install2011-07-09 03:07:07
381001UnspecifiedcppUNCONFIRMEDdev-libs/boost-1.46.1-r1 failes to build on arm2012-10-31 16:41:29
393595UnspecifiedcppUNCONFIRMEDdev-libs/Ice-3.4.2 failes to build on arm2012-10-20 10:20:55
425188ApplicationscppUNCONFIRMED[TRACKER] Packages failing to build with >=dev-libs/boost-1.502012-12-16 15:28:26
456792LibrarycppUNCONFIRMEDdev-libs/boost-1.52.0-r5 fails to compile with custom /etc/site-config.jam: could not find main targ2013-02-12 22:13:10
438188Developmentcommon-lispUNCONFIRMEDdev-lisp/clisp-2.48-r1 - fails to compile with ENOMEM, although there is plenty left2013-01-01 04:00:02
432980Applicationscommon-lispUNCONFIRMEDdev-lisp/sbcl-1.0.55-r1 fails to compile with "The value 18446744073 is not of type (UNSIGNED-BYTE 32012-08-29 09:14:51
404423Unspecifiedcommon-lispUNCONFIRMEDdev-lisp/ecls-12.2.1 fails to run tests - An error occurred during initialization: Module error: Don2013-02-02 10:15:50
389783Ebuildscommon-lispUNCONFIRMEDdev-lisp/clozurecl-1.7 fails to build (unquoted SVN_REVISION in generated compiler commands)2011-11-08 19:59:04
407173ApplicationsclusterUNCONFIRMEDsys-devel/icecream: distributed jobs fail because of missing libraries2012-06-27 00:00:39
403761Prefix SupportclusterUNCONFIRMED[science overlay] sys-cluster/hpl-2.0-r1 build failure2012-02-15 03:59:25
384031ApplicationschutzpahUNCONFIRMEDnet-analyzer/pchar[pcap] fails to build (possibly glibc version related)2012-08-20 03:39:32
384617EbuildschainsawUNCONFIRMEDapp-emulation/dynamips fails to compile (w/ can't find a register in class 'GENERAL_REGS')2011-10-31 10:29:49
406583ApplicationschithanhUNCONFIRMEDwww-plugins/lightspark-0.5.4.1-r1 build fails - error regarding some ffmpeg stuff (?)2012-03-03 01:49:39
425810EbuildscedkUNCONFIRMEDdev-python/suds fails to build when user only has python-32012-07-11 16:39:57
456898ApplicationscardoeUNCONFIRMEDmedia-tv/mythtv with sys-fs/udisks:2 fails to detect DVD drives2013-02-14 00:28:21
439540ApplicationscardoeUNCONFIRMEDapp-emulation/qemu fails to handle a usb serial port with a specific vendorid - qdev_prop_set: prope2013-02-10 17:43:13
442996ApplicationscardoeUNCONFIRMEDmedia-tv/mythtv - logging to a file in /etc/conf.d/mythbackend fails because of hard-wired /etc/ini2012-12-30 16:58:46
369497UnspecifiedcardoeUNCONFIRMEDfirmware from media-tv/ivtv-firmware-20080701 fails to initialize hauppauge hvr-13002011-06-06 02:07:34
433102Core systemcardoeUNCONFIRMEDx11-drivers/nvidia-drivers - CONFIG_AMD_IOMMU causes kernel module to fail?2012-11-13 09:49:39
458598Applicationsbug-wranglersUNCONFIRMED[media-gfx/asymptote-2.21] emerge failed with USE="doc latex"2013-02-21 14:49:39
458554Applicationsbug-wranglersUNCONFIRMEDlibarchive-3.0.4-r1 and libarchive-3.1.1 fail compile when using gcc i686-pc-linux-gnu-4.5.4 but not2013-02-21 09:28:12
458568Applicationsbug-wranglersUNCONFIRMEDUdisks2 fails to mount flash drive when ACL isn't supported in kernel2013-02-21 13:23:05
458548Unspecifiedbug-wranglersUNCONFIRMED=sys-apps/shadow-4.1.5.1-r1 failing sed in ebuild2013-02-21 08:10:22
454228HardenedbluenessUNCONFIRMEDsys-kernel/hardened-sources-3.2.37-r2 fails to build for ia64: mm/mmap.c:1689:4: error: too few argu2013-02-21 02:26:58
390665FreeBSDbsdUNCONFIRMEDdev-libs/openssl-1.0.0 fails to compile on sparc-fbsd2012-03-19 06:50:59
393057FreeBSDbsdUNCONFIRMEDsys-freebsd/freebsd-lib-9.0 fails to compile on sparc-fbsd2011-12-03 18:20:02
454962FreeBSDbsdUNCONFIRMED=dev-lang/php-5.4.11-r1[fpm] build fail2013-02-01 15:42:58
454508FreeBSDbsdUNCONFIRMEDfreebsd-rescue-9.1: Fail to link in environment that dev-util/pkgconfig-0.28 is installed.2013-01-29 11:31:19
448514FreeBSDbsdUNCONFIRMEDsys-power/iasl-20120816: build fails on Gentoo/FreeBSD2012-12-31 07:42:13
444918FreeBSDbsdUNCONFIRMEDapp-arch/libarchive-3.0.4-r1 -- getvfsbyname failed error occurs, doesn't work in x86 chroot on amd62013-01-15 12:22:54
427430FreeBSDbsdUNCONFIRMEDWhen using latest clang-3.1-r5, sys-freebsd/boot0-9.0/9.1_beta1 will fail to compile2012-11-25 11:39:35
421021FreeBSDbsdUNCONFIRMEDsys-libs/e2fsprogs-libs-1.42.3 fails to install because of include 2012-07-15 22:52:36
445594Core systembluenessUNCONFIRMEDsys-apps/coreutils - FAIL: tests/cp/fiemap-FMR.sh - Fails src_test with -march=native : valgrind "un2013-02-12 03:34:41
447826Core systembluenessUNCONFIRMEDsys-kernel/hardened-sources-2.6.32-r143 fails to compile for ia64: include/linux/random.h:91:19: err2013-01-18 23:15:20
437416LibrarybluenessUNCONFIRMEDnet-libs/libmicrohttpd-0.9.21 fails tests with USE="ssl"2012-12-26 13:26:06
401317ApplicationsbluenessUNCONFIRMEDnet-misc/curl-7.24.0: test cases failed: 1007 1009 1049 1093 1094 10992012-03-24 18:04:32
410477ApplicationsbluenessUNCONFIRMEDnet-p2p/bitcoind-0.5* - init.d script's stop action fails to stop daemon2013-01-25 18:58:34
430010ApplicationsbluenessUNCONFIRMEDapp-admin/webapp-config-1.50.19 fails test: WebappConfig.content.Contents2012-08-05 14:22:59
427972PrintingbillieUNCONFIRMEDnet-print/hplip - Scanning with hplip fails: Invalid argument2012-11-13 18:44:02
405195ApplicationsbazaarUNCONFIRMEDdev-vcs/bzr-2.4.2 fails tests (test_btree_index)2012-09-18 11:45:46
458496Core systembase-systemUNCONFIRMEDsys-apps/util-linux-2.22.2 install fails with: unable to read SONAME from libmount.so2013-02-20 20:32:45
457556Applicationsbase-systemUNCONFIRMEDsys-apps/texinfo-4.13-r2 fails with ncurses[tinfo]2013-02-14 18:19:20
457558Librarybase-systemUNCONFIRMEDsys-libs/readline-6.2_p4 fails with ncurses[tinfo]2013-02-14 18:20:16
456906Core systembase-systemUNCONFIRMEDsys-block/open-iscsi iscsiadm fails with sh: /sbin/iscsid: No such file or directory2013-02-13 18:58:13
453098Core systembase-systemUNCONFIRMEDsys-devel/patch-2.7.1-r1: fails tests crlf-handling and need-filename2013-01-21 11:54:50
447474Core systembase-systemUNCONFIRMEDsys-devel/make-3.82-r4 - fails 1 test in features/parallelism2012-12-17 16:10:34
446386Core systembase-systemUNCONFIRMEDsys-devel/automake-1.12.5 fails tests related to yacc2012-12-08 05:53:22
438998Core systembase-systemUNCONFIRMEDsys-fs/cryptsetup[selinux,static]: with sys-libs/libselinux-2.1.12, link fails with pcre missing sym2012-10-23 15:34:25
427340Core systembase-systemUNCONFIRMEDsys-boot/grub-static-0.97-r10 incorrectly detects /boot as read-only and fails2012-07-26 19:22:30
418287Core systembase-systemUNCONFIRMEDsys-boot/grub-0.97-r11 - Failed Running autoconf ! - configure.ac:59: error: possibly undefined macr2012-10-09 04:21:54
419529Applicationsbase-systemUNCONFIRMEDsys-libs/db-4.8.30 fails tests with no space left on device2012-06-04 10:55:39
419741Applicationsbase-systemUNCONFIRMEDdev-util/mono-tools-2.10 fails to emerge with Automake 1.11.52012-06-11 07:28:14
422877Core systembase-systemUNCONFIRMEDnet-firewall/iptables: ip6tables "state" test fails; will not jump to ACCEPT on ESTABLISHED,RELATED 2013-02-16 13:31:38
418177Core systembase-systemUNCONFIRMEDsys-power/apcupsd-3.14.8-r1: apcupsd.powerfail init script runlevel check fails when shutting down2012-10-11 16:58:37
415799Core systembase-systemUNCONFIRMEDsys-devel/autoconf-2.69 fails test Go2012-05-15 14:45:53
408047Core systembase-systemUNCONFIRMEDsys-fs/cryptsetup-1.4.1 fails 4 tests : password-hash-test loopaes-test compat-test api-test2013-01-20 10:26:44
406723Core systembase-systemUNCONFIRMEDsys-devel/autoconf-2.13: Fails test AC_FUNC_GETLOADAVG2013-01-16 01:39:00
399491Core systembase-systemUNCONFIRMEDsys-devel/automake-1.11.2-r1 - fails py-compile-basic.test py-compile-basic2.test py-compile-basedir2012-02-06 11:51:29
402057Core systembase-systemUNCONFIRMEDsys-power/apcupsd-3.14.10-r1 - daemon fails to stop during shutdown2012-08-03 19:38:52
403249Core systembase-systemUNCONFIRMEDsys-apps/coreutils-8.14: Fails test-parse-datetime (exit: 134)2012-03-29 07:20:53
403279Core systembase-systemUNCONFIRMED=sys-apps/coreutils-8.15 fails FEATURES=test2012-02-18 16:37:27
404389Core systembase-systemUNCONFIRMED=sys-process/procps-3.3.3 fails tests2013-01-12 11:43:39
395475Core systembase-systemUNCONFIRMEDsys-devel/libtool-2.4.2 fails tests: 8 failed (5 expected failures).2012-05-23 17:17:13
383985Librarybase-systemUNCONFIRMEDdev-libs/libpcre-8.13-r1 fails test RunTest2012-12-02 15:46:18
384731Core systembase-systemUNCONFIRMEDsys-devel/libtool-2.4-r3 fails tests 42, 84, 112 on hardened2011-11-21 22:32:49
386565Ebuildsbase-systemUNCONFIRMEDsys-devel/libtool-2.4-r1: failed (emake failed)2011-10-11 05:39:18
390245Core systembase-systemUNCONFIRMEDsys-fs/mtools-4.0.15 - mcd fails to mount SD memory card (with all available (tested) card readers)2011-11-20 07:19:18
391809Core systembase-systemUNCONFIRMEDSystem fails to reboot/halt when root is on iSCSI2012-08-21 07:24:59
383339Applicationsbase-systemUNCONFIRMEDapp-admin/syslog-ng-3.2.4: init script fails to start with ethernet bonding2011-09-19 10:38:08
379865Ebuildsbase-systemUNCONFIRMEDsys-apps/acl-2.2.51[nfs] fails acl-2.2.42-CITI_NFS4_ALL-2.dif2012-09-04 18:27:25
368997Ebuildsarmin76UNCONFIRMEDnet-misc/tightvnc: /etc/ini.d/vnc failes to start when media-fonts/font-misc-misc is installed with 2012-06-23 17:45:55
456362Libraryarfrever.ftaUNCONFIRMEDnet-libs/neon with >=dev-libs/openssl-1.0.1 - net-fs/davfs2 and net-misc/cadaver fail to connect to 2013-02-12 22:59:56
436596Applicationsandrej.filipcicUNCONFIRMEDnet-fs/openafs-1.6.1-r1: parallel build failure - In file included from db_dump.c:31:0: database.h:12012-09-29 15:38:55
380957OtheraltUNCONFIRMEDdev-libs/newt: failed to compile on Mac OSX2011-09-13 15:59:04
380959OtheraltUNCONFIRMEDapp-arch/dpkg: failed to compile on Mac OSX2011-10-08 16:59:55
384401OtheraltUNCONFIRMEDapp-text/texlive-core-2011-r4: failed to compile on prefix/Mac OSX2011-09-25 06:48:07
403551OtheraltUNCONFIRMEDCompilation of gcc-4.5.3-r1 fails with "configure: error: Link tests are not allowed after GCC_NO_EX2012-02-14 10:57:13
452734OtheraltUNCONFIRMEDwww-client/firefox-18.0-r1 fails to build (prefix) - fatal error: jemalloc.h: No such file or direct2013-01-29 19:41:01
456848OtheraltUNCONFIRMEDdev-libs/openssl[ipv6] fails on non-GNU prefix platforms2013-02-13 18:50:45
450076ApplicationsalexxyUNCONFIRMEDapp-text/fbreader build fails2013-01-15 00:43:45
438578DevelopmentaidecoeUNCONFIRMEDdev-python/pyro-4.14 fails to build with Python3.32012-12-26 12:48:10
392727DevelopmentadaUNCONFIRMEDdev-lang/gnat-gcc-4.3.5: fetch failed missing gnatboot-4.3-amd64.tar.bz22012-02-03 18:23:19
411321Ebuildsa3liUNCONFIRMEDsys-boot/plymouth boot fails : switchroot can't switch /dev from /sysroot/dev2012-04-23 20:05:34
399739Libraryrobbat2UNCONFIRMEDdev-db/libdbi-drivers-0.8.3 fails to return column information for empty sqlite3 table2012-10-26 16:54:27
421849UnspecifiedramerethUNCONFIRMEDdev-vcs/gitolite and dev-vcs/gitolite-gentoo - gl-setup fails:Unsuccessful stat on filename containi2012-06-28 20:12:53
366885Prefix SupportprefixUNCONFIRMEDx11-misc/xdg-user-dirs-0.13: build fails because of missing -liconv and _strndup on Darwin2011-05-11 14:09:14
312161GNOMEgnomeUNCONFIRMEDgnome-base/libbonobo-2.24.2 fails to build on hardened with2013-02-19 13:28:21
339725EbuildsaballierUNCONFIRMEDmedia-sound/lmms fails to build remote_vst_plugin: winebuild: as --32 failed with status 12011-04-19 16:10:52


back



Other free services
toURL.org
Shorten long
URLs to short
links like
http://tourl.org/2
tourl.org
.
Reverse DNS lookup
Find out which hostname(s)
resolve to a
given IP or other hostnames for the server
www.reversednslookup.org

New Packages

- as rdf newsfeed
- as rss newsfeed
- as Atom newsfeed
2019-11-22
2019-11-21
rdf newsfeed | rss newsfeed | Atom newsfeed
- Powered by LeopardCMS - Running on Gentoo -
Copyright 2004-2018 Sascha Nitsch Unternehmensberatung UG(haftungsbeschänkt)
Valid XHTML1.1 : Valid CSS : buttonmaker
- Level Triple-A Conformance to Web Content Accessibility Guidelines 1.0 -
- Copyright and legal notices -
Time to create this page: 16.7 ms