from small one page howto to huge articles all in one place
 

search text in:




Other .linuxhowtos.org sites: www.linuxhowtos.org
toolsntoys.linuxhowtos.org



Last additions:
How to make X listen on port 6000

How to make X listen on port 6000

words:

34

views:

73561

userrating:

average rating: 1.2 (8 votes) (1=very good 6=terrible)


May, 25th 2007:
April, 26th 2007:
Apr, 10th. 2007:
Druckversion . pdf icon
You are here: Portage


Details of app-emacs/rg:

Description: GNU Emacs search tool based on ripgrep
Homepage:
https://rgel.readthedocs.io/ https://github.com/dajva/rg.el/

available versions:

releasesalphaamd64armhppaia64mipsppcppc64ppc macoss390shsparcx86USE-Flagsdependenciesebuild warnings
rg-2.3.0 -------------none
show
show
Legend:
+ stable
~ testing
- not available
some ebuild warning depend on specific use-flags or architectures, all ebuild-warnings are shown.

Known bugs:
bug IDcomponentassigned tostatusdescriptionlast change
146951Core systemalphaUNCONFIRMEDsys-fs/quota - value too large for defined data type on Alpha systems2011-12-02 19:03:44
333285Toolstools-portageUNCONFIRMEDapp-portage/gentoolkit: revdep-rebuild: add variable to make.conf default emerge options for revdep-2013-01-18 16:29:12
365029Enhancement/Feature Requestsdev-portageUNCONFIRMEDemerge-webrsync incorrect/incomplete proxy error codes handling2011-05-10 11:19:57
365665Ebuildsx11UNCONFIRMEDx11-base/xorg-server-1.9.5 CONFIGURE_OPTIONS are deprecated, use XORG_CONFIGURE_OPTIONS instead2011-11-19 01:13:08
367319Applicationsx11UNCONFIRMEDx11-base/xorg-server: After a change my keyboard to USB model, no X-programs starts and Xorg log con2011-05-16 08:42:50
367479Enhancement/Feature Requestsdev-portageUNCONFIRMEDemerge fetch function should be mirror-selective depending on ebuild location2012-12-07 05:07:03
368049JavajavaUNCONFIRMEDdev-java/jjtraveler-0.4.3-r2 does not emerge, fails unpack2012-06-26 02:05:17
369987Ebuildsmedia-tvUNCONFIRMEDapp-misc/lirc-0.9.0 emerge error econf failed2012-07-17 20:43:17
370053Unspecifiedx11UNCONFIRMEDx11-drivers/ati-drivers: xorg doesn't exit on shutdown2011-09-09 00:54:14
370287Applicationsmedia-tvUNCONFIRMEDapp-misc/lirc-0.9.0 fails to emerge, because 'struct i2c_adapter’ has no member named ‘id’2012-07-17 20:40:06
370305Applicationsx11UNCONFIRMED2011-08-05 20:47:15
370703Applicationsmysql-bugsUNCONFIRMEDdev-db/myodbc-5.1.6 - emerge --config fails: odbcinst: SQLWritePrivateProfileString failed with Gene2011-06-10 02:05:40
371373Ebuildsmaintainer-wantedUNCONFIRMEDapp-i18n/wordforge-0.8_rc1 - Offline translation and localization program working internally with XL2011-06-13 22:39:51
371447Core - Configurationdev-portageUNCONFIRMEDportage-2.2.0_alpha40 :: emerge ignores wget bind_address option2011-06-16 09:56:45
371911Otherinfra-bugsUNCONFIRMEDrequesting an A record for contest.gentoo.org2012-05-05 18:33:49
373281ApplicationsxemacsUNCONFIRMEDapp-editors/xemacs-21.5.31 fails to emerge, because check-features.el can not be loaded2013-02-17 11:58:08
373473UnspecifiedrafaelmartinsUNCONFIRMEDg-octave/optiminterp-0.3.2 fails to emerge if MAKEOPTS is not "-j1"2011-07-08 21:19:20
373847ApplicationshannoUNCONFIRMEDmedia-gfx/gimp-2.6.11-r1: crash on startup with error GLib-WARNING ignoring no-arg, optional-arg or 2011-10-22 18:15:20
373909Applicationsqmail-bugsUNCONFIRMEDnet-mail/qmailadmin-1.2.12: unmerge chokes on webapp-config2011-07-03 16:21:55
376505EbuildsnxUNCONFIRMEDnet-misc/nxserver-freenx should depend on xorg-server2011-07-26 19:05:18
378557Librarymedia-videoUNCONFIRMEDmedia-libs/libvpx-0.9.7: Compile failure with debug USE flag - "No rule to make target libvpx_g.so, 2012-09-15 05:01:43
379033Serverqmail-bugsUNCONFIRMEDmail-filter/qmail-scanner: Causing problems with RBL-checks activated spamassassin on target when se2011-08-14 02:01:12
379827Ebuildsx11UNCONFIRMEDx11-base/xorg-server Patch for Hotkey Release Layout Switching (unofficial solution to bug on freed2012-06-06 06:40:18
380295Conceptual/Abstract Ideasdev-portageUNCONFIRMED[patch] sys-apps/portage: Enhanced output for emerge --pretend --fetchonly2012-09-06 20:12:21
380459PMS/EAPIpms-bugsUNCONFIRMEDMERGE_TYPE phases aren't defined2011-08-24 17:51:29
383323Javadev-portageUNCONFIRMEDsys-apps/portage: emerges pulls in older jdk slot when newer slot is masked (newer masked slot remai2012-09-06 19:32:08
384033Applicationsx11UNCONFIRMEDx11-base/xorg-server[xvfb]: add xvfb-run wrapper script2011-09-25 19:48:19
384581Mac OSXprefixUNCONFIRMEDapp-editors/emacs-23.3-r2: emerge failed with error unexec: my_endbss_static is not in section __bss2011-10-31 03:04:33
384603Core systempam-bugsUNCONFIRMEDsys-auth/pam_ssh-1.97-r2 (and r3) forgets to set gids in session start2011-10-09 03:06:42
384685Unspecifiedx11UNCONFIRMEDXorg fonts should warn about needing a re-login2012-07-13 08:51:01
385131CorepythonUNCONFIRMEDapp-admin/python-updater-0.9: append --keep-going to emerge2012-03-17 11:41:48
385761Applicationsshell-toolsUNCONFIRMEDdev-util/colorgcc: please submit gentoo patches to upstream at github2011-10-10 14:45:07
386163Core systempythonUNCONFIRMEDEmerging app-admin/eselect-python-20100321 fails with 2011-10-09 11:37:24
386269UnspecifiedsciUNCONFIRMEDsci-libs/scipy-0.9.0-r2 fails to emerge due to missing blas2012-06-03 10:35:59
387283ApplicationsvoipUNCONFIRMEDFailed to emerge net-voip/linphone-3.3.22012-10-23 16:24:00
388479Unspecifiedx11UNCONFIRMEDxorg-server-1.9.5-r1 fails to build when docbook-xml-dtd:4.3 is missing2011-10-25 21:12:48
389709JavajavaUNCONFIRMEDdev-java/icedtea-7.2.0-r1: failed to emerge due to SIGSEGV in the build process2012-11-02 14:42:48
389789Unspecifiedx11UNCONFIRMEDx11-base/xorg-server-1.9.5-r1 - work/xorg-server-1.9.5/doc/xml/dtrace/Xserver-DTrace.xml:4: warning:2011-11-13 16:00:12
389837Ebuildsmaintainer-wantedUNCONFIRMEDebuild request x86_energy_perf_policy(8)2011-11-08 21:27:01
389843Coredev-portageUNCONFIRMEDemerge --skipfirst without --resume tries to emerge wrong packages with portage 2.2.0_alpha722011-11-08 01:14:55
390233Ebuildsmedia-tvUNCONFIRMEDmedia-tv/tvtime : request for patch merge (for wide monitors)2011-11-15 00:33:44
390669Prefix SupportprefixUNCONFIRMEDdev-lang/ocaml-3.12.0 emerge fails with ocamlopt useflag2011-11-29 19:27:40
391317Enhancement/Feature Requestsdev-portageUNCONFIRMEDsys-apps/portage: Multiple, consistent verbosity levels for emerge2011-11-22 13:28:07
392243JavasciUNCONFIRMED[science overlay] dev-java/jlatexmath-0.9.4 fails to emerge because of ACCESS VIOLATION at /root/.ja2011-12-04 02:58:03
392247Core systemkernel-miscUNCONFIRMEDsys-kernel/module-rebuild-0.7 doesn't respect EMERGE_DEFAULT_OPTS variable2011-12-04 02:58:30
392979Prefix SupportprefixUNCONFIRMEDmedia-gfx/fontforge-20110222-r1 fails to compile on x86-macos2012-05-31 12:28:59
394535Core systembase-systemUNCONFIRMEDall netkit packages: ftp.uk.linux.org is dead2011-12-21 00:03:17
395387Librarymedia-videoUNCONFIRMEDmedia-libs/x264-0.0.20111218 - fatal: ambiguous argument 'origin/master': unknown revision or path n2012-02-04 20:00:18
396057ApplicationssciUNCONFIRMED[science-overlay] embassy-phylipnew-3.69 fails to emerge due to wrong filesize2012-02-20 14:34:00
396063ApplicationssciUNCONFIRMED[science-overlay] embassy-mse fails to emerge due to wrong filesize2012-02-20 14:33:56
396065ApplicationssciUNCONFIRMED[science-overlay] embassy-topo fails to emerge due to wrong filesize2012-02-20 14:33:52
396091ApplicationssciUNCONFIRMED[science-overlay] dev-perl/Bio-BigFile-1.06 fails to emerge because of relocation problem2012-01-01 08:50:47
396657ApplicationssciUNCONFIRMED[science-overlay] dev-perl/Bio-BigFile-1.06 fails to emerge due to missing jkweb.a2012-02-11 16:02:44
399577Core - Dependenciesdev-portageUNCONFIRMEDportage/emerge fails to compute dependencies and fails to report what triggered the problem2012-01-22 15:26:36
401207UnspecifiedfontsUNCONFIRMEDmedia-gfx/fontforge-20110222-r1: Crash while select more than 4 points while press "Shift/Ctrl"2012-01-28 17:49:29
401503Enhancement/Feature Requestsdev-portageUNCONFIRMEDemerge please ad short option to autounmask-write, -w suggested2012-01-30 17:48:55
401667EbuildshardenedUNCONFIRMEDnet-libs/libproxy-0.4.7 - Segmentation fault /usr/bin/gmcs /nologo /target:library /out:/var/tmp/por2012-02-03 21:57:47
401779Developmentx11UNCONFIRMEDx11-base/xorg-server-1.11.4 - XIO: fatal IO error 11 (Resource temporarily unavailable) on X server2012-02-01 17:35:48
402647Enhancement/Feature Requestsdev-portageUNCONFIRMEDsys-apps/portage emerge utility add layman sync functionality2012-02-09 06:29:42
402935Core - Dependenciesdev-portageUNCONFIRMEDemerge bad handle on --exclude with masked packages2012-02-10 18:02:04
402977Documentationdev-portageUNCONFIRMEDemerge --update doesn't update all packages which can be updated2012-03-05 10:02:22
405035Applicationssci-biologyUNCONFIRMED[science overlay] sci-biology/embassy-6.3.1 fails to emerge because of dependency on embassy-domaina2012-02-20 14:33:45
405783Documentationdev-portageUNCONFIRMEDemerge man page inadequate for -n option2012-02-27 00:24:38
410333ApplicationssoundUNCONFIRMEDmedia-sound/milkytracker-0.90.85 - In member function ‘virtual bool DecompressorGZIP::decompress(con2013-01-30 18:31:25
410727ApplicationsgnustepUNCONFIRMEDgnustep-base/gnustep-back-xlib-0.18.0 - sandbox violation in /root/var by plmerge libgnustep-back-012012-05-02 06:36:52
412149Ebuildsmaintainer-wantedUNCONFIRMEDnew ebuild: x11-plugins/pidgin-window_merge2012-04-29 18:28:01
412217LibrarysoundUNCONFIRMEDdev-libs/redland-1.0.15 has malformed Makefile, won't emerge: "missing separator"2012-04-16 17:47:14
413167Prefix SupportprefixUNCONFIRMEDsys-fs/fuse-2.9.0: emerge failed at compile phase.2012-04-22 23:17:14
413271Ebuildsx11UNCONFIRMEDx11-apps/rgb should DEPEND on x11-misc/util-macros - configure: No package 'xorg-macros' found2012-04-25 04:53:34
415209Enhancement/Feature Requestsdev-portageUNCONFIRMEDcross-emerge into alternative root does not install build time dependencies in alternative root2012-05-09 19:26:34
415329ApplicationsswaponUNCONFIRMEDdev-util/kbuild-0.1.9998_pre20110817 - gcc: argument to '-o' is missing2012-12-27 20:53:03
415611ApplicationsjosejxUNCONFIRMEDx11-misc/Xorgautoconfig - HOMEPAGE is dead2012-05-12 18:59:13
416465Prefix SupportprefixUNCONFIRMEDFailed to emerge dev-libs/protobuf-2.4.1 "No suitable threading library available."2012-08-12 20:11:24
416501Prefix SupportprefixUNCONFIRMEDdev-java/jffi-1.0.0 and jffi-1.0.11 failed to build: No rule to make target2012-05-18 14:04:04
416635Enhancement/Feature Requestsdev-portageUNCONFIRMEDPlease add new var EMERGE_INFO_OPTS for emerge --info2012-05-19 18:57:47
416907Core systemdev-portageUNCONFIRMEDOption to remove orphaned dependencies when using emerge -C2012-12-25 21:12:35
417033UnspecifiedrubyUNCONFIRMEDdev-ruby/childprocess-0.3.2 fails to emerge due to missing rspec/core/rake_task2012-05-25 08:09:51
417755Conceptual/Abstract Ideasdev-portageUNCONFIRMEDRecord emerge stages.2012-05-27 22:45:12
418281Applicationssci-mathematicsUNCONFIRMED[sci-overlay] sci-mathematics/scilab-5.3.3-r1 - .../work/scilab-5.3.3/modules/renderer/src/java/org/2012-12-25 13:20:36
418285Ebuildsmaintainer-wantedUNCONFIRMEDmedia-libs/dcmtk - DCMTK - a collection of libraries and applications implementing large parts the D2012-05-30 18:44:00
419381Core - Interface (emerge)dev-portageUNCONFIRMEDsys-apps/portage-2.2.0_alpha109: emerge autounmask comment shows confusing "required by" dependency 2013-02-18 21:17:14
419741Applicationsbase-systemUNCONFIRMEDdev-util/mono-tools-2.10 fails to emerge with Automake 1.11.52012-06-11 07:28:14
420459Enhancement/Feature Requestsdev-portageUNCONFIRMEDemerge --keep-going should leave behind --resume state for skipped/failed builds2012-09-07 04:13:06
420623PrintingprintingUNCONFIRMEDnet-print/foo2zjs-99999999 fails emerge with permission denied, access attempt outside the sandbox2013-01-27 23:07:16
420687Enhancement/Feature Requestsdev-portageUNCONFIRMEDemerge --info should include CC, CXX variables and ld type2012-06-11 12:58:34
422491Coredev-portageUNCONFIRMEDemerging updates to nfs-mounted file systems can cause running programs to segfault2012-06-21 02:59:59
424003Ebuildsmaintainer-wantedUNCONFIRMED[science overlay] sci-physics/thepeg - Toolkit for High Energy Physics Event Generation2013-02-08 01:02:18
424365EbuildsnirbheekUNCONFIRMEDdev-python/pypy-1.9-r1: AssertionError: must come from an argument to the function, got <-88;esp>2012-07-03 14:41:31
424984Ebuildsx11UNCONFIRMEDx11-base/xorg-server: allow to run as non-root2012-08-09 09:14:41
425312Other documentsdocs-teamUNCONFIRMEDnvidia guide xorg.conf can be simplified2012-07-13 20:07:44
426356ApplicationsnetmonUNCONFIRMEDnet-analyzer/mrtg-2.17.4: /etc/init.d/mrtg restart: overload arg '..' is invalid at /usr/lib/perl5/v2012-07-25 14:42:22
426736Applicationsx11UNCONFIRMEDx11-base/xorg-server segfaults at startup with x11-drivers/xf86-video-ati-6.14.4-r12012-07-18 21:13:12
426744FreeBSDbsdUNCONFIRMEDopenistgt -- an enterprise iscsi target port for FreeBSD2012-07-15 20:52:56
427040LibraryperlUNCONFIRMEDperl-core/Math-BigInt-1.997.0 "overload arg '..' is invalid" warning2012-07-19 15:41:53
427808EbuildsvoyageurUNCONFIRMEDx11-base/xorg-server-1.12.3 crashing at start-up when compiled with sys-devel/clang2012-12-31 12:32:19
427972PrintingbillieUNCONFIRMEDnet-print/hplip - Scanning with hplip fails: Invalid argument2012-11-13 18:44:02
428474Enhancement/Feature Requestsdev-portageUNCONFIRMEDPrint a warning after merge with wrong permissions on existing file2012-07-28 22:34:46
429922ApplicationsfontsUNCONFIRMEDmedia-gfx/fontforge-20120731 version bump2012-09-22 19:07:17
430070Applicationsx11UNCONFIRMEDx11-base/xorg-server-1.12.99.903 - using space in media-gfx/gimp-2.8.0-r1 causes segmentation fault 2012-08-08 18:40:49
430102Unclassifieddev-portageUNCONFIRMEDEmerging in a deleted directory outputs lots of "getcwd: cannot access parent directories: No such f2012-08-21 00:22:33
431000Applicationsmysql-bugsUNCONFIRMEDdev-db/mysql-5.1.62-r1 - make[1]: *** No rule to make target `../mysys/libmysys.la', needed by `fact2012-08-21 17:31:46
432698Libraryx11UNCONFIRMEDx11-base/xorg-server-1.12.99.905 - black is rendered as "lavender" (#ffddff)2013-01-18 22:36:00
432804Project-specific documentationphp-bugsUNCONFIRMEDhttp://www.gentoo.org/proj/en/php/php-upgrading.xml multiple small issues2012-08-27 10:29:56
432824Other documentsdocs-teamUNCONFIRMEDLVM2 Documentation should explain "lvcreate --target RAID1" vs "--mirrors"2012-08-26 11:19:31
433060Ebuildsmaintainer-wantedUNCONFIRMED[science overlay] sci-physics/herwig++ - High-Energy Physics event generator2013-02-08 01:03:07
433515Prefix SupportprefixUNCONFIRMEDemerge app-doc/NaturalDocs-1.52 : request Prefix support2012-10-10 12:41:47
433633ApplicationslordvanUNCONFIRMED[lordvan-overlay] media-video/openshot-1.4.1 blocks 'emerge -uvND world'2013-02-08 08:35:09
434526Applicationsx11UNCONFIRMEDx11-base/xorg-server message should be updated since sets are in stable portage2012-10-26 06:41:59
434908Core systemtoolchainUNCONFIRMEDsys-devel/gcc-4.6.3: ICE in .../work/qemu-kvm-1.1.1/target-i386/op_helper.c:3650:1: internal compile2013-01-04 21:00:13
435168EbuildsdotnetUNCONFIRMEDdev-lang/mono-2.10.9-r2 merge fails with configure error2012-10-04 18:38:09
435336Applicationsx11UNCONFIRMED>x11-base/xorg-server-1.9.5 - panning across virtual resolution does not work2012-12-06 21:04:54
435350DevelopmentradhermitUNCONFIRMEDcrossdev-20120721 msp430 target missing libcrt02012-09-19 08:59:37
435674Applicationsmobile-phoneUNCONFIRMEDapp-mobilephone/gnome-phone-manager-0.68: phonemgr.c:47:2: error: too many arguments to function 'bl2012-12-18 08:29:47
436814EbuildspythonUNCONFIRMEDsys-block/targetcli should depend on dev-python/urwid2012-11-10 12:32:07
437214Prefix SupportprefixUNCONFIRMEDdev-python/PyQt4-4.9.4-r1 fails to emerge2013-01-17 05:38:43
437494Core - Interface (emerge)dev-portageUNCONFIRMEDProvide a parameter for emerge so that 'emerge -pv' can display package description along with other2012-10-08 19:09:40
437624Developmentdev-zeroUNCONFIRMED=dev-php/libvirt-php-0.4.6: too few arguments to function ‘set_error’2012-11-08 01:34:50
438226Documentationinfra-bugsUNCONFIRMEDwrong doc link at http://www.gentoo.org/2012-10-13 14:26:55
438730Core systemkernel-miscUNCONFIRMEDSandbox violations when emerging kernel modules from /etc/kernel/postinst.d hook against a kernel bu2012-11-05 03:29:40
438816Coredev-portageUNCONFIRMEDsys-apps/portage-2.1.11.9 : /var/tmp/portage/._unmerge_/ directory not cleaned up2012-10-18 17:51:53
440212ServergrobianUNCONFIRMEDmail-mta/exim - R=localuser T=local_delivery defer (27): File too large: error while writing to /var2012-10-30 16:23:42
440214EbuildsqaUNCONFIRMED[tracker] packages with emerge messages that can be improved by checking the previous installed vers2013-02-14 19:45:48
440216ApplicationswilliamhUNCONFIRMEDnet-misc/dhcpcd-5.6.2 outputs emerge messages only relevant when upgrading from <5.02012-10-30 15:25:24
440380Core systembase-systemUNCONFIRMEDsys-boot/lilo: unmerging when /boot isn't mounted cleans /boot2012-11-02 08:21:22
441878LibraryyngwinUNCONFIRMEDx11-libs/cairo-1.12.6, 2013-01-11 18:30:33
442272LibrarypythonUNCONFIRMEDdev-python/pylint-0.26.0 merges with python 2.6 but not 2.72012-12-05 23:58:15
442322Ebuildsmysql-bugsUNCONFIRMEDdev-db/myodbc-5.1.6 - Build fails against dev-db/mysql-5.5.28 - error: too many arguments to functio2013-02-09 20:29:48
442324Ebuildslang-miscUNCONFIRMEDdev-lang/fpc ebuilds are largely outdated2012-11-08 09:14:16
443888Serverx11UNCONFIRMEDx11-base/xorg-server-1.13.0-r1 - ?2012-11-19 20:02:47
443958Server Problemmirror-adminUNCONFIRMEDrsync.nl.gentoo.org / 195.241.77.98 (tiscali) often reports "@ERROR: max connections (15) reached --2012-11-19 21:19:27
444022ApplicationssysadminUNCONFIRMEDnet-analyzer/nagios-plugins-1.4.16-r{2,3}: check_ping CRITICAL - You need more args!!!2012-11-21 09:27:19
444306Librarydev-zeroUNCONFIRMEDx11-drivers/xf86-input-vmmouse-12.9.0 with x11-base/xorg-server-1.13.0-r1 - Warning: attempting to l2013-01-01 21:31:12
444442Applicationsx11UNCONFIRMEDx11-drivers/xf86-video-sis with xorg-server-1.13.0-r1 - X segfaults at startup2012-11-25 11:46:37
444448Third-Party Toolstools-portageUNCONFIRMEDapp-portage/genlop: 'genlop -i' should print last merge time too2012-11-23 15:57:18
444502ApplicationspatrickUNCONFIRMEDapp-benchmarks/phoronix-test-suite-4.0.1 - No matter what, it complains that PHP_TARGETS is empty2012-12-25 22:09:37
444524DevelopmentembeddedUNCONFIRMEDcrossdev: emerge-wrapper: arm-unknown-linux-gnueabi-emerge virtual/init fail becaus of missing USE-f2012-11-26 17:26:27
444934genkernelgenkernelUNCONFIRMEDsys-kernel/genkernel-3.4.45: no support for iptables target LOG with gentoo-sources-3.5.72012-12-13 12:03:26
444964Applicationsx11UNCONFIRMEDx11-drivers/xf86-video-ati-7.0.0 with x11-base/xorg-server-1.13 - second X server fails to start on 2012-12-15 18:49:10
445158Libraryx11UNCONFIRMEDx11-drivers/ati-drivers-12.11_beta with x11-base/xorg-server-1.13.0-r1 - segmentation fault in X2012-12-31 15:41:10
445634Feature Requestmirror-adminUNCONFIRMEDmirrorservice.org mirror: update URLs2012-12-02 15:44:23
446172Core systempam-bugsUNCONFIRMEDsys-libs/pam-1.1.5 fails to cross-compile because flex is not installed in the target2013-01-09 09:31:35
446200Prefix SupportprefixUNCONFIRMED~x86-linux prefix: emerge --config =dev-db/mysql-5.5.28 fails2013-01-31 15:13:09
446204Core systemvapierUNCONFIRMEDsys-devel/crossdev: cross-emerge: support multiple parallel SYSROOTs for a single target2012-12-06 22:15:24
446344Core - Interface (emerge)dev-portageUNCONFIRMEDsys-apps/portage - `emerge --info' should include the rc_sys value of /etc/rc.conf2012-12-07 15:47:17
446432EbuildsembeddedUNCONFIRMEDx11-drivers/xf86-input-tslib does not work with xorg > 1.112012-12-27 18:11:59
447006Enhancement/Feature Requestsportage-utilsUNCONFIRMEDapp-portage/portage-utils' "qgrep" should parse multiple args over entire file for broader search re2012-12-12 17:20:02
447120Server Problemmirror-adminUNCONFIRMEDrsync://mirrors.eu.kernel.org/gentoo-portage/ out of sync2012-12-13 15:39:56
447306Applicationsx11UNCONFIRMEDx11-base/xorg-server-1.13.0-r1 with x11-drivers/xf86-video-intel-2.20.13 - rapid flickering of rando2013-02-05 03:24:34
447348Prefix SupportprefixUNCONFIRMEDbootstrap-prefix fails on emerge 'sed'2012-12-18 16:15:59
447546Unspecifiedx11UNCONFIRMEDx11-base/xorg-server-1.13.0-r1 - bashism in init.d script2012-12-19 15:05:07
447556Mac OSXprefixUNCONFIRMEDdev-python/virtualenv-1.8.4 emerge failed with error virtualenv-3.3 already exists2013-01-19 18:48:58
447796Prefix SupportprefixUNCONFIRMEDsys-apps/util-linux-2.20.1: fails to emerge2012-12-19 09:19:08
447846GamesgamesUNCONFIRMEDgames-roguelike/scourge removal request2012-12-19 16:40:04
447862Applicationsx11UNCONFIRMEDx11-drivers/xf86-video-ati, x11-base/xorg-server or related components memory leak2013-01-03 13:26:06
448098KDEx11UNCONFIRMEDx11-base/xorg-server-1.13 x11-apps/xinput - xinput --map-to-output 10 (keyboard related id) VGA1 (an2013-01-02 09:11:39
448206Core systemlu_zeroUNCONFIRMEDflag-o-matic.eclass: `CHOST=${CTARGET} strip-unsupported-flags` doesn't strip flags2013-01-07 17:18:12
449042Applicationsx11UNCONFIRMEDxorg-server, tslib, xinput - Pointer reappears in lower right hand corner after touchscreen tap foll2013-01-03 06:09:45
449112Keywording and Stabilizationx11UNCONFIRMEDx11-drivers/xf86-video-trident-1.3.6: RDEPEND="<=x11-base/xorg-server-1.13"2012-12-29 09:24:54
449692GamesgamesUNCONFIRMEDmedia-libs/libsdl-1.2.15 with >=x11-base/xorg-server-1.7 - cannot set gamma2013-01-05 21:05:36
449822Third-Party Toolstools-portageUNCONFIRMEDapp-portage/genlop - genlop -itc shows two emerge jobs when it is only one2013-01-03 00:07:55
450012Prefix SupportprefixUNCONFIRMEDwww-servers/lighttpd-1.4.31 fails to emerge2013-01-03 15:45:21
450388Prefix SupportprefixUNCONFIRMEDsci-libs/dsdp-5.8-r2: emerge fails in make_shared_library on OS X2013-01-05 14:03:11
450664Applicationsx11UNCONFIRMEDapp-emulation/wine-1.4.1 with >=x11-base/xorg-server-1.11 - mouse behaves erratically2013-01-08 04:22:22
451080Enhancement/Feature Requestsdev-portageUNCONFIRMEDsys-apps/portage emerge.log should record fetch time2013-01-10 17:15:32
451494gpackages - http://packages.gentoo.org/gpackagesUNCONFIRMEDpages on http://packages.gentoo.org with multiple "Homepages:" show no links to them and no license2013-01-25 09:34:32
451504ApplicationsmozillaUNCONFIRMEDwww-client/firefox-18.0/www-client/seamonkey-2.15 failed (install phase) [to emerge]; incorrect pag2013-02-07 15:47:44
452032Server Problemmirror-adminUNCONFIRMEDrsync.samerica.gentoo.org mirror: Input/Output error2013-01-14 14:05:17
452172Unclassifieddev-portageUNCONFIRMEDemerge's --jobs does not do full parallelization due to PDEPEND circular dependencies2013-01-15 11:55:26
452826EbuildstampakrapUNCONFIRMEDDeploy recruiting.gentoo.org2013-01-18 12:24:17
452916Servermaintainer-wantedUNCONFIRMEDnet-misc/stargazer - Stargazer billing system for small home and office networks.2013-02-03 16:39:33
453276Core systemalexxyUNCONFIRMEDsys-block/targetcli snapshot request2013-01-21 12:29:39
453480Applicationsmysql-bugsUNCONFIRMEDdev-db/mysql-5.1.66 - emerge --config fails after change of datadir in my.cnf2013-01-22 19:11:18
454228HardenedbluenessUNCONFIRMEDsys-kernel/hardened-sources-3.2.37-r2 fails to build for ia64: mm/mmap.c:1689:4: error: too few argu2013-02-21 02:26:58
454478SELinuxselinuxUNCONFIRMEDsys-apps/busybox-1.20.2 fails to merge on selinux profile with USE="static"2013-02-17 09:37:40
454496ServertommyUNCONFIRMEDdev-vcs/subversion - running /etc/xinetd.d/svnserve requires setting up a user/group through `emerge2013-01-29 14:37:34
455120Core systemjdhoreUNCONFIRMEDsys-apps/lm_sensors-3.3.3-r2 sensord init script does not pass arguments2013-02-04 02:30:17
455122EbuildszerochaosUNCONFIRMEDnet-analyzer/wireshark-1.8.5{,-r1} emerge fails - Can't locate object method "recurse" via package 2013-02-16 13:32:31
455468Unspecifiedx11UNCONFIRMED>x11-base/xorg-server-1.12.1 non-functional on PPC2013-02-04 21:33:52
456186ApplicationsjmbsvicettoUNCONFIRMEDmedia-sound/amarok-2.6.0 - make[2]: *** No rule to make target `/usr/lib64/libGLU.so', needed by `li2013-02-13 19:21:15
456220Applicationsx11UNCONFIRMEDx11-base/xorg-server on hardened - X exits fatally upon failure to enable sys_iopl2013-02-12 14:40:15
456360KDEkdeUNCONFIRMEDkde-base/print-manager looking for org.fedoraproject.Config.Printing2013-02-14 21:31:30
456682Applicationsx11UNCONFIRMEDx11-base/xorg-server-1.13.2 with x11-drivers/xf86-video-nouveau-1.0.6 crashes when displaying larger2013-02-12 10:53:49
456770Libraryhd_brummyUNCONFIRMEDmedia-libs/FusionSound-1.1.1-r1 - core_sound.c:328:6: error: too few arguments to function 'fusion_o2013-02-11 14:57:06
456792LibrarycppUNCONFIRMEDdev-libs/boost-1.52.0-r5 fails to compile with custom /etc/site-config.jam: could not find main targ2013-02-12 22:13:10
456970Applicationshardened-kernelUNCONFIRMEDapp-editors/emacs-24.2 failed to emerge with a segmentation fault on hardened-sources-3.7.4-r12013-02-12 22:17:52
457162Core systempms-bugsUNCONFIRMEDebuild's keepdir() alter target-dir permissions.2013-02-19 14:13:52
457634LibrarygraphicsUNCONFIRMEDmedia-libs/imlib2-1.4.5 with media-libs/giflib-5.0.x - pass NULL a second argument to DGifOpenFileHa2013-02-15 15:41:00
457642Applicationsfreedesktop-bugsUNCONFIRMEDapp-misc/tracker-0.14.4 with media-libs/giflib-5 - add NULL as second argument to DGifOpenFileHandle2013-02-15 15:43:43
457760Enhancement/Feature Requestsdev-portageUNCONFIRMEDemerge -v to print expected total build time according to emerge.log?2013-02-16 10:08:21
457782BugzillabugzillaUNCONFIRMEDbugs.gentoo.org (mostly) inaccessible to bots2013-02-16 03:09:26
457858Core systemwschlichUNCONFIRMEDsys-fs/inotify-tools moved from SourceForge to GitHub2013-02-17 17:03:51
457876Applicationsmaintainer-neededUNCONFIRMEDmedia-gfx/argyllcms - drop toolchain-funcs and virtual/pkgconfig2013-02-17 17:50:06
458022Core systemryaoUNCONFIRMEDsys-block/iscsitarget-1.4.20.2 - 1 out of 1 hunk FAILED -- saving rejects to file kernel/conn.c.rej2013-02-17 19:02:08
458156OpenRCopenrcUNCONFIRMEDsys-apps/openrc-0.11.8 creates /etc/runlevels/sysinit/udev with wrong target when ROOT is not /2013-02-19 09:30:05
458182Libraryx11UNCONFIRMEDdev-libs/wayland-1.0.4 - No rule to make target `wl_display_connect.xml', needed by `wl_display_conn2013-02-20 15:50:05
458284Core - Dependenciesdev-portageUNCONFIRMEDsys-apps/portage-2.1.11.52: 'emerge --depclean' does not remove old gentoo-sources2013-02-20 11:35:04
458386ApplicationsbugsUNCONFIRMEDapp-admin/collectd-5.2.0 - Assert error in VSM_n_Arg(), [...]/work/varnish-3.0.3/lib/libvarnishapi/v2013-02-20 14:29:22
458402KDEkdeUNCONFIRMEDkde-base/kig-4.10.0 fails to emerge with USE=scripting2013-02-20 05:25:24
458404LibrarycppUNCONFIRMEDdev-libs/boost-1.52.0-r5 - error: Duplicate name of actual target: libboost_system.so.1.2013-02-21 02:56:16
458598Applicationsbug-wranglersUNCONFIRMED[media-gfx/asymptote-2.21] emerge failed with USE="doc latex"2013-02-21 14:49:39


back



Support us on Content Nation

New Packages

- as rdf newsfeed
- as rss newsfeed
- as Atom newsfeed
2025-03-28
aspell-et - 0.1.21.1-r1
Ebuild name:

app-dicts/aspell-et-0.1.21.1-r1

Description

Aspell () language dictionary

Added to portage

2025-03-28

awscli - 1.38.22
Ebuild name:

app-admin/awscli-1.38.22

Description

Universal Command Line Environment for AWS

Added to portage

2025-03-28

bacula - 15.0.3
Ebuild name:

app-backup/bacula-15.0.3

Description

Featureful client/server network backup suite

Added to portage

2025-03-28

bind - 9.20.7
Ebuild name:

net-dns/bind-9.20.7

Description

Berkeley Internet Name Domain - Name Server

Added to portage

2025-03-28

bind-tools - 9.18.0-r1
Ebuild name:

net-dns/bind-tools-9.18.0-r1

Description

bind tools dig, nslookup, host, nsupdate, dnssec-keygen

Added to portage

2025-03-28

boto3 - 1.37.22
Ebuild name:

dev-python/boto3-1.37.22

Description

The AWS SDK for Python

Added to portage

2025-03-28

botocore - 1.37.22
Ebuild name:

dev-python/botocore-1.37.22

Description

Low-level, data-driven core of boto 3

Added to portage

2025-03-28

dash - 2.17.1
Ebuild name:

sci-visualization/dash-2.17.1

Description

Python framework for building ML & data science web apps

Added to portage

2025-03-28

datasets - 3.0.2
Ebuild name:

sci-ml/datasets-3.0.2

Description

Access and share datasets for Audio, Computer Vision, and NLP tasks

Added to portage

2025-03-28

deadbeef - 1.10.0
Ebuild name:

media-sound/deadbeef-1.10.0

Description

DeaDBeeF is a modular audio player similar to foobar2000

Added to portage

2025-03-28

downloader-cli - 0.3.4-r1
Ebuild name:

net-misc/downloader-cli-0.3.4-r1

Description

Simple downloader with an customizable progressbar

Added to portage

2025-03-28

expat - 2.7.1
Ebuild name:

dev-libs/expat-2.7.1

Description

Stream-oriented XML parser library

Added to portage

2025-03-28

f3 - 9.0
Ebuild name:

sys-block/f3-9.0

Description

Utilities to detect broken or counterfeit flash storage

Added to portage

2025-03-28

firefox-bin - 128.8.1
Ebuild name:

www-client/firefox-bin-128.8.1

Description

Firefox Web Browser

Added to portage

2025-03-28

firefox-bin - 136.0.4
Ebuild name:

www-client/firefox-bin-136.0.4

Description

Firefox Web Browser

Added to portage

2025-03-28

freedm - 0.13.0
Ebuild name:

games-fps/freedm-0.13.0

Description

A 32-level game designed for competitive deathmatch play

Added to portage

2025-03-28

freedm-data - 0.13.0
Ebuild name:

games-fps/freedm-data-0.13.0

Description

Game resources for FreeDM

Added to portage

2025-03-28

freedoom - 0.13.0
Ebuild name:

games-fps/freedoom-0.13.0

Description

A complete free-content single-player focused game based on the Doom engi

Added to portage

2025-03-28

freedoom-data - 0.13.0
Ebuild name:

games-fps/freedoom-data-0.13.0

Description

Game resources for Freedoom Phase 1+2

Added to portage

2025-03-28

fsautocomplete - 0.77.5
Ebuild name:

dev-dotnet/fsautocomplete-0.77.5

Description

F language server using the Language Server Protocol

Added to portage

2025-03-28

gherkin-official - 32.0.1
Ebuild name:

dev-python/gherkin-official-32.0.1

Description

Gherkin parser/compiler for Python

Added to portage

2025-03-28

gnome-shell-extension-bing-wallpaper - 51
Ebuild name:

gnome-extra/gnome-shell-extension-bing-wallpaper-51

Description

Change your wallpaper daily to the bing.com bac

Added to portage

2025-03-28

gnome-shell-extension-dash-to-panel - 68
Ebuild name:

gnome-extra/gnome-shell-extension-dash-to-panel-68

Description

An icon taskbar for the Gnome Shell

Added to portage

2025-03-28

griffe - 1.7.0
Ebuild name:

dev-python/griffe-1.7.0

Description

Signature generator for Python programs

Added to portage

2025-03-28

httparty - 0.23.0
Ebuild name:

dev-ruby/httparty-0.23.0

Description

Makes http fun Also, makes consuming restful web services dead easy

Added to portage

2025-03-28

incus - 6.0.3-r1
Ebuild name:

app-containers/incus-6.0.3-r1

Description

Modern, secure and powerful system container and virtual machine mana

Added to portage

2025-03-28

incus - 6.10.1-r1
Ebuild name:

app-containers/incus-6.10.1-r1

Description

Modern, secure and powerful system container and virtual machine man

Added to portage

2025-03-28

linux-apfs-rw - 0.3.13
Ebuild name:

sys-fs/linux-apfs-rw-0.3.13

Description

APFS module for linux, with experimental write support

Added to portage

2025-03-28

mond - 0.11.2
Ebuild name:

dev-lang/mond-0.11.2

Description

Mond is a scripting language for .NET Core

Added to portage

2025-03-28

nanobind - 2.6.0
Ebuild name:

dev-python/nanobind-2.6.0

Description

Tiny and efficient C++/Python bindings

Added to portage

2025-03-28

pyasn1-modules - 0.4.2
Ebuild name:

dev-python/pyasn1-modules-0.4.2

Description

pyasn1 modules

Added to portage

2025-03-28

pydantic - 2.11.0
Ebuild name:

dev-python/pydantic-2.11.0

Description

Data parsing and validation using Python type hints

Added to portage

2025-03-28

pytools - 2025.1.2
Ebuild name:

dev-python/pytools-2025.1.2

Description

Collection of tools missing from the Python standard library

Added to portage

2025-03-28

qtox - 1.18.3-r1
Ebuild name:

net-im/qtox-1.18.3-r1

Description

Instant messaging client using the encrypted p2p Tox protocol

Added to portage

2025-03-28

radicale - 3.5.0
Ebuild name:

www-apps/radicale-3.5.0

Description

A simple CalDAV calendar server

Added to portage

2025-03-28

razer-cli - 2.2.1-r2
Ebuild name:

sys-apps/razer-cli-2.2.1-r2

Description

Command line interface for controlling Razer devices on Linux

Added to portage

2025-03-28

razercommander - 1.2.1.2-r3
Ebuild name:

sys-apps/razercommander-1.2.1.2-r3

Description

GTK contol center for managing Razer peripherals on Linux

Added to portage

2025-03-28

scons - 4.9.1
Ebuild name:

dev-build/scons-4.9.1

Description

Extensible Python-based build utility

Added to portage

2025-03-28

semi - 1.14.7_p20230811-r1
Ebuild name:

app-emacs/semi-1.14.7_p20230811-r1

Description

A library to provide MIME feature for GNU Emacs

Added to portage

2025-03-28

sqlalchemy - 2.0.40
Ebuild name:

dev-python/sqlalchemy-2.0.40

Description

Python SQL toolkit and Object Relational Mapper

Added to portage

2025-03-28

sqlglot - 26.12.0
Ebuild name:

dev-python/sqlglot-26.12.0

Description

An easily customizable SQL parser and transpiler

Added to portage

2025-03-28

swtpm - 0.10.0-r1
Ebuild name:

app-crypt/swtpm-0.10.0-r1

Description

Libtpms-based TPM emulator

Added to portage

2025-03-28

tox - 4.25.0
Ebuild name:

dev-python/tox-4.25.0

Description

virtualenv-based automation of test activities

Added to portage

2025-03-28

txt2tags - 3.9-r1
Ebuild name:

app-text/txt2tags-3.9-r1

Description

Generate marked up documents (HTML, etc.)from a plain text file with marku

Added to portage

2025-03-28

types-setuptools - 77.0.2.20250328
Ebuild name:

dev-python/types-setuptools-77.0.2.20250328

Description

Typing stubs for setuptools

Added to portage

2025-03-28

vivaldi - 7.2.3621.71
Ebuild name:

www-client/vivaldi-7.2.3621.71

Description

A browser for our friends

Added to portage

2025-03-28

vivaldi-snapshot - 7.2.3641.3
Ebuild name:

www-client/vivaldi-snapshot-7.2.3641.3

Description

A browser for our friends

Added to portage

2025-03-28

word_cloud - 1.9.4
Ebuild name:

media-gfx/word_cloud-1.9.4

Description

A little word cloud generator in Python

Added to portage

2025-03-28

youtube-search-python - 1.6.6-r2
Ebuild name:

dev-python/youtube-search-python-1.6.6-r2

Description

Get YouTube video information using link WITHOUT YouTube

Added to portage

2025-03-28

yt-dlp - 2025.03.27
Ebuild name:

net-misc/yt-dlp-2025.03.27

Description

youtube-dl fork with additional features and fixes

Added to portage

2025-03-28

2025-03-27
0xtools - 2.0.3-r4
Ebuild name:

dev-util/0xtools-2.0.3-r4

Description

Always-on profiling for production systems

Added to portage

2025-03-27

absl-py - 2.2.1
Ebuild name:

dev-python/absl-py-2.2.1

Description

Abseil Python Common Libraries

Added to portage

2025-03-27

aspell-el - 0.08.0-r1
Ebuild name:

app-dicts/aspell-el-0.08.0-r1

Description

Aspell () language dictionary

Added to portage

2025-03-27

aspell-en - 2020.12.07.0-r1
Ebuild name:

app-dicts/aspell-en-2020.12.07.0-r1

Description

Aspell () language dictionary

Added to portage

2025-03-27

aspell-eo - 2.1.20000225.2-r1
Ebuild name:

app-dicts/aspell-eo-2.1.20000225.2-r1

Description

Aspell () language dictionary

Added to portage

2025-03-27

aspell-es - 1.11.2-r1
Ebuild name:

app-dicts/aspell-es-1.11.2-r1

Description

Aspell () language dictionary

Added to portage

2025-03-27

aspell-et - 0.1.21.1-r1
Ebuild name:

app-dicts/aspell-et-0.1.21.1-r1

Description

Aspell () language dictionary

Added to portage

2025-03-27

awscli - 1.38.21
Ebuild name:

app-admin/awscli-1.38.21

Description

Universal Command Line Environment for AWS

Added to portage

2025-03-27

bareos - 23.1.3
Ebuild name:

app-backup/bareos-23.1.3

Description

Featureful client/server network backup suite

Added to portage

2025-03-27

bareos - 23.1.3
Ebuild name:

dev-python/bareos-23.1.3

Description

python bindings for bareos network backup suite

Added to portage

2025-03-27

bareos - 24.0.1-r1
Ebuild name:

app-backup/bareos-24.0.1-r1

Description

Featureful client/server network backup suite

Added to portage

2025-03-27

bareos - 24.0.2
Ebuild name:

app-backup/bareos-24.0.2

Description

Featureful client/server network backup suite

Added to portage

2025-03-27

bareos - 24.0.2
Ebuild name:

dev-python/bareos-24.0.2

Description

python bindings for bareos network backup suite

Added to portage

2025-03-27

bareos-webui - 23.1.3
Ebuild name:

www-apps/bareos-webui-23.1.3

Description

Featureful client/server network backup suite

Added to portage

2025-03-27

bareos-webui - 24.0.2
Ebuild name:

www-apps/bareos-webui-24.0.2

Description

Featureful client/server network backup suite

Added to portage

2025-03-27

blazesym_c - 0.1.1
Ebuild name:

dev-libs/blazesym_c-0.1.1

Description

C bindings for blazesym, a library for address symbolization and related

Added to portage

2025-03-27

boto3 - 1.37.21
Ebuild name:

dev-python/boto3-1.37.21

Description

The AWS SDK for Python

Added to portage

2025-03-27

botocore - 1.37.21
Ebuild name:

dev-python/botocore-1.37.21

Description

Low-level, data-driven core of boto 3

Added to portage

2025-03-27

bpftrace - 0.23.0
Ebuild name:

dev-debug/bpftrace-0.23.0

Description

High-level tracing language for eBPF

Added to portage

2025-03-27

btrfs-progs - 6.14
Ebuild name:

sys-fs/btrfs-progs-6.14

Description

Btrfs filesystem utilities

Added to portage

2025-03-27

btrfsutil - 6.14
Ebuild name:

dev-python/btrfsutil-6.14

Description

Library for managing Btrfs filesystems

Added to portage

2025-03-27

c-blosc2 - 2.17.1
Ebuild name:

dev-libs/c-blosc2-2.17.1

Description

Blocking, shuffling and lossless compression library

Added to portage

2025-03-27

chrome-binary-plugins - 135.0.7049.41_beta
Ebuild name:

www-plugins/chrome-binary-plugins-135.0.7049.41_beta

Description

Binary plugins from Google Chrome for use in C

Added to portage

2025-03-27

chromium - 135.0.7049.41
Ebuild name:

www-client/chromium-135.0.7049.41

Description

Open-source version of Google Chrome web browser

Added to portage

2025-03-27

cmake - 4.0.0
Ebuild name:

dev-build/cmake-4.0.0

Description

Cross platform Make

Added to portage

2025-03-27

dnscrypt-proxy - 2.1.8
Ebuild name:

net-dns/dnscrypt-proxy-2.1.8

Description

Flexible DNS proxy, with support for encrypted DNS protocols

Added to portage

2025-03-27

dnsdist - 1.9.8-r1
Ebuild name:

net-dns/dnsdist-1.9.8-r1

Description

A highly DNS-, DoS- and abuse-aware loadbalancer

Added to portage

2025-03-27

dtrx - 8.5.3-r2
Ebuild name:

app-arch/dtrx-8.5.3-r2

Description

Do The Right eXtraction - extracts archives of different formats

Added to portage

2025-03-27

firefox - 136.0.3
Ebuild name:

www-client/firefox-136.0.3

Description

Firefox Web Browser

Added to portage

2025-03-27

gambit - 1.0.6
Ebuild name:

games-board/gambit-1.0.6

Description

Qt-based chess application + engine

Added to portage

2025-03-27

gcompris - 25.0-r1
Ebuild name:

games-kids/gcompris-25.0-r1

Description

Full featured educational application for children from 2 to 10

Added to portage

2025-03-27

golangci-lint - 2.0.2
Ebuild name:

dev-go/golangci-lint-2.0.2

Description

Fast linters runner for Go

Added to portage

2025-03-27

google-api-python-client - 2.166.0
Ebuild name:

dev-python/google-api-python-client-2.166.0

Description

Google API Client for Python

Added to portage

2025-03-27

google-chrome-beta - 135.0.7049.41
Ebuild name:

www-client/google-chrome-beta-135.0.7049.41

Description

The web browser from Google

Added to portage

2025-03-27

googleapis-common-protos-types - 1.19.0
Ebuild name:

dev-ruby/googleapis-common-protos-types-1.19.0

Description

Common protocol buffer types used by Google APIs

Added to portage

2025-03-27

griffe - 1.6.3
Ebuild name:

dev-python/griffe-1.6.3

Description

Signature generator for Python programs

Added to portage

2025-03-27

hepmc - 3.3.1
Ebuild name:

sci-physics/hepmc-3.3.1

Description

Event Record for Monte Carlo Generators

Added to portage

2025-03-27

huggingface_hub - 0.27.1
Ebuild name:

sci-ml/huggingface_hub-0.27.1

Description

a client library to interact with the Hugging Face Hub

Added to portage

2025-03-27

inline-snapshot - 0.20.10
Ebuild name:

dev-python/inline-snapshot-0.20.10

Description

Create and update inline snapshots in your Python tests

Added to portage

2025-03-27

kasts - 24.12.3-r1
Ebuild name:

media-sound/kasts-24.12.3-r1

Description

Convergent podcast application for desktop and mobile

Added to portage

2025-03-27

kclock - 24.12.3-r1
Ebuild name:

kde-misc/kclock-24.12.3-r1

Description

Convergent clock application for Plasma

Added to portage

2025-03-27

legacy-cgi - 2.6.3
Ebuild name:

dev-python/legacy-cgi-2.6.3

Description

Fork of the standard library cgi and cgitb modules (deprecated)

Added to portage

2025-03-27

libreoffice - 25.2.2.2
Ebuild name:

app-office/libreoffice-25.2.2.2

Description

A full office productivity suite

Added to portage

2025-03-27

libreoffice-l10n - 25.2.2.2
Ebuild name:

app-office/libreoffice-l10n-25.2.2.2

Description

Translations for the Libreoffice suite

Added to portage

2025-03-27

libxml2 - 2.13.7
Ebuild name:

dev-libs/libxml2-2.13.7

Description

XML C parser and toolkit

Added to portage

2025-03-27

logger - 1.7.0
Ebuild name:

dev-ruby/logger-1.7.0

Description

Provides a simple logging utility for outputting messages

Added to portage

2025-03-27

lzma - 19.00-r1
Ebuild name:

app-arch/lzma-19.00-r1

Description

LZMA Stream Compressor from the SDK

Added to portage

2025-03-27

microsoft-edge-dev - 136.0.3209.2
Ebuild name:

www-client/microsoft-edge-dev-136.0.3209.2

Description

The web browser from Microsoft

Added to portage

2025-03-27

mupdf - 1.25.2-r1
Ebuild name:

app-text/mupdf-1.25.2-r1

Description

A lightweight PDF viewer and toolkit written in portable C

Added to portage

2025-03-27

nvidia-drivers - 570.123.07
Ebuild name:

x11-drivers/nvidia-drivers-570.123.07

Description

NVIDIA Accelerated Graphics Driver

Added to portage

2025-03-27

opera - 117.0.5408.154
Ebuild name:

www-client/opera-117.0.5408.154

Description

A fast and secure web browser

Added to portage

2025-03-27

opera-beta - 118.0.5461.18
Ebuild name:

www-client/opera-beta-118.0.5461.18

Description

A fast and secure web browser

Added to portage

2025-03-27

opera-developer - 119.0.5482.0
Ebuild name:

www-client/opera-developer-119.0.5482.0

Description

A fast and secure web browser

Added to portage

2025-03-27

planarity - 4.0.0.0
Ebuild name:

sci-mathematics/planarity-4.0.0.0

Description

The edge addition planarity suite of graph algorithms

Added to portage

2025-03-27

polyglot - 2.0.4_p20210322
Ebuild name:

games-board/polyglot-2.0.4_p20210322

Description

Protocol adapter to run UCI chess engines under xboard

Added to portage

2025-03-27

pydantic-core - 2.33.0
Ebuild name:

dev-python/pydantic-core-2.33.0

Description

Core validation logic for pydantic written in Rust

Added to portage

2025-03-27

rfc3161-client - 1.0.1
Ebuild name:

dev-python/rfc3161-client-1.0.1

Description

An Opinionated Python RFC3161 Client

Added to portage

2025-03-27

ristretto - 0.13.4
Ebuild name:

media-gfx/ristretto-0.13.4

Description

A fast and lightweight picture viewer for Xfce

Added to portage

2025-03-27

rpds-py - 0.24.0
Ebuild name:

dev-python/rpds-py-0.24.0

Description

Python bindings to Rust's persistent data structures (rpds)

Added to portage

2025-03-27

scap-driver - 0.20.0
Ebuild name:

dev-debug/scap-driver-0.20.0

Description

Kernel module for dev-debug/sysdig

Added to portage

2025-03-27

screenkey - 1.5_p20230109-r2
Ebuild name:

x11-misc/screenkey-1.5_p20230109-r2

Description

A screencast tool to display your keys inspired by Screenflick

Added to portage

2025-03-27

slixmpp - 1.10.0
Ebuild name:

dev-python/slixmpp-1.10.0

Description

Python 3 library for XMPP

Added to portage

2025-03-27

spyder - 6.0.5
Ebuild name:

dev-python/spyder-6.0.5

Description

The Scientific Python Development Environment

Added to portage

2025-03-27

spyder-kernels - 3.0.3
Ebuild name:

dev-python/spyder-kernels-3.0.3

Description

Kernels used by spyder on its ipython console

Added to portage

2025-03-27

synapse - 1.127.1
Ebuild name:

net-im/synapse-1.127.1

Description

Reference implementation of Matrix homeserver

Added to portage

2025-03-27

sysdig - 0.40.1
Ebuild name:

dev-debug/sysdig-0.40.1

Description

A system exploration and troubleshooting tool

Added to portage

2025-03-27

system-monitoring-center - 2.26.0-r1
Ebuild name:

sys-apps/system-monitoring-center-2.26.0-r1

Description

Multi-featured system monitor GUI written in Python

Added to portage

2025-03-27

tbb - 2022.1.0
Ebuild name:

dev-cpp/tbb-2022.1.0

Description

High level abstract threading library

Added to portage

2025-03-27

unzip - 6.0_p29
Ebuild name:

app-arch/unzip-6.0_p29

Description

unzipper for pkzip-compressed files

Added to portage

2025-03-27

ut2004 - 3369.3-r4
Ebuild name:

games-fps/ut2004-3369.3-r4

Description

Editor's Choice Edition plus Mega Pack for the well-known first-person s

Added to portage

2025-03-27

ut2004-ded - 3369.3-r3
Ebuild name:

games-server/ut2004-ded-3369.3-r3

Description

Unreal Tournament 2004 Linux Dedicated Server

Added to portage

2025-03-27

xfce4-terminal - 1.1.5
Ebuild name:

x11-terms/xfce4-terminal-1.1.5

Description

A terminal emulator for the Xfce desktop environment

Added to portage

2025-03-27

rdf newsfeed | rss newsfeed | Atom newsfeed
- Powered by LeopardCMS - Running on Gentoo -
Copyright 2004-2020 Sascha Nitsch Unternehmensberatung GmbH
Valid XHTML1.1 : Valid CSS : buttonmaker
- Level Triple-A Conformance to Web Content Accessibility Guidelines 1.0 -
- Copyright and legal notices -
Time to create this page: 18.7 ms