from small one page howto to huge articles all in one place
 

search text in:




Other .linuxhowtos.org sites: www.linuxhowtos.org
toolsntoys.linuxhowtos.org



Last additions:
How to make X listen on port 6000

How to make X listen on port 6000

words:

34

views:

55583

userrating:

average rating: 1.5 (4 votes) (1=very good 6=terrible)


May, 25th 2007:
April, 26th 2007:
Apr, 10th. 2007:
Druckversion . pdf icon
You are here: Portage


Details of app-editors/ted:

Description: X-based rich text editor
Homepage:
https://www.nllgg.nl/Ted/

available versions:

releasesalphaamd64armhppaia64mipsppcppc64ppc macoss390shsparcx86USE-Flagsdependenciesebuild warnings
ted-2.23 -+----+----++none
show
show
Legend:
+ stable
~ testing
- not available
some ebuild warning depend on specific use-flags or architectures, all ebuild-warnings are shown.

Known bugs:
bug IDcomponentassigned tostatusdescriptionlast change
400763Toolstools-portageUNCONFIRMEDglsa-check list only affected versions2012-01-25 15:50:55
440380Core systembase-systemUNCONFIRMEDsys-boot/lilo: unmerging when /boot isn't mounted cleans /boot2012-11-02 08:21:22
424633EbuildssambaUNCONFIRMEDnet-fs/samba 3 vs. 4 should be SLOTted2013-01-09 17:21:01
458478LibraryyngwinUNCONFIRMEDx11-libs/cairo-9999 failed because cairo-1.10.2-qt-surface.patch outdated2013-02-20 21:19:46
452618DevelopmentyamakuzureUNCONFIRMED[seden overlay] dev-util/eclipse-sdk-3.7.1-r10 - Bug fixes regarding incorrectly slotted virtual/jdk2013-01-17 17:45:18
448098KDEx11UNCONFIRMEDx11-base/xorg-server-1.13 x11-apps/xinput - xinput --map-to-output 10 (keyboard related id) VGA1 (an2013-01-02 09:11:39
447862Applicationsx11UNCONFIRMEDx11-drivers/xf86-video-ati, x11-base/xorg-server or related components memory leak2013-01-03 13:26:06
433649Libraryx11UNCONFIRMEDsys-kernel/gentoo-sources-3.5, media-libs/mesa-8.1_rc1_pre20120814: i915: render error detected - In2012-09-16 12:44:13
434526Applicationsx11UNCONFIRMEDx11-base/xorg-server message should be updated since sets are in stable portage2012-10-26 06:41:59
401523Applicationsx11UNCONFIRMEDx11-apps/xdm-1.1.11: does not start from within a chrooted environment if LiveDVD was booted with no2012-01-31 19:37:14
401413Applicationsx11UNCONFIRMEDx11-apps/xdm-1.1.11-r1: elibtoolize called repeatedly2012-01-30 13:03:27
397901Applicationsx11UNCONFIRMED[x11 overlay] media-libs/glmark2-2011.08 - ../src/texture.cpp:81:48: ??????: expected type-specifier2012-01-10 16:33:32
381057Ebuildsx11UNCONFIRMEDkexec + x11-drivers/xf86-video-ati + sys-kernel/gentoo-sources-3.* + RadeonHD results in corrupted d2011-09-11 02:03:40
365665Ebuildsx11UNCONFIRMEDx11-base/xorg-server-1.9.5 CONFIGURE_OPTIONS are deprecated, use XORG_CONFIGURE_OPTIONS instead2011-11-19 01:13:08
438086Applicationsweb-appsUNCONFIRMEDwww-apps/gallery-2.3.1 - "Begin Installation" fails with "The requested URL /gallery/install/
<
2012-10-12 16:43:46
377105Applicationsweb-appsUNCONFIRMEDapp-admin/webapp-config-1.50.18: self.mkfile() dies while trying to delete a path to be created2011-08-04 02:04:41
443556EbuildsvoyageurUNCONFIRMEDsys-devel/clang-3.1 - Updated ebuild with +python and +doc2012-11-17 09:03:06
441864ApplicationsvimUNCONFIRMEDapp-editors/vim-7.3.646 vim: stack smashing attack in function - terminated2012-11-05 13:04:29
423137ApplicationsvimUNCONFIRMEDapp-editors/vim-7.3.409: Misleading and outdated hint on solving a problem2012-06-26 14:55:41
378987ApplicationsvimUNCONFIRMEDvim.eclass's unmatched useflags of perl and libperl message is outdated2011-08-13 04:29:52
414655Toolstools-portageUNCONFIRMEDapp-portage/gentoolkit - eshowkw undocumented output2012-12-25 01:56:31
382231Toolstools-portageUNCONFIRMEDapp-portage/gentoolkit-0.3.0.4 euse -i has undocumented output2011-09-19 18:28:14
453100Core systemtoolchainUNCONFIRMEDsys-devel/binutils-2.23.1: 43 unexpected failures2013-01-21 11:57:21
433778Core systemtoolchainUNCONFIRMEDsys-devel/prelink-20120628: prelink: gelf_getphdr.c:120: gelf_getphdr: Unexpected error: Resource te2012-12-25 07:40:36
373295UnspecifiedtoolchainUNCONFIRMEDsys-libs/glibc-2.12.2: building glibc interrupted in OpenVZ container, also tried rebuilding system2011-12-22 22:40:58
453020ApplicationstommyUNCONFIRMEDdev-vcs/subversion, please consider patch to fix paths reported for externals2013-01-19 19:26:52
434528ApplicationssoundUNCONFIRMEDmedia-sound/dagrab fails with buffer overflow detected when using cddb2012-09-10 11:44:45
441038ApplicationssoundUNCONFIRMEDdev-libs/redland-1.0.15 QA Notice: pkg-config files with wrong LDFLAGS detected2012-11-03 16:48:32
389491ApplicationssoundUNCONFIRMEDmedia-sound/timidity++ - timidity crashes when connected to rosegarden2011-11-08 15:37:25
446720VulnerabilitiessecurityUNCONFIRMED2012-12-11 12:34:11
431628Default ConfigssecurityUNCONFIRMEDinformation disclosure of the IP address of all connected users to all simple users2012-09-10 06:20:24
454298Ebuildssci-mathematicsUNCONFIRMEDsci-mathematics/maxima - maxima cannot be started from wxmaxima or cantor2013-02-04 03:36:37
392349VulnerabilitiessecurityUNCONFIRMEDsys-devel/gdb Loads untrusted files with possible arbitrary code execution (CVE-2011-4355)2011-12-30 07:19:51
454634DevelopmentrubyUNCONFIRMEDdev-lang/ruby-1.8.7_p371 - callback.func:1:7: error: expected identifier or '(' before 'long'2013-01-30 23:00:08
438708ApplicationsroxUNCONFIRMED2012-10-17 14:29:58
392459EbuildsroxUNCONFIRMEDrox-base/rox-launch: usage of deprecated method in ebuild2011-12-01 20:34:52
458288Applicationsrobbat2UNCONFIRMEDsys-apps/hwinfo stack smashing detected2013-02-19 20:31:17
437714Core systemrobbat2UNCONFIRMEDsys-fs/lvm2-2.02.97 init stop fails to deactivated lvs and vgs on shutdown2013-02-04 12:49:21
424657Applicationsrobbat2UNCONFIRMEDapp-portage/g-cpan-0.16.4-r1 uses code that is depreciated in perl-5.16.02012-07-18 05:39:50
403371Applicationsrobbat2UNCONFIRMEDsys-apps/rescan-scsi-bus-1.48: line 592: [: 1.03: integer expression expected2012-02-13 17:42:59
448788InstallCDreleaseUNCONFIRMEDAMD 64 install CD: wireless network card not detected (lenovo T61, Intel Wireless 4965) - missing fi2012-12-27 07:54:59
370803NetbootreleaseUNCONFIRMEDgentoo.igz has very limited set of NIC drivers - this breaks netboot for machines without e1000 or 2011-06-22 18:25:31
396467NetbootreleaseUNCONFIRMEDInstall gentoo via PXE (integrated squashfs.image + init patch)2012-08-24 16:17:54
424463EbuildsrafaelmartinsUNCONFIRMEDapp-portage/g-octave please provide an updated database2012-08-03 22:03:54
379033Serverqmail-bugsUNCONFIRMEDmail-filter/qmail-scanner: Causing problems with RBL-checks activated spamassassin on target when se2011-08-14 02:01:12
380379DevmanualqaUNCONFIRMEDQuickstart ebuild guide is outdated re: emake2011-08-23 15:27:47
420271ApplicationspythonUNCONFIRMED=dev-python/twisted-11.0.0: fails test wrt twisted.test.test_udp.Server2012-06-11 10:59:36
396211ApplicationsproaudioUNCONFIRMEDmedia-sound/ardour crashes - /usr/share/themes/Clearlooks/gtk-2.0/gtkrc:76: error: unexpected identi2012-10-06 14:26:04
372525ApplicationsproaudioUNCONFIRMEDmedia-sound/jack-audio-connection-kit-0.120.2 crashes with buffer overflow detected in jack_alsa.so2011-10-10 00:02:33
434940PrintingprintingUNCONFIRMEDnet-print/cups-1.6.1 prints square of number of prints requested2012-09-24 16:56:30
395021Prefix SupportprefixUNCONFIRMEDWriting ebuilds that have different dependencies across platforms undocumented2012-03-01 16:39:16
431144Applicationspolynomial-cUNCONFIRMEDnet-irc/xchat-2.8.8-r2 - saved configuration is corrupted on read or write2012-08-15 12:32:17
436360Applicationspolynomial-cUNCONFIRMEDwww-client/seamonkey-2.12.1 - /bin/sh: line 1: 24652 Aborted .../work/comm-release/seamonk/suite/ins2012-09-28 14:44:46
365643Ebuildspolynomial-cUNCONFIRMEDapp-emulation/virtualbox-additions-4.* License wrongly stated as PUEL2012-07-18 02:27:12
425214PMS/EAPIpms-bugsUNCONFIRMED'dohtml -r ${directory}/' has undocumented behavior2012-07-08 06:59:50
452568Ebuildsphp-bugsUNCONFIRMEDdev-php/phpunit should be slotted2013-01-16 16:30:51
454882DevelopmentperlUNCONFIRMEDdev-perl/TermReadKey-2.300.0 - ReadKey.o: file not recognized: file truncated - collect2: ld executi2013-01-31 23:12:14
421159DevelopmentperlUNCONFIRMEDvirtual/perl-libnet needs updated RDEPEND2012-06-15 15:36:15
416455ServerperlUNCONFIRMEDmail-filter/spamassassin-3.3.2-r1 - child process [3695] exited or timed out without signaling produ2012-05-27 12:05:55
424373ApplicationspatrickUNCONFIRMEDnet-misc/strongswan-5.0.0 - Outdated description about (non-)root privileges2012-07-03 14:39:13
410451ApplicationspatrickUNCONFIRMEDwww-servers/apache-2.4.1-r1 APACHE2_MPMS="itk" - configure: error: MPM itk is not supported on this 2013-02-16 13:20:37
403439ServerpatrickUNCONFIRMEDwww-servers/apache: remove deprecated AddDirectoryIndex from default config2013-02-16 14:05:28
385783ApplicationspatrickUNCONFIRMEDwww-servers/apache-2.2.21 cross-compilation fix (libtool related)2013-02-16 13:33:00
385779ApplicationspatrickUNCONFIRMEDapp-admin/apache-tools-2.2.21 cross-compilation fix (libtool related)2013-02-16 13:32:00
456908Core systempam-bugsUNCONFIRMEDsys-libs/pam-1.1.6-r2: /usr/lib64/portage/bin/isolated-functions.sh: line 215: wait: `Failed Running2013-02-16 21:10:14
402355Applicationspam-bugsUNCONFIRMEDsys-auth/pam_keystore HOMEPAGE outdated (404)2012-02-06 20:31:29
428282LibrarypachoUNCONFIRMEDnet-wireless/bluez-4.99 expected specifier-qualifier-list before ‘typeof’ in bluetooth.h2013-02-12 21:43:00
445192Other documentsoverlaysUNCONFIRMEDDeprecated references to /etc/make.conf in the Gentoo overlays users' guide2012-12-01 07:27:56
409787OpenRCopenrcUNCONFIRMEDsys-apps/openrc-0.9.9.3: "rc-status -a" doesn't display all started services2012-11-07 15:40:11
430224ApplicationsopenofficeUNCONFIRMEDapp-office/libreoffice-bin-3.5.4.2 - printing to CUPS fails before the job has been submitted2012-08-08 18:24:36
369851ApplicationsnxUNCONFIRMEDnet-misc/nx-3.4.0-r3 *** stack smashing detected ***: nxagent - terminated2012-07-12 06:06:30
428674ApplicationsnetmonUNCONFIRMEDnet-analyzer/ifmetric-0.3 with kernel 3.5 -
NETLINK: Packet too small or truncated! 32!=16!=101
2012-07-30 23:43:53
396171ApplicationsnetmonUNCONFIRMEDnet-misc/iperf-2.0.5 when using -i flag, interval calculated to be negative and spews output2011-12-27 21:01:05
388879Servernet-p2pUNCONFIRMEDnet-p2p/mldonkey-3.1.0: Exception setgid failed: Operation not permitted trying to set group_gid2011-11-21 00:31:52
453962Core systemnet-fsUNCONFIRMEDnet-fs/autofs-5.0.6-r5: umount automounted NFS share fails2013-02-16 13:31:29
433994Servermysql-bugsUNCONFIRMEDdev-db/mysql-5.1.62-r1 stack smashing detected in mysqld2012-09-05 17:17:06
386077ApplicationsmozillaUNCONFIRMED=mail-client/thunderbird-10.0.1 shows double entries in newly created address book contacts2012-07-06 07:46:22
379499ApplicationsmlUNCONFIRMEDnet-misc/unison-2.27.57-r1 stack smashing detected2011-08-19 00:43:25
437632Ebuildsmedia-videoUNCONFIRMEDmedia-video/vlc: metadata.xml should be updated2012-10-08 20:15:56
370587Applicationsmedia-videoUNCONFIRMEDmedia-video/vlc-1.1.9: vlc won't play files from ssh folder connected through gnome "Places" menu2012-09-19 13:08:20
370275Applicationsmedia-videoUNCONFIRMEDmedia-video/libav-0.7_pre20110327 error: selected processor does not support ARM mode2011-10-26 17:48:22
454466Applicationsmedia-tvUNCONFIRMEDapp-misc/lirc-9.0-r2 - irexec init script uses deprecated --chuid2013-01-29 14:50:41
458152Ebuildsmaintainer-wantedUNCONFIRMEDdev-db/odb-2.2.0 - C++ Object-Relational Mapping (ORM) implemented as a gcc plugin2013-02-19 22:42:42
454346Ebuildsmaintainer-wantedUNCONFIRMEDEbuild request: app-misc/elasticsearch - Open Source, Distributed, RESTful, Search Engine2013-01-28 18:47:24
453658Ebuildsmaintainer-wantedUNCONFIRMEDdev-util/jenkins - application that monitors executions of repeated jobs, such as building a softwar2013-01-30 11:30:11
450440Core systemmaintainer-wantedUNCONFIRMEDnet-fs/xtreemfs - XtreemFS is a fault-tolerant distributed file system for all storage needs2013-01-07 02:42:31
447194Ebuildsmaintainer-wantedUNCONFIRMEDapp-misc/wiimotedev-1.4.0 - Wii Remote utilities2012-12-15 08:58:36
446028Ebuildsmaintainer-wantedUNCONFIRMEDdev-python/python-backports-1.0.1 - Backported python features2012-12-06 08:27:46
444946Ebuildsmaintainer-wantedUNCONFIRMEDdev-python/txscheduling-1.1 - A scheduling plugin for Twisted2013-02-17 16:25:45
443714Ebuildsmaintainer-wantedUNCONFIRMEDdev-java/jllvm-3.1.2 - bindings for LLVM, providing an object-oriented interface as similar as possi2012-11-19 09:24:34
442342Ebuildsmaintainer-wantedUNCONFIRMEDdev-perl/Data-Diver - Simple, ad-hoc access to elements of deeply nested structures2012-12-27 11:11:38
435024Ebuildsmaintainer-wantedUNCONFIRMEDsys-fs/diskdevcmds-540.1 - HFS and HFS+ utils ported from OSX, supplies mkfs and fsck2012-09-14 14:23:28
432712Ebuildsmaintainer-wantedUNCONFIRMEDsci-geosciences/gpx2svg – Convert GPX formatted geodata to Scalable Vector Graphics (SVG)2012-08-26 20:33:26
425132Ebuildsmaintainer-wantedUNCONFIRMEDdev-db/riak - "the most powerful open-source, distributed database you'll ever put into production."2012-07-08 14:09:00
424818Ebuildsmaintainer-wantedUNCONFIRMEDnet-nntp/moviegrabber - a fully automated way of downloading movies from usenet2012-11-29 03:18:46
417681Ebuildsmaintainer-wantedUNCONFIRMEDmedia-plugins/gimp-apng-0.1.0 - provides Animated PNG (APNG) image file load and save modules for th2012-07-06 20:09:12
406865Ebuildsmaintainer-wantedUNCONFIRMEDwww-servers/distcache - Distributed session caching2012-03-05 20:17:46
404439Ebuildsmaintainer-wantedUNCONFIRMEDapp-backup/rear - Fully automated disaster Recovery for GNU/Linux2013-01-18 12:20:52
405461Ebuildsmaintainer-wantedUNCONFIRMEDapp-editors/sublime-text - a sophisticated text editor for code, html and prose2012-11-18 12:37:09
401921Ebuildsmaintainer-wantedUNCONFIRMEDsci-libs/o2scl - An object-oriented library for scientific computing in C++2012-02-04 17:07:01
389129Gamesmaintainer-wantedUNCONFIRMEDgames-action/voxatron - game set in a world completely made of tiny cubes that can be blasted to smi2012-06-03 22:42:56
382935Ebuildsmaintainer-wantedUNCONFIRMEDumap ebuild wanted2011-09-16 03:53:31
367027Ebuildsmaintainer-wantedUNCONFIRMEDnet-analyzer/amun - Low-interaction honeypot, capture autonomous spreading malware in an automated f2012-03-08 02:09:36
385775Applicationsmaintainer-neededUNCONFIRMEDdev-libs/apr-util-1.3.11 cross compilation fix (libtool related)2013-01-01 20:20:51
451326Corelu_zeroUNCONFIRMEDapp-emulation/qemu-user-1.1.0-r1: "qemu: Unsupported syscall: 373" for epoll syscall inside arm chro2013-01-20 17:32:15
448206Core systemlu_zeroUNCONFIRMEDflag-o-matic.eclass: `CHOST=${CTARGET} strip-unsupported-flags` doesn't strip flags2013-01-07 17:18:12
455890Core systemlivecdUNCONFIRMEDsys-block/parted - parted binary should be installed in /usr/bin2013-02-07 02:12:12
416903ApplicationslivecdUNCONFIRMEDsys-block/parted-3.1 fails tests [t8001-loop-blkpg.sh t2100-zerolen.sh]2012-05-21 14:59:50
442324Ebuildslang-miscUNCONFIRMEDdev-lang/fpc ebuilds are largely outdated2012-11-08 09:14:16
399899Developmentlang-miscUNCONFIRMEDdev-lang/fpc-2.6.0 USE=ide - fpcalc.pas(244,3) Fatal: Selected assembler reader not supported2012-02-15 16:20:16
454868ApplicationslackUNCONFIRMEDx11-wm/fluxbox-? with updated media-libs/glew-1.9.0 - `fbrun` yields error while loading shared libr2013-02-04 17:23:15
444238Ebuildskernel-miscUNCONFIRMEDsys-kernel/linux-headers: Out of kernel builds seems not supported2012-11-23 04:59:46
446700Ebuildskernel-miscUNCONFIRMEDdev-libs/klibc-1.5.25 - make silentoldconfig: Console input/output is redirected. Run 'make oldconfi2012-12-10 11:38:29
438734Eclasses and Profileskernel-miscUNCONFIRMEDlinux-mod.eclass - KERNEL_DIR/KBUILD_OUTPUT version mismatch is not detected, KERNEL_DIR is not infe2012-10-18 07:40:38
390293Unspecifiedkernel-miscUNCONFIRMED[enhancement] sys-fs/sshfs-fuse: Improve remote permissions when files and directories are created2011-11-15 00:36:35
458116Core systemkernelUNCONFIRMEDkernel 3.7.5 - BUG related to skb when sysctl net.ipv4.tcp_mtu_probing!=02013-02-21 02:44:06
386235Applicationskernel-miscUNCONFIRMEDsys-kernel/gentoo-sources-3.x will not boot encrypted /2011-12-26 13:34:01
444742ApplicationskernelUNCONFIRMEDnet-fs/autofs-5.0.6-r3 unable to mount NFS on HPPA: do_mount_indirect: path to be mounted is to long2013-02-06 04:36:10
456230KDEkdeUNCONFIRMEDapp-cdr/k3b-2.0.2-r4: complains about "process can't started. Calling of In/Output module not possib2013-02-10 15:13:30
435732ApplicationsjerUNCONFIRMEDx11-terms/rxvt-unicode-9.15 - glibc detected *** urxvtd: malloc(): smallbin double linked list corru2013-01-05 22:08:43
399353ApplicationsjerUNCONFIRMEDapp-admin/sysstat-10.0.3 generated daily report file will be truncated by cron.daily (sys-process/vi2012-05-10 14:40:15
439372Core systemjdhoreUNCONFIRMEDsys-apps/paludis[ruby-bindings] installs unslotted to latest ruby (actually 1.9) disregarding eselec2013-02-07 08:07:43
368377JavajavaUNCONFIRMEDjava-config should support JNI related native config options and ld.so.conf pathes2012-04-04 14:19:10
382719Ebuildsidl0rUNCONFIRMEDmedia-video/nvidia-settings hangs with three connected displays [patch]2012-02-17 05:16:12
410053Applicationsidella4UNCONFIRMEDapp-emulation/xen-tools-4.1.2-r2 init script throws: option 'a' not supported2012-06-08 07:16:47
412551Applicationshardened-kernelUNCONFIRMEDsys-kernel/hardened-sources-3.2.12 + qemu-kvm: rcu_shed detected stall on CPU2012-08-06 00:30:12
452828HardenedhardenedUNCONFIRMEDsys-apps/util-linux-2.21.2 - dmesg: *** glibc detected *** dmesg: double free or corruption (!prev):2013-01-18 16:31:50
428682HardenedhardenedUNCONFIRMEDSystem.map has an incorrect kernel version reported when grsec enabled2012-08-03 15:29:25
399687ApplicationshannoUNCONFIRMEDSVGs exported by app-office/libreoffice cause segmentation fault in media-gfx/gimp-2.6.11-r52012-01-23 09:36:24
371955EbuildsgstreamerUNCONFIRMEDmedia-libs/gstreamer should interactively install requested plugins2011-06-16 23:08:35
402763EbuildsgstreamerUNCONFIRMEDmedia-plugins/gst-plugins-ffmpeg-0.10.13-r1 - libavcodec/arm/dsputil_vfp.S:45: Error: selected proce2012-02-09 01:08:01
443584ApplicationsgraphicsUNCONFIRMED>=media-gfx/nvidia-cg-toolkit-3.1.0013 - Breaks flash websites. - Inconsistency detected by ld.so: d2012-11-19 18:47:29
440104ApplicationsgraphicsUNCONFIRMEDmedia-libs/lensfun-0.2.6 installs corrupted pkgconfig file2013-01-10 07:44:34
455938GNOMEgnomeUNCONFIRMED=gnome-base/gdm-3.6* - Fails to start when access to /proc is restricted.2013-02-07 02:11:03
426676GNOMEgnomeUNCONFIRMEDmail-client/evolution-2.32.3-r1 deleted whole directory with calendars2012-07-21 12:09:48
378931GNOMEgnomeUNCONFIRMEDmail-client/evolution-2.32.3: Changes in Account Editor windows cannot be submitted because of the d2012-03-05 08:17:37
447328genkernelgenkernelUNCONFIRMEDsys-kernel/genkernel-3.4.45: encrypted filesystems from initramfs.mounts cannot be mounted2012-12-15 11:14:42
419773genkernelgenkernelUNCONFIRMEDearly bind mounts are listed twice in the mount table2012-06-05 14:14:06
373903genkernelgenkernelUNCONFIRMEDsys-kernel/genkernel: initramfs does not open luks container if gpg-encrypted passphases are used2011-07-08 17:41:51
429286GamesgamesUNCONFIRMEDMouse behavior in games-fps/quake2-icculus is inverted in both x and y axis.2012-08-01 00:20:46
436140GamesgamesUNCONFIRMEDgames-action/descent3 - updated ebuild to support installation from GOG package2012-09-24 22:54:46
405839GamesgamesUNCONFIRMEDdelay created when selecting tiles2012-02-26 03:03:55
442052Applicationsfreedesktop-bugsUNCONFIRMEDsys-power/pm-utils-1.4.1-r2 uses deprecated kernel option CONFIG_WIRELESS_EXT_SYSFS2012-11-06 16:06:47
435848ApplicationsfloppymUNCONFIRMEDx11-misc/x11vnc-0.9.13 with net-libs/libvncserver-0.9.9 - buffer overflow detected in /usr/lib/libvn2013-01-20 19:18:24
414829Applicationseric.joshua.martinUNCONFIRMEDwww-apps/rt-4.0.5: Generated.pm configured directories point to /usr/share/webapps instaed of webapp2012-05-06 22:45:45
408505Installation HandbookembeddedUNCONFIRMEDqemu-user chroot information is outdated2012-03-27 08:13:11
441976StagesembeddedUNCONFIRMEDIdea: Providing a tiny stage (and profile) for limited embedded devices.2013-02-15 11:46:25
382121Otherdocs-teamUNCONFIRMEDThe Suggestion of the new Korean translation for the related documentation2011-09-07 07:25:44
457760Enhancement/Feature Requestsdev-portageUNCONFIRMEDemerge -v to print expected total build time according to emerge.log?2013-02-16 10:08:21
430102Unclassifieddev-portageUNCONFIRMEDEmerging in a deleted directory outputs lots of "getcwd: cannot access parent directories: No such f2012-08-21 00:22:33
422491Coredev-portageUNCONFIRMEDemerging updates to nfs-mounted file systems can cause running programs to segfault2012-06-21 02:59:59
420577Portage Documentationdev-portageUNCONFIRMEDsys-apps/portage: Polish manuals are severely outdated2013-01-05 13:26:13
402977Documentationdev-portageUNCONFIRMEDemerge --update doesn't update all packages which can be updated2012-03-05 10:02:22
401503Enhancement/Feature Requestsdev-portageUNCONFIRMEDemerge please ad short option to autounmask-write, -w suggested2012-01-30 17:48:55
380389Enhancement/Feature Requestsdev-portageUNCONFIRMEDebuild skips EAPI unsupported phases silently2011-08-26 03:07:11
452730Applicationsdesktop-wmUNCONFIRMEDx11-wm/icewm-1.3.7 suggested patches2013-01-18 22:55:56
411077Applicationsdesktop-dockUNCONFIRMEDx11-plugins/wmauda-0.8 - wmauda.c:126:11: error: expected '=', ',', ';', 'asm' or '__attribute__' be2012-11-07 21:33:21
389783Ebuildscommon-lispUNCONFIRMEDdev-lisp/clozurecl-1.7 fails to build (unquoted SVN_REVISION in generated compiler commands)2011-11-08 19:59:04
455582ServerclusterUNCONFIRMEDsys-cluster/ceph should be started before netmount2013-02-05 12:25:27
414793Core systemclusterUNCONFIRMEDsys-cluster/maui-3.3.1-r2 - ERROR: cannot setpgrp, errno: 1 (Operation not permitted)2012-08-06 03:49:46
407173ApplicationsclusterUNCONFIRMEDsys-devel/icecream: distributed jobs fail because of missing libraries2012-06-27 00:00:39
384031ApplicationschutzpahUNCONFIRMEDnet-analyzer/pchar[pcap] fails to build (possibly glibc version related)2012-08-20 03:39:32
446644EbuildscardoeUNCONFIRMEDmedia-tv/ivtv-firmware-20080701 should probably not be mirror-restricted2012-12-10 12:04:48
425708ApplicationscalchanUNCONFIRMEDdev-lang/R-2.10.1 - R: stack smashing attack in function - terminated2012-10-07 11:57:34
458568Applicationsbug-wranglersUNCONFIRMEDUdisks2 fails to mount flash drive when ACL isn't supported in kernel2013-02-21 13:23:05
458544Librarybug-wranglersUNCONFIRMEDdev-tcltk/tcllib-1.15: Detected file collision(s)2013-02-21 08:19:27
387341ApplicationsbilllUNCONFIRMEDmedia-video/ogmrip-0.13.6 - ogmdvd-disc.h:71:1: error: expected '=', ',', ';', 'asm' or '__attribute2011-10-27 17:36:11
457798ApplicationsbillieUNCONFIRMEDapp-portage/pfl-2.3-r2: cron-script doesn't run since 'python2' is not supported.2013-02-20 18:57:15
457026Core systembase-systemUNCONFIRMEDnet-misc/openssh: no host keys generated on systemd based system2013-02-20 18:21:40
455990Applicationsbase-systemUNCONFIRMEDapp-shells/bash=4.2_p37 - segfault when script aborted - *** glibc detected *** double free or corru2013-02-08 23:10:35
456308Core systembase-systemUNCONFIRMEDgrub2 won't launch memtest86 and memtest86+ if / and /boot are separated partitions and grub2 graphi2013-02-13 22:19:39
454404Core systembase-systemUNCONFIRMEDsys-fs/static-dev: should also check for devtmpfs mounted at /dev2013-01-29 18:37:25
451622Core systembase-systemUNCONFIRMEDsys-apps/man-db-2.6.3-r1[nls]: Translated manpages will not be installed if app-text/po4a is not ins2013-01-15 12:05:38
452630OpenRCbase-systemUNCONFIRMEDsys-apps/openrc - /etc/sysctl.conf not respected2013-02-16 23:07:26
446386Core systembase-systemUNCONFIRMEDsys-devel/automake-1.12.5 fails tests related to yacc2012-12-08 05:53:22
422877Core systembase-systemUNCONFIRMEDnet-firewall/iptables: ip6tables "state" test fails; will not jump to ACCEPT on ESTABLISHED,RELATED 2013-02-16 13:31:38
410605Core systembase-systemUNCONFIRMEDsys-apps/util-linux-2.20-r1: fsck complains about checking file systems mounted ro2013-02-05 14:52:10
395475Core systembase-systemUNCONFIRMEDsys-devel/libtool-2.4.2 fails tests: 8 failed (5 expected failures).2012-05-23 17:17:13
395537Core systembase-systemUNCONFIRMEDsys-process/procps doesn't prints cgroups correctly (systemd releated)2012-01-24 20:57:29
386539Core systembase-systemUNCONFIRMEDsys-boot/grub-1.99-r2 doesn't detect framebuffer resolutions if /usr is not mounted2011-11-11 13:32:10
390245Core systembase-systemUNCONFIRMEDsys-fs/mtools-4.0.15 - mcd fails to mount SD memory card (with all available (tested) card readers)2011-11-20 07:19:18
374901Applicationsarmin76UNCONFIRMED[embedded-cross overlay] dev-python/pyxml-0.8.4-r2: multiple Python ABIs in EAPI <=2 is deprecated a2011-11-05 18:47:19
386059Libraryarfrever.ftaUNCONFIRMEDnet-libs/neon uses deprecated function gnutls_certificate_verify_peers() of gnutls2012-04-01 12:04:01
416267Applicationsapp-backupUNCONFIRMEDapp-backup/backuppc-3.2.1 hangs and shows warnings about deprecated qw(...) with perl-5.142012-05-16 14:10:07
444808Applicationsandreis.vinogradovsUNCONFIRMEDapp-misc/hivex-1.3.6-r2 USE=ruby - rake aborted! / / cannot load such file -- rake/rdoctask2012-12-05 04:45:09
371322Eclasses and ProfilesadaUNCONFIRMEDdev-lang/gnat-gcc-4.3.2 - work/gcc-4.3.2/libgcc/../gcc/unwind-pe.h:136: error: expected declaration 2012-03-19 19:22:36
408191EbuildsaballierUNCONFIRMEDnet-nntp/hellanzb uses deprecated opts in init script2012-06-07 16:11:26
393281EbuildsaballierUNCONFIRMEDmedia-sound/lmms possibly bloated dependencies2011-12-05 20:18:32
313491ApplicationsgraphicsUNCONFIRMEDmedia-gfx/exact-image: Verify and potentially improve Python-related code2012-10-06 11:48:14
211203GamesgamesUNCONFIRMEDgames-rpg/bass: script for getting bass translated2011-07-27 09:15:01


back



Support us on Content Nation

New Packages

- as rdf newsfeed
- as rss newsfeed
- as Atom newsfeed
2020-04-01
2020-03-31
rdf newsfeed | rss newsfeed | Atom newsfeed
- Powered by LeopardCMS - Running on Gentoo -
Copyright 2004-2020 Sascha Nitsch Unternehmensberatung GmbH
Valid XHTML1.1 : Valid CSS : buttonmaker
- Level Triple-A Conformance to Web Content Accessibility Guidelines 1.0 -
- Copyright and legal notices -
Time to create this page: 16.3 ms