from small one page howto to huge articles all in one place
 

search text in:




Other .linuxhowtos.org sites: www.linuxhowtos.org
toolsntoys.linuxhowtos.org



Last additions:
How to make X listen on port 6000

How to make X listen on port 6000

words:

34

views:

42192

userrating:

average rating: 1.5 (4 votes) (1=very good 6=terrible)


May, 25th 2007:
April, 26th 2007:
Apr, 10th. 2007:
Druckversion . pdf icon
You are here: Portage


Details of app-editors/ng:

Description: Emacs like micro editor Ng -- based on mg2a
Homepage:
http://tt.sakura.ne.jp/~amura/ng/

available versions:

releasesalphaamd64armhppaia64mipsppcppc64ppc macoss390shsparcx86USE-Flagsdependenciesebuild warnings
ng-1.5_beta1-r2 -+----+-----+canna
show
show
Legend:
+ stable
~ testing
- not available
some ebuild warning depend on specific use-flags or architectures, all ebuild-warnings are shown.

Known bugs:
bug IDcomponentassigned tostatusdescriptionlast change
417883ServerbluenessUNCONFIRMEDnet-firewall/ipsec-tools-0.8.0-r3: racoon segfaults on incoming connections if privsep is used2012-07-31 02:44:59
440380Core systembase-systemUNCONFIRMEDsys-boot/lilo: unmerging when /boot isn't mounted cleans /boot2012-11-02 08:21:22
400681EbuildsxarthisiusUNCONFIRMEDdev-lang/ekopath-4.0.12_pre20111108 TEXTRELs2012-02-10 14:26:57
410267Developmentsci-mathematicsUNCONFIRMEDsci-libs/primegen-0.97-r2: Adding an soname USE Flag2012-03-30 19:34:58
424691Core systemrobbat2UNCONFIRMEDsys-process/audit uses alias from /etc/hosts in constructing Kerberos principal2012-12-22 07:20:43
420095Applicationsrobbat2UNCONFIRMEDsci-mathematics/glpk-4.47 USE=mysql with dev-db/mariadb:5.5 - /usr/include/mysql/m_string.h:177:14: 2012-12-12 19:59:28
434900Ebuildspavel.stratil-junUNCONFIRMEDsys-apps/timer_entropyd-0.2 silently changed behavior2012-09-13 14:16:28
453772OpenRCopenrcUNCONFIRMEDsystemwide use of taskset for pinning daemons to cpus on multicore systems2013-02-02 14:39:49
458280GNOMEgnomeUNCONFIRMEDdev-python/pygtk-2.24.0-r3 installing postrm warning: Unable to establish symlink2013-02-21 03:06:11
450340GNOMEgnomeUNCONFIRMEDgnome-extra/hamster-applet-2.32.1 possibly has wrong RESTRICT_PYTHON_ABIS2013-01-06 22:38:36
436992GNOMEgnomeUNCONFIRMEDgnome-base/gvfs-1.12.3-r1 - /usr/share/applications/mount-archive.desktop: warning: key "Encoding" i2012-11-21 18:48:43
396571ApplicationsziapannocchiaUNCONFIRMEDapp-misc/cwiid - udev-rule for uinput use non exitsting group plugdev2012-08-14 23:26:07
407071ApplicationszerochaosUNCONFIRMEDnet-analyzer/wireshark-1.6.4[lua] fails to run after upgrade to dev-lang/lua-5.2.0 and will not rebu2013-02-16 13:18:51
437236ApplicationszerochaosUNCONFIRMEDnet-analyzer/metasploit:4.4 | revdep-rebuild keeps reinstalling it when run2012-12-26 04:41:05
441878LibraryyngwinUNCONFIRMEDx11-libs/cairo-1.12.6, 2013-01-11 18:30:33
437056LibraryyngwinUNCONFIRMEDapp-admin/eselect-infinality - after setting to nyx, 43-repl-terminus.conf cannot be load2012-10-17 12:12:28
440566ApplicationsyngwinUNCONFIRMEDapp-vim/gentoo-syntax-20120109: some elog messages should only be shown when upgrading from an old e2012-10-31 16:25:57
452618DevelopmentyamakuzureUNCONFIRMED[seden overlay] dev-util/eclipse-sdk-3.7.1-r10 - Bug fixes regarding incorrectly slotted virtual/jdk2013-01-17 17:45:18
455098ApplicationsxmwUNCONFIRMEDx11-wm/xpra-0.8.0 tries to remove non-existing files and fails2013-02-05 08:03:17
447396ServerxmwUNCONFIRMEDapp-admin/bcfg2-1.2.3: missing RDEPEND on dev-python/nose2012-12-15 20:27:44
446312ApplicationsxmwUNCONFIRMEDapp-shells/autojump-21.1.0 causes startDM.sh to segfault during system start2013-01-25 08:51:42
438270ApplicationsxmwUNCONFIRMEDapp-backup/backintime should respect LINGUAS2012-10-14 18:13:30
442106Core systemxmwUNCONFIRMEDsys-power/suspend-1.0 USE=fbsplash - ld: cannot find -lmng -ljpeg -llcms -lpng15 -lz -lfreetype2012-11-06 21:44:41
427062EbuildsxmwUNCONFIRMEDapp-admin/bcfg2-1.2.2-r1 - add support for Dynamic Reporting System2012-07-19 15:58:15
409653Core systemxmwUNCONFIRMEDsys-power/suspend-0.8-r1 - Hibernate freezes on "Snapshotting system..." when firefox is working2012-03-26 19:00:56
421897ApplicationsxfceUNCONFIRMEDxfce-base/xfce4-panel-4.10.0 - adding system action icon to panel breaks auto-hide2012-07-06 05:45:28
457588ApplicationsxboxUNCONFIRMEDmedia-tv/xbmc-11.0 with a PaX kernel - xbmc.bin: LLVM ERROR: Allocation failed when allocating new m2013-02-15 15:39:36
435750ApplicationsxemacsUNCONFIRMEDapp-editors/xemacs-21.4.22-r2 crashes if syntax highlighting in current buffer is used2012-09-28 09:57:26
440340Core systemxenUNCONFIRMEDafter some time of running xen panics when the dom0 kernel is 3.X2012-10-31 03:02:38
457528Applicationsx11UNCONFIRMED[x11 overlay] x11-libs/xpyb-9999 with python3 - checking for python include dir... File ""2013-02-15 15:34:34
456682Applicationsx11UNCONFIRMEDx11-base/xorg-server-1.13.2 with x11-drivers/xf86-video-nouveau-1.0.6 crashes when displaying larger2013-02-12 10:53:49
447306Applicationsx11UNCONFIRMEDx11-base/xorg-server-1.13.0-r1 with x11-drivers/xf86-video-intel-2.20.13 - rapid flickering of rando2013-02-05 03:24:34
445902Libraryx11UNCONFIRMEDapp-emulation/emul-linux-x86-opengl-20121202{,-r1} makes some wine programs very sluggish2013-01-11 11:54:06
445712Libraryx11UNCONFIRMEDapp-emulation/emul-linux-x86-opengl-20121202 does not install /us/lib32/libGLU.so.12013-01-23 19:53:52
444157Core systemx11UNCONFIRMEDx11-base/nouveau-drm-20121015 needs patching for kernel 3.7.x2012-11-22 12:13:33
440550Applicationsx11UNCONFIRMEDx11-proto/xcb-proto-1.7.1: some elog messages should only be shown when upgrading from an old enough2012-10-31 16:24:16
437176Applicationsx11UNCONFIRMEDx11-apps/xcalc-1.0.4.1 number keys stopped working2012-10-08 20:37:46
438288GNOMEx11UNCONFIRMEDWindow Tearing2012-10-15 17:40:11
435336Applicationsx11UNCONFIRMED>x11-base/xorg-server-1.9.5 - panning across virtual resolution does not work2012-12-06 21:04:54
430070Applicationsx11UNCONFIRMEDx11-base/xorg-server-1.12.99.903 - using space in media-gfx/gimp-2.8.0-r1 causes segmentation fault 2012-08-08 18:40:49
427632Applicationsx11UNCONFIRMEDx11-drivers/xf86-input-evdev-2.7.0 breaks y-direction emulateWheel for Kensington Expert Mouse2012-07-25 22:35:22
427302Applicationsx11UNCONFIRMEDmedia-fonts/font-alias-1.0.3 : Aliases referring to xyz-iso8859-1 when font packages install xyz-iso2012-07-24 13:58:10
420715Applicationsx11UNCONFIRMEDx11-misc/imake hardcodes /usr/lib/X11 paths (ignoring multilib settings)2012-09-11 06:15:16
413981Core systemx11UNCONFIRMEDsys-kernel/gentoo-sources-3.2.12: i915 driver sets strange resolution 1922x1080 on HDMI2012-05-01 05:35:57
408643Unspecifiedx11UNCONFIRMEDapp-admin/eselect-mesa needs update for r600 changes in mesa2012-07-11 11:14:47
413153Unspecifiedx11UNCONFIRMEDx11-misc/xscreensaver unlock dialog is not showing2012-04-22 21:33:56
407711Unspecifiedx11UNCONFIRMEDx11-drivers/ati-drivers-12.2: amdcccle segfaults when changing desktop settings2012-03-12 19:29:06
405053Ebuildsx11UNCONFIRMEDx11-drivers/ati-drivers: EGL/OpenGL ES Features Broken.2012-02-20 18:05:48
397317Applicationsx11UNCONFIRMEDx11-apps/xrandr: --panning no longer works2012-02-06 17:31:07
392767Ebuildsx11UNCONFIRMEDmedia-libs/mesa: Bad string substitution in mesa-7.11.2.ebuild (when doing a prefix build with 'dri'2011-12-04 13:02:37
389789Unspecifiedx11UNCONFIRMEDx11-base/xorg-server-1.9.5-r1 - work/xorg-server-1.9.5/doc/xml/dtrace/Xserver-DTrace.xml:4: warning:2011-11-13 16:00:12
390455Applicationsx11UNCONFIRMEDx11-misc/xcompmgr doesn't handle shape change2011-11-14 04:06:05
388479Unspecifiedx11UNCONFIRMEDxorg-server-1.9.5-r1 fails to build when docbook-xml-dtd:4.3 is missing2011-10-25 21:12:48
384685Unspecifiedx11UNCONFIRMEDXorg fonts should warn about needing a re-login2012-07-13 08:51:01
379827Ebuildsx11UNCONFIRMEDx11-base/xorg-server Patch for Hotkey Release Layout Switching (unofficial solution to bug on freed2012-06-06 06:40:18
369207Unspecifiedx11UNCONFIRMEDnum lock LED off after changing from VT to X112011-06-07 15:33:07
368161Applicationsx11UNCONFIRMEDx11-apps/xinit w/ sys-apps/openrc-0.8.2-r1 start-stop-daemon ignores PAM settings for user root2011-05-24 18:46:56
367319Applicationsx11UNCONFIRMEDx11-base/xorg-server: After a change my keyboard to USB model, no X-programs starts and Xorg log con2011-05-16 08:42:50
428628EbuildswschlichUNCONFIRMEDsys-block/megacli monitoring script2013-01-07 17:05:25
436900EbuildswschlichUNCONFIRMEDnet-misc/connect-1.103(?) version bump and HOMEPAGE change2012-10-02 13:46:58
455080Core systemwschlichUNCONFIRMEDsys-process/fcron-3.1.1 - Files were moved without updating default selinux file context policies, p2013-02-02 17:38:34
456310ApplicationswiredUNCONFIRMEDwww-client/uzbl - /usr/bin/uzbl-browser should specify python version in shebang2013-02-09 16:34:47
388425ApplicationswineUNCONFIRMEDapp-emulation/wine-1.3.30 sound not working, several apps stopped working.2012-03-22 12:19:51
440216ApplicationswilliamhUNCONFIRMEDnet-misc/dhcpcd-5.6.2 outputs emerge messages only relevant when upgrading from <5.02012-10-30 15:25:24
434924EbuildswilliamhUNCONFIRMEDdev-lang/go - static libraries in /usr/lib/go/pkg* with older mtimes than /usr/lib/go/src causes use2012-09-14 13:35:30
450680Serverweb-appsUNCONFIRMEDwww-apps/egroupware - insufficient dev-lang/php USE dependencies2013-02-16 21:29:53
380235ApplicationswilliamhUNCONFIRMEDapp-accessibility/brltty: missing dependency on sys-libs/ncurses2011-08-25 13:06:41
428464DevelopmentwilliamhUNCONFIRMEDdev-lang/go-1.0.1 - "scanelf: Invalid ar entry" / LDFLAGS ignored2012-07-29 22:36:13
449032Serverweb-appsUNCONFIRMEDwww-apps/ampache-3.5.* needs additional dependency < dev-lang/php-5.42012-12-28 21:06:13
443910Ebuildsweb-appsUNCONFIRMEDwww-apps/dragonflycms-9.3.3.1 - download URL changed2012-11-19 11:41:01
413443Serverweb-appsUNCONFIRMEDwww-apps/bugzilla-4.2.1 - missing excutable bit for scripts2012-04-25 15:32:38
407527Applicationsweb-appsUNCONFIRMEDwww-apps/drupal - add LINGUAS2012-03-12 12:17:51
407791Applicationsweb-appsUNCONFIRMEDwww-apps/drupal-7.12 Shows "Illegal string offset" Warning2012-03-13 11:22:43
377105Applicationsweb-appsUNCONFIRMEDapp-admin/webapp-config-1.50.18: self.mkfile() dies while trying to delete a path to be created2011-08-04 02:04:41
453788Core systemvoyageurUNCONFIRMEDsys-devel/llvm & sys-devel/clang: dependency trouble for build subprojects of llvm2013-02-02 21:37:08
455262DevelopmentvoyageurUNCONFIRMEDsys-devel/clang-3.2 WX sections2013-02-05 00:51:32
455986ApplicationsvoyageurUNCONFIRMEDnet-misc/gogoc - Introduce warning when bridge support is missing in kernel2013-02-07 11:47:29
458254ApplicationsvoyageurUNCONFIRMEDapp-cdr/cdrtools-3.01_alpha12 with sys-devel/clang-3.2 - sha2.c:1006:2: error: call to 'SHA384Pad' i2013-02-21 02:51:12
448208EbuildsvoyageurUNCONFIRMEDsys-devel/{llvm,clang} support for C++11 (both), doxygen docs and python (clang) USE flags2013-02-02 22:02:57
443556EbuildsvoyageurUNCONFIRMEDsys-devel/clang-3.1 - Updated ebuild with +python and +doc2012-11-17 09:03:06
441778DevelopmentvoyageurUNCONFIRMEDsys-devel/clang-3.1 ICE's when a type with multiple copy-ctors is in a union2012-11-04 23:13:59
434928ApplicationsvoyageurUNCONFIRMEDx11-drivers/xf86-video-intel-2.20.7 USE=sna crashes when built with clang2012-12-31 12:32:53
439676UnspecifiedvoyageurUNCONFIRMEDapp-i18n/ibus-qt-1.3.1 with clang 3.1 - qibusserializable.h:94:59: error: non-const lvalue reference2012-10-26 16:33:42
427350ApplicationsvoyageurUNCONFIRMED=dev-lang/perl-5.16.0 fails tests with clang-3.1-r42012-07-21 14:07:00
427352ApplicationsvoyageurUNCONFIRMED=dev-libs/klibc-1.5.25 fails to build with clang-3.1-r42012-07-21 14:07:01
427808EbuildsvoyageurUNCONFIRMEDx11-base/xorg-server-1.12.3 crashing at start-up when compiled with sys-devel/clang2012-12-31 12:32:19
427830Core systemvoyageurUNCONFIRMEDsys-devel/clang-3.1-r4 - clang: error: unable to execute command: Illegal instruction (in .../work/l2012-07-25 14:59:26
434906DevelopmentvoyageurUNCONFIRMEDsys-devel/clang should install x86_64-pc-linux-gnu-clang symlink2012-09-13 15:46:46
427348ApplicationsvoyageurUNCONFIRMED=dev-db/sqlite-3.7.13 fails test with clang-3.1-r42012-07-21 14:07:01
427342ApplicationsvoyageurUNCONFIRMEDdev-libs/apr fails to build with clang-3.1-r42012-12-29 16:58:30
427316Core systemvoyageurUNCONFIRMED=sys-apps/findutils-4.5.10-r1 fails tests with clang-3.1-r42012-07-21 14:07:00
427318ApplicationsvoyageurUNCONFIRMEDdev-libs/popt fails tests with clang-3.1-r42012-10-09 15:26:37
427322Core systemvoyageurUNCONFIRMEDsys-libs/gpm fails to build with clang-3.1-r42012-07-21 14:07:00
427304ApplicationsvoyageurUNCONFIRMED=dev-libs/mpfr-3.1.1 fails tests with clang-3.1-r42012-10-08 15:16:38
427310ApplicationsvoyageurUNCONFIRMED=dev-libs/ppl-0.12.1 fails tests with clang-3.1-r42012-07-25 14:12:12
427314Core systemvoyageurUNCONFIRMEDsys-apps/sed fails test with clang-3.1-r42012-07-21 14:07:01
400547DevelopmentvoyageurUNCONFIRMEDdev-libs/STLport-5.2.1 does not compile using clang++ due to error in stlport/stl/_locale.h2012-01-25 13:51:23
403637ApplicationsvoyageurUNCONFIRMEDnet-ftp/filezilla-3.5.3 doesn't honor LINGUAS for locale files2012-02-23 21:38:44
388325EbuildsvoyageurUNCONFIRMEDsys-devel/llvm-2.9-r2 shared lib linking error2012-05-12 10:54:41
386843DevelopmentvoyageurUNCONFIRMEDsys-devel/clang-2.9-r1 fails test PCH/cxx-typeid.cpp2011-10-16 03:36:44
371961Core systemvoyageurUNCONFIRMEDsys-devel/clang: Add a USE-flag for changing the built-in linker from ld to ld.gold2012-07-16 13:01:45
444380ApplicationsvoipUNCONFIRMEDnet-voip/ekiga-3.2.7 - Fails src_test for LINGUAS=en_GB - Document ./en_GB/ekiga.xml does not valida2012-11-22 22:49:37
403597ApplicationsvoipUNCONFIRMEDnet-voip/linphone-3.4.3-r1 doesn't honor LINGUAS for locale files2012-06-30 13:45:14
430474ApplicationsvoipUNCONFIRMEDnet-voip/ekiga-3.2.7 with sys-devel/gcc-4.7 - ../../../../lib/engine/addressbook/source-impl.h:209:32012-12-14 13:07:23
448362ApplicationsvirtualizationUNCONFIRMEDnet-misc/spice-gtk - after having been full screen, spicy changes DPI in X2013-01-12 21:54:37
444602ApplicationsvirtualizationUNCONFIRMEDapp-emulation/virtinst-0.600.3 - Exception in thread Checking storage allocation2013-02-16 18:03:56
448472ApplicationsvimUNCONFIRMEDapp-editors/gvim - segmentation fault when using clang_complete2012-12-25 15:39:05
453418ApplicationsvimUNCONFIRMEDapp-editors/vim-core-7.3.762 Opened file gets modified when mapping g to some other value2013-01-22 02:03:25
455480ApplicationsvimUNCONFIRMEDapp-editors/vim-7.3.762 - Symlinks to gz manpages are dangling because my system uses bzip2 manpages2013-02-04 19:35:50
441864ApplicationsvimUNCONFIRMEDapp-editors/vim-7.3.646 vim: stack smashing attack in function - terminated2012-11-05 13:04:29
440564ApplicationsvimUNCONFIRMEDapp-editors/vim-7.3.409: some elog messages should only be shown when upgrading from an old enough p2012-10-31 16:25:37
440542ApplicationsvimUNCONFIRMEDapp-editors/vim-core-7.3.409: some elog messages should only be shown when upgrading from an old eno2012-10-31 16:23:55
423137ApplicationsvimUNCONFIRMEDapp-editors/vim-7.3.409: Misleading and outdated hint on solving a problem2012-06-26 14:55:41
417921ApplicationsvimUNCONFIRMEDapp-editors/vim - bash completion fails with paths containing spaces2012-05-28 11:50:58
446204Core systemvapierUNCONFIRMEDsys-devel/crossdev: cross-emerge: support multiple parallel SYSROOTs for a single target2012-12-06 22:15:24
439280LibraryvadimkUNCONFIRMEDapp-emulation/vmware-modules-264.4 - missing return carriage in printk in VNetUserIfSetUplinkState()2012-10-23 10:12:15
387803Core systemvadimkUNCONFIRMEDProcesses start hanging in "D" state on Gentoo guest under vmware host2011-10-26 00:12:42
457694ApplicationsultrabugUNCONFIRMED>=dev-db/mongodb-2.0.7 does not build and install libmongoclient.so anymore2013-02-15 17:20:16
456048ServerultrabugUNCONFIRMEDwww-servers/uwsgi-1.4.5 init script race condition if starting multiple uwsgi instances with differe2013-02-07 16:47:54
399011ApplicationsultrabugUNCONFIRMEDapp-admin/rsyslog-5.8.6 logrotate config not working with systemd service2012-10-29 16:10:27
421289ApplicationsultrabugUNCONFIRMEDdev-db/mongodb-2.0.6: Add support for USE="ssl"2012-12-23 14:34:12
431256ApplicationstoveUNCONFIRMEDapp-shells/zsh-4.3.15 wrong syntax for "ip tunnel del"2012-08-14 12:58:33
453674Third-Party Toolstools-portageUNCONFIRMEDapp-portage/ufed: Shortening/cleaning flag descriptions by eliminating "[Enables/Adds/Includes] Supp2013-01-23 13:44:40
447436Applicationstools-portageUNCONFIRMED=app-portage/genlop-0.30.8-r2 - Use of uninitialized value in concatenation (.) or string at /usr/b2012-12-17 07:12:11
406645Toolstools-portageUNCONFIRMEDapp-portage/gentoolkit-0.3.0.5 please consider renaming the revdep-rebuild scripts2012-03-05 12:52:29
435110Core systemtoolchainUNCONFIRMEDsys-devel/binutils: ar mishandles 4GB files (causing net-libs/webkit-gtk build to fail with debug fl2013-01-01 20:56:38
373823Toolstools-portageUNCONFIRMEDapp-portage/gentoolkit-0.3.0.4: `euse -i` dumps errors about missing repo_name files2012-12-25 01:55:28
457684DevelopmenttoolchainUNCONFIRMEDdev-util/mingw64-runtime-2.0.7 version bump2013-02-19 04:36:50
453832CoretoolchainUNCONFIRMEDsys-devel/gcc-4.6.3: hangs in pkg_postinst2013-01-31 20:11:38
454200Core systemtoolchainUNCONFIRMEDsys-libs/glibc-2.17 breaks almost all binaries - error while loading shared libraries: libgcc_s.so.12013-02-09 05:39:00
448172Core systemtoolchainUNCONFIRMEDsys-devel/gcc-4.1.2 - /usr/lib64/libart_lgpl_2.so: could not read symbols: File in wrong format /// 2012-12-25 15:17:16
447708Core systemtoolchainUNCONFIRMEDsys-devel/gcc-4.7.2 fails to crosscompile for mingw64: options.c:952:3: error: ‘HAVE_GAS_ALIGNED_COM2013-02-18 16:35:04
428220ApplicationstoolchainUNCONFIRMEDwww-client/firefox-10.0.5 - ld: BFD (GNU Binutils) 2.21.1 internal error, aborting at /var/tmp/porta2012-07-27 17:14:46
383581Core systemtoolchainUNCONFIRMED[Request] sys-devel/gcc-4.x: Re-add support for the D language2012-07-15 05:58:15
384981Core systemtoolchainUNCONFIRMEDsys-libs/glibc has missing dev-util/gperf DEPEND2011-10-01 06:54:54
396615Core systemtoolchainUNCONFIRMEDsys-devel/gdb: /usr/lib/libinproctrace.so plugin triggers missing SONAME QA warning2011-12-31 20:16:42
405325Core systemtoolchainUNCONFIRMEDsys-devel/autogen-5.11.2: src_test left an orphan process running in the background2012-03-22 14:50:16
414967Core systemtoolchainUNCONFIRMEDsys-devel/gcc-4.6.3 in dev-lang/gforth-0.7.0 - ./engine.c:460:1: internal compiler error: in simplif2012-06-28 17:14:55
415221Core systemtoolchainUNCONFIRMEDcross-i686-pc-mingw32/gcc-4.5.3-r2 g++ can't link programs with STL2012-06-29 20:29:50
423971Core systemtoolchainUNCONFIRMEDcross-i686-pc-mingw32/gcc-4.6.3: .../build/./gcc/as: line 87: exec: -o: invalid option2012-08-11 18:52:56
416757Core systemtoolchainUNCONFIRMEDcross-arm-elf/gcc-4.5.3-r2 - checking machine/endian.h usability... // .../work/gcc-4.5.3/libiberty/2012-06-17 17:06:03
373295UnspecifiedtoolchainUNCONFIRMEDsys-libs/glibc-2.12.2: building glibc interrupted in OpenVZ container, also tried rebuilding system2011-12-22 22:40:58
454496ServertommyUNCONFIRMEDdev-vcs/subversion - running /etc/xinetd.d/svnserve requires setting up a user/group through `emerge2013-01-29 14:37:34
457504EbuildstomjbeUNCONFIRMEDapp-backup/bacula-5.2.12: add support for installing examples into docdir2013-02-14 15:48:10
435426ApplicationstommyUNCONFIRMEDdev-vcs/subversion-1.6.17-r7 USE=-perl still depends on dev-lang/perl through perl-module.eclass2012-11-05 09:43:38
420065LibrarytommyUNCONFIRMEDsci-libs/naga-2.1 fails to connect to server (http://naga.googlecode.com) behind a proxy using subv2013-01-20 10:45:59
406783DevelopmenttexUNCONFIRMEDdev-tex/pgf-2.10: TikZ "callout" positioning problem2012-03-05 19:49:20
417927ApplicationstexUNCONFIRMEDdev-tex/latexmk - bash completion fails with paths containing spaces2012-05-28 11:51:57
435338ApplicationstexUNCONFIRMEDdev-tex/chktex-1.7.0 - .../work/chktex-1.7.0/FindErrs.c:320: warning: implicit declaration of functi2012-09-18 13:41:50
457552ApplicationstgurrUNCONFIRMEDmedia-sound/mumble should not include TTS settings when USE="-speech"2013-02-17 00:37:19
383403ApplicationstexUNCONFIRMEDchktex detects wrong file names when following \input commands2011-09-18 21:47:52
399083ApplicationstexUNCONFIRMED>=dev-tex/tth-3.77 licence change2012-11-30 20:25:08
457994LiveCD/DVDtenUNCONFIRMEDlivedvd-amd64-multilib-20121221.iso: kernel panic when booting in kvm with "-cpu host"2013-02-18 02:55:55
452826EbuildstampakrapUNCONFIRMEDDeploy recruiting.gentoo.org2013-01-18 12:24:17
443804EbuildssystemdUNCONFIRMEDsys-apps/systemd should install python-systemd bindings2012-11-19 09:42:48
457042ServersysadminUNCONFIRMEDnet-analyzer/nagios-plugins check_rpc plugin missing dependency2013-02-13 19:23:00
444390ServersysadminUNCONFIRMEDnet-analyzer/nagios - Directory permissions for /etc/nagios are wrong, apache can't start2012-11-23 17:41:24
444022ApplicationssysadminUNCONFIRMEDnet-analyzer/nagios-plugins-1.4.16-r{2,3}: check_ping CRITICAL - You need more args!!!2012-11-21 09:27:19
443502EbuildssysadminUNCONFIRMEDnet-analyzer/nagios-plugins-1.4.16-r2 check_http Plugin does not support checking certificates2012-12-03 20:28:53
455072ServerswegenerUNCONFIRMEDnet-dns/pdns-3.1 with USE="sqlite3" - checking for SQLITE3... configure: error: +Could not find sqli2013-02-02 17:34:19
417639DevelopmentswegenerUNCONFIRMEDdev-util/systemtap-1.7: error: gettext infrastructure mismatch: using a Makefile.in.in from gettext 2012-12-15 13:34:09
440588ApplicationsswegenerUNCONFIRMEDapp-misc/screen-4.0.3-r5: some elog messages should only be shown when upgrading from an old enough 2012-10-31 16:28:30
405549LibrarysrinclanUNCONFIRMEDdev-python/pywebkitgtk-1.1.8 crashes at start when using Pax/Hardened2012-06-10 01:24:13
415329ApplicationsswaponUNCONFIRMEDdev-util/kbuild-0.1.9998_pre20110817 - gcc: argument to '-o' is missing2012-12-27 20:53:03
426990LibraryswaponUNCONFIRMEDnet-libs/gsoap-2.8.9 USE=examples - chaining.o: In function `ns__pow': chaining.c:(.text+0x55): unde2013-01-12 16:57:59
454322UnspecifiedsoundUNCONFIRMEDmedia-sound/lame-3.99.5 - console.o: In function `get_termcap_{string,number},apply_termcap_settings2013-01-28 18:33:17
454504ApplicationssoundUNCONFIRMED>=media-sound/mpg123-1.14.4 x32 ABI built with wrong LFS alias2013-01-29 14:56:43
431562ApplicationssoundUNCONFIRMEDmedia-sound/lltag 0.14.4 executable contains wrong values2012-08-15 20:03:24
434528ApplicationssoundUNCONFIRMEDmedia-sound/dagrab fails with buffer overflow detected when using cddb2012-09-10 11:44:45
437186LibrarysoundUNCONFIRMEDmedia-libs/libclthreads has wrong DESCRIPTION and HOMEPAGE and should be moved to different category2012-10-04 17:21:28
440962LibrarysoundUNCONFIRMEDmedia-libs/libclalsadrv misses soname symlink, causing aeolus to be revdep-rebuilt each time2012-11-02 17:01:02
441038ApplicationssoundUNCONFIRMEDdev-libs/redland-1.0.15 QA Notice: pkg-config files with wrong LDFLAGS detected2012-11-03 16:48:32
412217LibrarysoundUNCONFIRMEDdev-libs/redland-1.0.15 has malformed Makefile, won't emerge: "missing separator"2012-04-16 17:47:14
403627ApplicationssoundUNCONFIRMEDmedia-sound/herrie-2.2 doesn't honor LINGUAS for locale files2012-02-23 21:38:44
403625ApplicationssoundUNCONFIRMEDmedia-sound/gbsplay-0.0.91 doesn't honor LINGUAS for locale files2012-02-23 21:38:44
403623ApplicationssoundUNCONFIRMEDmedia-sound/exaile-0.3.2.1 doesn't honor LINGUAS for locale files2012-02-23 21:38:44
398571LibrarysoundUNCONFIRMEDmedia-sound/id3v2-0.1.12 crashes when tagging mp3 with VBR due to a bug in media-libs/id3lib-3.8.32012-01-18 07:32:41
386275ApplicationssoundUNCONFIRMEDmedia-sound/cdcd-0.6.6-r2: bring debian patches2011-10-11 00:24:16
434366Ebuildsshell-toolsUNCONFIRMEDapp-text/pastebin: malfunctions because pastebin.com has changed their API2012-09-13 22:48:44
443630ApplicationsselinuxUNCONFIRMEDSELinux + >app-emulation/libvirt-0.9.13-r1 - Segfault starting qemu domains.2013-02-16 18:03:09
389853Applicationsshell-toolsUNCONFIRMEDapp-misc/fdupes-1.40 no longer in portage tree2012-07-06 07:28:27
417717Unspecifiedshell-toolsUNCONFIRMED[Tracker] bash completion files that fail with paths containing spaces2012-05-28 10:15:02
417925Applicationsshell-toolsUNCONFIRMEDapp-shells/gentoo-bashcomp - bash completion fails with paths containing spaces2012-05-28 11:51:25
417945Applicationsshell-toolsUNCONFIRMEDapp-misc/devtodo - bash completion fails with paths containing spaces2012-05-28 12:08:16
413191VulnerabilitiessecurityUNCONFIRMEDapp-portage/pfl - /usr/bin/e-file is too trusting of HTTP response.2012-06-18 06:04:49
402023KernelsecurityUNCONFIRMEDThe Linux kernel, when using IPv6, allows remote attackers to determine whether a host is sniffing t2012-02-03 04:38:20
386987VulnerabilitiessecurityUNCONFIRMEDdev-lang/ruby malformed header vulnerabilities (CVE-2011-3624)2011-10-18 20:29:53
451626Applicationssci-mathematicsUNCONFIRMED[science overlay] sci-mathematics/scilab-5.4.0 - buildDoc: Error while building documentation: Could2013-02-12 03:35:49
446500Librarysci-mathematicsUNCONFIRMEDsci-libs/cln-1.3.2-r1 USE="doc" LC_ALL="de_DE.utf-8" - egrep: Das Ende des angegebenen Intervalls is2013-01-14 10:02:26
435906Applicationssci-mathematicsUNCONFIRMEDsci-mathematics/octave-3.6.2-r1 - .../work/octave-3.6.2/src/.libs/octave: error while loading shared2013-02-04 21:38:37
444660Ebuildssci-geosciencesUNCONFIRMEDsci-geosciences/mapserver - add www-servers/nginx support(?)2012-12-02 12:31:33
455430Librarysci-geosciencesUNCONFIRMEDsci-libs/shapelib-1.3.0-r1 - Please make a rev-bump after changing ebuild to install headers.2013-02-07 12:28:41
402869Unspecifiedsci-mathematicsUNCONFIRMEDmedia-fonts/jsmath-extra-dark-1.0 is missing jsMath-cmmib102012-02-29 21:13:02
421459Applicationssci-geosciencesUNCONFIRMEDsci-geosciences/grass-6.4.2, strange Exec entries in /usr/share/applications/grass64-grass.desktop2012-11-21 18:48:02
403653Applicationssci-geosciencesUNCONFIRMEDsci-geosciences/grass-6.4.1-r1 doesn't honor LINGUAS for locale files2012-10-07 09:43:41
391783Applicationssci-geosciencesUNCONFIRMEDsci-geosciences/mapserver-6.0.1 conflicting types for 'msWFSGetCapabilities11'2011-11-26 23:14:21
403649Applicationssci-chemistryUNCONFIRMEDsci-chemistry/gperiodic-2.0.10-r2 doesn't honor LINGUAS for locale files2012-02-23 21:47:07
382321Applicationssci-biologyUNCONFIRMEDsci-biology/emboss-6.3 runtime functionality missing2011-09-09 23:18:48
450886DevelopmentsciUNCONFIRMEDdev-python/numpy-1.6.2 with dev-lang/icc - blas_*_info: libraries mkl,vml,guide not found in [libd2013-01-08 14:09:21
449472DevelopmentsciUNCONFIRMED[science overlay] dev-lang/julia-9999 - ld: cannot find -lunwind-generic2013-01-06 15:57:08
435844LibrarysciUNCONFIRMEDsci-libs/netcdf-4.1.1-r4 USE=doc - egrep: Das Ende des angegebenen Intervalls ist nicht gültig2012-12-14 12:44:40
424461EbuildssciUNCONFIRMED[science overlay] app-portage/g-octave-9999 fails running with ImportError: cannot import name Confi2012-07-02 10:57:20
419995ApplicationssciUNCONFIRMED[science overlay] media-gfx/librecad-9999 - fix for changed directory structure2012-07-19 04:53:04
413515DevelopmentsciUNCONFIRMEDsci-libs/scipy - import failures due to missing symbols in clapack.so2013-02-07 13:44:35
413041ApplicationssciUNCONFIRMEDsci-misc/boinc fails(?) when ntpdate (/etc/init.d/ntp-client) is used to abruptly change the system 2012-04-24 20:13:47
397885ApplicationssciUNCONFIRMEDsci-misc/boinc-6.12.42: boincmgr process keeps running and an empty space is left in the taskbar aft2012-04-18 12:43:50
396657ApplicationssciUNCONFIRMED[science-overlay] dev-perl/Bio-BigFile-1.06 fails to emerge due to missing jkweb.a2012-02-11 16:02:44
396065ApplicationssciUNCONFIRMED[science-overlay] embassy-topo fails to emerge due to wrong filesize2012-02-20 14:33:52
396063ApplicationssciUNCONFIRMED[science-overlay] embassy-mse fails to emerge due to wrong filesize2012-02-20 14:33:56
396057ApplicationssciUNCONFIRMED[science-overlay] embassy-phylipnew-3.69 fails to emerge due to wrong filesize2012-02-20 14:34:00
386269UnspecifiedsciUNCONFIRMEDsci-libs/scipy-0.9.0-r2 fails to emerge due to missing blas2012-06-03 10:35:59
390757Core systemsciUNCONFIRMEDsci-mathematics/mcsim: pkg should not be installing /usr/include/random.h (breaks random packages)2011-11-18 19:22:47
379713ApplicationssciUNCONFIRMEDdev-ml/ocamlgsl should depend on dev-lang/ocaml[ocamlopt]2011-11-15 00:12:33
376237ApplicationssciUNCONFIRMEDsci-misc/boinc-6.12.33: boinc is missing menu when connecting to localhost2012-06-27 10:06:22
378215UnspecifiedsciUNCONFIRMED[science overlay] files missing after layman sync2011-08-11 14:49:17
427346ApplicationsschemeUNCONFIRMED=dev-scheme/guile-1.8.8-r1 fails to build with clang-3.1-r42013-02-02 12:44:30
379975Core systemsbriesenUNCONFIRMED=sys-fs/udev-164-r2: /dev/capi20 missing (*again*)2012-03-22 15:59:34
386769ApplicationssbriesenUNCONFIRMEDnet-dialup/capi4k-utils-20050718-r5 init script should change opts variable to use either extra_comm2012-06-07 16:11:26
447970Core systemsandboxUNCONFIRMEDsys-apps/sandbox makes autoconf's getcwd long path test take hours2013-01-31 14:19:12
431638SandboxsandboxUNCONFIRMEDsys-apps/sandbox-2.6 sometimes sends QA warnings to tty2012-08-16 19:44:12
421665SandboxsandboxUNCONFIRMEDsys-apps/busybox-1.20.1 fails with sandboxing enabled2012-11-26 17:24:29
447022Core systemsambaUNCONFIRMEDUnmasking Samba 42013-02-01 17:06:39
440580ApplicationssambaUNCONFIRMEDnet-fs/samba-3.5.15: some elog messages should only be shown when upgrading from an old enough packa2012-10-31 16:27:27
397355ServersambaUNCONFIRMEDnet-fs/samba cluster flags wrong config file /etc/ctdb/functions2012-01-16 23:57:57
454634DevelopmentrubyUNCONFIRMEDdev-lang/ruby-1.8.7_p371 - callback.func:1:7: error: expected identifier or '(' before 'long'2013-01-30 23:00:08
458022Core systemryaoUNCONFIRMEDsys-block/iscsitarget-1.4.20.2 - 1 out of 1 hunk FAILED -- saving rejects to file kernel/conn.c.rej2013-02-17 19:02:08
417709UnspecifiedrubyUNCONFIRMEDdev-ruby/ruby-opengl-0.60.1-r2 fails configure with ruby1.9 - cannot load such file -- mkrf2012-05-27 06:43:59
427854DevelopmentrubyUNCONFIRMEDdev-ruby/rspec-core-2.10.1 USE=doc - String finished while reading (break on []) already read: ...2012-07-26 05:09:16
431200ApplicationsrubyUNCONFIRMEDdev-lang/rubinius-1.2.4.20110705 - m/builtin/unpack.cpp:284:5: error: narrowing conversion of ‘214742013-02-12 09:50:38
403603ApplicationsrubyUNCONFIRMEDgames-util/rubygfe-0.3.4-r1 doesn't honor LINGUAS for locale files2012-02-23 21:38:44
411805DevelopmentrubyUNCONFIRMEDdev-lang/ruby-1.9.3_p125 - openssl_missing.h:71:6: error: conflicting types for ‘HMAC_CTX_copy’2012-04-14 21:28:46
417033UnspecifiedrubyUNCONFIRMEDdev-ruby/childprocess-0.3.2 fails to emerge due to missing rspec/core/rake_task2012-05-25 08:09:51
397329ApplicationsrubyUNCONFIRMEDdev-lang/ruby-1.9.3_p0 does not compile2012-01-03 21:33:00
366675EbuildsrubyUNCONFIRMEDdev-lang/ruby-1.9.2 only builds with -fPIC2012-04-30 08:28:50
454562ApplicationsroxUNCONFIRMEDrox-extra/archive - deprecation warning about python_mod_cleanup()2013-01-29 19:23:09
425758EbuildsroxUNCONFIRMEDrox-base/rox-lib - Deprecation Warning: Usage of python_mod_optimize() in packages not support......2012-07-18 09:48:32
392463EbuildsroxUNCONFIRMEDrox-extra/roxcd: Deprecation Warning about of python_mod_cleanup()2012-09-09 01:16:09
457910Developmentrobbat2UNCONFIRMEDqt-creator should RDEPEND on something providing ssh-askpass for git push2013-02-21 12:40:02
458288Applicationsrobbat2UNCONFIRMEDsys-apps/hwinfo stack smashing detected2013-02-19 20:31:17
458262baselayoutrobbat2UNCONFIRMEDsys-fs/lvm2 Failed to find sysfs mount point when starting2013-02-20 16:20:15
451374Applicationsrobbat2UNCONFIRMEDdev-vcs/git: missing required_use for "gtk" use-flag2013-01-13 17:17:07
444532Applicationsrobbat2UNCONFIRMEDnet-misc/cfengine try to exec /sbin/ifconfig instead of /bin/ifconfig2013-02-08 06:53:29
434186Applicationsrobbat2UNCONFIRMEDmedia-gfx/monica: HOMEPAGE and SRC_URI change2012-09-07 08:58:39
435304Unspecifiedrobbat2UNCONFIRMEDapp-portage/g-cpan-0.16.4-r1 generates broken ebuild depending on perl-g-cpan instead of dev-perl mo2013-02-21 07:50:32
436062Developmentrobbat2UNCONFIRMEDapp-portage/g-cpan - perl-gcpan/RT-Extension-Nginx-0.02 - mkdir /usr/etc: Permission denied at /usr/2012-09-24 11:14:58
437718Core systemrobbat2UNCONFIRMEDsys-fs/lvm2-2.02.97 /etc/init.d/lvm-monitoring slows down boot and shutdown on systems with multiple2012-12-23 09:48:04
439614GNOMErobbat2UNCONFIRMEDsys-apps/vbetool-1.1: Failed Running automake2013-02-06 22:06:33
440558Applicationsrobbat2UNCONFIRMEDsys-fs/lvm2-2.02.88: some elog messages should only be shown when upgrading from an old enough packa2012-10-31 16:24:58
443634Applicationsrobbat2UNCONFIRMEDdev-vcs/git-1.8.0-r1 USE=gnome-keyring - ld: i386:x86-64 architecture of input file `git-credential-2012-11-19 10:42:29
444402Serverrobbat2UNCONFIRMEDnet-misc/memcached - Malformed pid filename when running multiple instances2012-11-23 09:40:18
434110Applicationsrobbat2UNCONFIRMEDapp-admin/cancd-0.1.0-r2: netconsole init script fails to start due to wrong ifconfig path2012-09-06 14:20:31
417785Ebuildsrobbat2UNCONFIRMEDapp-portage/g-cpan-0.16.4 broken regexp building for some cpan modules2012-05-30 09:21:46
408089Keywording and Stabilizationrobbat2UNCONFIRMEDsys-power/pmtools-20110323: stabilize any version providing turbostat utility2012-10-07 09:45:03
411115Developmentrobbat2UNCONFIRMEDdev-util/rats-2.3 version bump and HOMEPAGE change2012-04-07 08:41:07
402749Otherrobbat2UNCONFIRMEDwillikins changelog feature broken2012-02-08 19:00:11
376775Ebuildsrobbat2UNCONFIRMEDapp-portage/g-cpan-0.16.4 handling of overlays2011-08-03 01:16:10
366509Applicationsrobbat2UNCONFIRMEDdev-db/libdbi-drivers-0.8.3: uses incorrect query for listing tables on PostgreSQL database2011-05-12 18:58:07
453264All ISOreleaseUNCONFIRMEDFirewire hard drive support missing from Alpha install CD2013-01-21 01:54:43
448788InstallCDreleaseUNCONFIRMEDAMD 64 install CD: wireless network card not detected (lenovo T61, Intel Wireless 4965) - missing fi2012-12-27 07:54:59
453080All ISOreleaseUNCONFIRMEDSIL 3124 SATA controller driver missing from Alpha install CD2013-01-20 01:23:16
429646GamesreavertmUNCONFIRMEDdev-games/openscenegraph-3.0.1 with sys-devel/clang-3.1 - error: cannot initialize a parameter of ty2012-08-04 00:29:11
431912InstallCDreleaseUNCONFIRMEDinstall-x86-minimal-20120710.iso - boot hangs while looking for cdrom when encounters swap partition2013-02-21 02:38:59
434236DevelopmentrafaelmartinsUNCONFIRMEDdev-lua/luafilesystem-1.5.0 with dev-lang/lua-5.2.1: src/lfs.c:779:30: error: array type has incompl2013-02-03 13:08:19
455824ApplicationsrafaelmartinsUNCONFIRMEDwww-client/xombrero-1.4.0 - make branding configurable2013-02-07 17:56:52
366395Keywording and StabilizationrafaelmartinsUNCONFIRMED>=dev-lang/luajit-2.0.0_beta7 needs arm and ppc testing2012-05-31 17:47:27
435350DevelopmentradhermitUNCONFIRMEDcrossdev-20120721 msp430 target missing libcrt02012-09-19 08:59:37
458266ApplicationsqtUNCONFIRMEDmedia-video/smplayer should respect LINGUAS2013-02-20 14:37:33
451456LibraryqtUNCONFIRMED[qt overlay] Qt5 packages try to link against already installed versions during recompilation2013-02-14 11:59:11
448178LibraryqtUNCONFIRMED[qt overlay] x11-libs/qt-webkit-5.0.0: Project ERROR: Unknown module(s) in QT: opengl2013-01-09 08:46:26
448830LibraryqtUNCONFIRMEDx11-libs/qt-openvg-4.8.4 - qpaintengine_vg.cpp:3212:5: error: narrowing conversion of ‘d->QVGPaintEn2013-02-17 11:26:14
433956LibraryqtUNCONFIRMED[qt overlay] =x11-libs/qt-(widgets|svg)-5.0.0_beta1 are missing USE flag opengl2013-01-09 08:49:17
438848ApplicationsqtUNCONFIRMEDsci-astronomy/stellarium crashes/hangs on start: QEglContext::swapBuffers(): "Bad surface (0x300D)"2012-10-26 20:08:07
415929Serverqmail-bugsUNCONFIRMEDnet-mail/queue-repair should depend on dev-lang/python:2.*2012-05-15 15:06:41
379033Serverqmail-bugsUNCONFIRMEDmail-filter/qmail-scanner: Causing problems with RBL-checks activated spamassassin on target when se2011-08-14 02:01:12
370611Serverqmail-bugsUNCONFIRMEDmail-mta/netqmail-1.06 build failure: missing dependency - sys-apps/groff2011-06-08 06:31:17
454176DevelopmentpythonUNCONFIRMEDdev-lang/python - LONG_BIT error cross-building from 64-bit to 32-bit2013-01-26 18:17:25
455210DevelopmentpythonUNCONFIRMEDdev-lang/python-3.2.3 fails to build native Parser/pgen while crosscompiling2013-02-04 19:42:53
457676DevelopmentpythonUNCONFIRMEDdev-python/pymad-0.6 madmodule.so is segfaulting as soon as it is invoked2013-02-15 17:17:34
455132DevmanualqaUNCONFIRMEDWrong hyperlink, must be absolute2013-02-04 05:08:57
440214EbuildsqaUNCONFIRMED[tracker] packages with emerge messages that can be improved by checking the previous installed vers2013-02-14 19:45:48
407597DevmanualqaUNCONFIRMEDhardblockers and versioned slot deps missing under general-concepts/dependencies2013-01-01 18:38:03
380499EbuildsqaUNCONFIRMED[TRACKER] Missing dependencies, found with autodep util2012-09-08 12:54:42
371637DevmanualqaUNCONFIRMEDarrow syntax (->) is missing in SRC_URI documentation2011-12-20 19:42:23
447714EbuildspythonUNCONFIRMEDdev-lang/python should have epatch_user2012-12-18 15:46:32
447264UnspecifiedpythonUNCONFIRMEDdev-lang/python - QA Notice: USE Flag 'hardened' not in IUSE2012-12-15 15:50:35
443510EbuildspythonUNCONFIRMEDdev-lang/python should install helper file for sys-devel/gdb2012-11-16 16:07:09
437738ApplicationspythonUNCONFIRMEDdev-python/pycurl-7.19.0-r1000 crashes python interpreter when calling reset too many times on a pyc2012-10-09 20:08:53
439662EbuildspythonUNCONFIRMED=dev-lang/python-2.7.3-r2 pydoc-2.7 init script should drop need net2012-10-26 16:14:27
428170EbuildspythonUNCONFIRMEDdev-python/ipython 0.10.2 should depend on dev-lang/python[threads]2012-07-26 17:48:33
431058Eclasses and ProfilespythonUNCONFIRMEDdev-util/gdbus-codegen-2.32.4 - /usr/portage/eclass/python-distutils-ng.eclass: line 206: syntax err2012-08-12 16:45:06
434716DevelopmentpythonUNCONFIRMEDdev-lang/python:2.7 - POSIX_SEMAPHORES_NOT_ENABLED 1 in /usr/include/python2.7/pyconfig.h2012-09-11 15:18:37
433175ApplicationspythonUNCONFIRMEDdev-lang/python-2.7.3-r2: Exception AttributeError: AttributeError("'_DummyThread' object has no att2012-09-03 18:23:18
427244DevelopmentpythonUNCONFIRMEDdev-python/networkx 1.7 - Syntax errors / warnings in Python modules for CPython 3.2: File "/usr/lib2013-01-22 11:57:15
401651Core - DependenciespythonUNCONFIRMEDdev-lang/python 3.1.4-r3 and 2.7.2-r3 sys-libs/readline is conditional on ncurses?2012-02-01 06:29:39
402027EbuildspythonUNCONFIRMEDdev-python/django-1.3.1 with dev-python/psycopg-2.4.2 fails app/project tests2012-04-28 20:35:29
407681ApplicationspythonUNCONFIRMEDmedia-sound/quodlibet-2.3.92-r1 segfaults when dev-lang/python-2.7.2-r3 is compiled with the hardene2012-10-06 17:14:29
413393UnspecifiedpythonUNCONFIRMEDdev-lang/python[tk] should depend on dev-tcltk/tix2012-04-25 00:28:33
413863DevelopmentpythonUNCONFIRMEDdev-lang/python-3.2.3 - improve cross compilation2012-12-17 14:57:26
385131CorepythonUNCONFIRMEDapp-admin/python-updater-0.9: append --keep-going to emerge2012-03-17 11:41:48
386163Core systempythonUNCONFIRMEDEmerging app-admin/eselect-python-20100321 fails with 2011-10-09 11:37:24
394103Core systempythonUNCONFIRMEDdev-lang/python-2.7.2-r3 fix for exception: "handle out of range in select()"2011-12-10 21:27:35
377925DevelopmentpythonUNCONFIRMEDdev-python/docutils-0.[78]: TypeError: can't use a bytes pattern on a string-like object2011-10-07 21:22:24
399417ServerpythonUNCONFIRMED2013-02-07 19:28:02
395495ApplicationspythonUNCONFIRMEDdev-lang/python-3.2.2 failed (test phase)2011-12-22 08:56:37
381809EbuildspythonUNCONFIRMEDgames-simulation/singularity-0.30c fails to run with Python32012-12-29 15:00:48
371009DevelopmentpythonUNCONFIRMEDdev-lang/python-2.7.1-r1 fails to cross compile on mipsel-r3000-linux-uclibc2011-10-02 21:07:28
389633Unspecifiedproxy-maintUNCONFIRMEDx11-drivers/xf86-input-wacom / sys-kernel/linuxwacom-module - missing udev rules for wacom2013-02-16 14:37:56
370711Serverproxy-maintUNCONFIRMEDmedia-sound/teamspeak-server-bin-3.0.0_beta30: Crashes when starting from stock init script - Virtua2012-11-18 10:17:00
426658EbuildsproaudioUNCONFIRMEDmedia-sound/phasex-0.12.0_beta3 installs desktop and icon files in wrong places2013-01-13 09:19:20
403595ApplicationsproaudioUNCONFIRMEDmedia-sound/ardour-2.8.12 doesn't honor LINGUAS for locale files2012-02-23 21:38:44
388549ApplicationsproaudioUNCONFIRMEDmedia-libs/lv2core-9999 - missing dependency on dev-python/rdflib2011-10-26 14:24:49
457574PrintingprintingUNCONFIRMEDnet-print/cups-1.6.1 - Brother USB Laser Printer no longer prints anything2013-02-15 15:36:09
452896PrintingprintingUNCONFIRMEDnet-print/cups-1.6.1 - missing linguas2013-01-19 16:44:53
450220ApplicationsprintingUNCONFIRMED=net-print/cups-1.5.2-r4 - German localization file has empty strings.2013-01-05 18:07:19
440578PrintingprintingUNCONFIRMEDnet-print/cups-1.5.2-r4: some elog messages should only be shown when upgrading from an old enough p2012-10-31 16:27:11
435188PrintingprintingUNCONFIRMEDnet-print/foo2zjs: Wrong path to the CUPS usb backend2012-09-16 15:56:26
425192PrintingprintingUNCONFIRMEDapp-text/acroread-9.5.1-r1 not able to open file by clicking in filemanager, bum request for acrorea2013-02-15 17:03:57
429442EbuildsprintingUNCONFIRMEDapp-text/ghostscript-gpl - disable endian check when cross-compiling2012-08-02 13:07:09
412293PrintingprintingUNCONFIRMEDapp-text/acroread-9.5.1 - dirname missing operand in wrapper script2012-04-17 15:46:03
403327PrintingprintingUNCONFIRMEDnet-print/foomatic-db-ppds-4.0.20120117-r1: Missing NickName and ModelName in /usr/share/cups/model/2012-02-14 21:13:08
408855PrintingprintingUNCONFIRMEDapp-text/acroread-9.4.7 with www-client/firefox-10.0.1-r1 - after closing pdf loaded in tab acroread2012-03-20 14:30:11
457770ApplicationsprefixUNCONFIRMEDdev-lang/R not linking to correct (Prefix) gfortran library2013-02-18 19:16:23
455546Prefix SupportprefixUNCONFIRMEDsys-libs/zlib as a wrong install_name in the optional minizip library2013-02-05 02:58:40
449084UnspecifiedprefixUNCONFIRMEDwww-client/firefox-17.0.1 fails to build due to missing dependencies2013-01-14 17:53:42
438144Prefix SupportprefixUNCONFIRMEDdev-util/quilt-0.60 using app-misc/getopt2012-10-12 16:13:50
430722Prefix SupportprefixUNCONFIRMEDdev-util/pkgconfig: (prefix) libtool uses wrong libglib-2.0.so2012-08-14 16:51:03
426982Prefix SupportprefixUNCONFIRMEDCannot build cgi for dev-lang/php (5.4.3, 5.4.4-rc2)2012-09-25 08:25:19
422907Prefix SupportprefixUNCONFIRMEDdev-lang/ghc-7.4.1-r1: Undefined symbols for architecture x86_64 when building in-tree ghc-pwd2012-09-28 20:27:16
422535Prefix SupportprefixUNCONFIRMEDdev-lisp/sbcl-1.0.55-r1: Fail to compile on x64 OS X due to missing binary2012-06-21 05:23:34
419517Prefix SupportprefixUNCONFIRMEDdev-lang/php[gd] does not pull in media-libs/gd2012-06-03 18:42:03
419525Prefix SupportprefixUNCONFIRMEDCannot build dev-lang/php[iconv]2012-07-09 19:28:12
416465Prefix SupportprefixUNCONFIRMEDFailed to emerge dev-libs/protobuf-2.4.1 "No suitable threading library available."2012-08-12 20:11:24
416983Prefix SupportprefixUNCONFIRMEDx11-libs/libpciaccess fails to build on OS X due to missing sys/endian.h2012-05-21 22:07:00
412773Prefix SupportprefixUNCONFIRMEDapp-editors/emacs-vcs: Includes incorrect libpng header file2012-04-22 13:12:19
390669Prefix SupportprefixUNCONFIRMEDdev-lang/ocaml-3.12.0 emerge fails with ocamlopt useflag2011-11-29 19:27:40
395021Prefix SupportprefixUNCONFIRMEDWriting ebuilds that have different dependencies across platforms undocumented2012-03-01 16:39:16
385153Prefix SupportprefixUNCONFIRMEDx11-libs/mesa: Support building our own OpenGL library on Mac OS X2011-10-01 07:56:36
449436Applicationspolynomial-cUNCONFIRMEDapp-emulation/virtualbox-4.1.22-r1 - Checking for Mesa / GLU: Mesa not found at -L/usr/X11R6/lib 2012-12-31 16:33:12
367199Applicationsportage-utilsUNCONFIRMEDapp-portage/portage-utils 'qlop' - gauge option's description is vague and misleading2011-05-17 10:12:02
382413Prefix SupportprefixUNCONFIRMEDx11-lib/qt-webkit fails to link against media-libs/phonon on Mac OS X (framework is missing)2011-09-09 18:29:43
381105Prefix SupportprefixUNCONFIRMEDdev-lang/nasm-2.09.10: failed to compile in prefix/linux-amd642011-08-30 04:04:34
371785Prefix SupportprefixUNCONFIRMEDBootstrapping gcc fails on SUSE Enterprise 11 SP02011-06-15 15:13:04
371729Prefix SupportprefixUNCONFIRMEDBootstrapping tar fails on SUSE Enterprise 11 SP02011-06-15 14:17:54
401617Core systemppc64UNCONFIRMEDsys-kernel/gentoo-sources-3.2.1-r2 produces a lot of "BUG: using smp_processor_id() in preemptible .2012-02-05 03:20:56
447534Applicationspolynomial-cUNCONFIRMEDapp-emulation/virtualbox-4.1.22-r1 - VBox/Runtime/common/string/strformatrt.cpp:829:19: internal com2012-12-23 18:30:14
447356Unspecifiedpolynomial-cUNCONFIRMEDapp-emulation/virtualbox-modules-4.2.4 with kernel 3.7 - modprobe: FATAL: Error inserting vboxdrv (/2013-02-14 10:04:16
440532Applicationspolynomial-cUNCONFIRMEDapp-emulation/virtualbox-modules-4.1.22: some elog messages should only be shown when upgrading from2012-10-31 16:22:12
380301Applicationspolynomial-cUNCONFIRMEDapp-emulation/virtualbox-4.1.2 crashes when compiling with -O2 option2012-02-01 09:06:12
365643Ebuildspolynomial-cUNCONFIRMEDapp-emulation/virtualbox-additions-4.* License wrongly stated as PUEL2012-07-18 02:27:12
456892Portage Documentationpms-bugsUNCONFIRMEDMissing formal specification of ebuild naming policy2013-02-13 00:48:01
365899.tbz2 supportpms-bugsUNCONFIRMEDautomatic RDEPEND for binpkgs using python2011-05-11 17:58:24
456928Applicationsphp-bugsUNCONFIRMEDdev-lang/php-5.4.8[imap] - ./conftest: symbol lookup error: /usr/lib64/libc-client.so.1: undefined s2013-02-13 19:05:07
456820Developmentphp-bugsUNCONFIRMEDdev-lang/php-5.3.21-r2 fails to compile with USE="ssl"2013-02-12 08:54:30
453924Developmentphp-bugsUNCONFIRMEDdev-lang/php-5.4.8 - Shouldn't create /var/lib/net-snmp/mib_indexes at runtime2013-01-26 01:47:58
451840Developmentphp-bugsUNCONFIRMED=dev-lang/php-5.4.8 - /usr/lib/gcc/x86_64-pc-linux-gnu/4.5.4/../../../../lib64/libldap.so: undefined2013-01-14 12:35:20
449264Libraryphp-bugsUNCONFIRMEDdev-php/pecl-mongo-1.3.2 version bump2013-01-08 14:42:51
448750Applicationsphp-bugsUNCONFIRMEDdev-php/PEAR-Mail: Fix non-static function warning2012-12-27 02:01:00
447180Ebuildsphp-bugsUNCONFIRMEDdev-php/PEAR-Archive_Tar missing php bzip2, posix & zlib RDEPEND useflags2013-01-02 14:19:42
439918Serverphp-bugsUNCONFIRMEDdev-lang/php USE=fpm should provide a systemd service file2012-12-27 21:50:11
437064Applicationsphp-bugsUNCONFIRMEDdev-lang/php (5.4.6 and 5.4.7) fail to build under x32 profile2012-10-03 13:16:23
435742Applicationsphp-bugsUNCONFIRMEDdev-php/igbinary-1.1.1-r1 with dev-lang/php[threads] compilation fails with: apc_serializer.h:57:5: 2012-09-21 16:43:14
435390Applicationsphp-bugsUNCONFIRMEDdev-lang/php-5.4.7 - .../work/sapis-build/cli/ext/dba/dba_cdb.c:59:2: error: unknown type name 'uint2012-09-18 13:59:57
434734Applicationsphp-bugsUNCONFIRMEDapp-doc/php-docs-20101029-r1 doesn't install anything except symlink2013-01-14 14:39:05
432804Project-specific documentationphp-bugsUNCONFIRMEDhttp://www.gentoo.org/proj/en/php/php-upgrading.xml multiple small issues2012-08-27 10:29:56
423167Developmentphp-bugsUNCONFIRMEDdev-php/pecl-http-1.7.4 fails at runtime with "undefined symbol: gcry_control" when using net-libs/g2012-08-01 12:00:35
412913Applicationsphp-bugsUNCONFIRMEDapp-admin/eselect-php leaves dangling files2012-04-24 14:07:08
392719Developmentphp-bugsUNCONFIRMEDdev-lang/php does not compile with alternative ROOT2012-03-02 12:58:20
455604ApplicationsperlUNCONFIRMEDmail-filter/spamassassin-3.3.2-r1 initd script fails because checkpath is missing2013-02-05 21:53:32
448198DevelopmentperlUNCONFIRMEDdev-lang/perl/perl-5.12.4-r1 ebuild should not print missing symlinks warnings when package is remov2012-12-25 15:04:45
439920Core systemperlUNCONFIRMEDdev-lang/perl-5.12.4-r1 - pp.o: In function `Perl_pp_pow': pp.c:(.text+0x3a8a): undefined reference 2012-10-28 16:20:23
440142LibraryperlUNCONFIRMEDdev-perl/XML-LibXML - Segmentation fault when removing child nodes with entity or namespace subnodes2012-10-29 19:19:42
437484DevelopmentperlUNCONFIRMEDdev-lang/perl-5.16.1 - Pod::Perldoc (perldoc) failures caused by typo2012-10-08 11:15:54
430626DevelopmentperlUNCONFIRMEDdev-lang/perl-5.16.1 - Can't locate strict.pm in @INC2012-10-26 23:10:24
429378DevelopmentperlUNCONFIRMEDdev-lang/perl-5.16 already provides Data::Dumper2012-11-10 12:52:41
427040LibraryperlUNCONFIRMEDperl-core/Math-BigInt-1.997.0 "overload arg '..' is invalid" warning2012-07-19 15:41:53
427990EbuildsperlUNCONFIRMEDvirtual/perl-File-Spec-3.330.0-r1 tries to downgrade dev-lang/perl-5.16.02012-09-25 19:42:06
425200EbuildsperlUNCONFIRMEDwww-apps/Apache-Gallery-1.0_rc3 missing RDEPEND2012-07-10 04:10:51
419963DevelopmentperlUNCONFIRMEDdev-lang/perl-5.16.0 should PDEPEND virtual/perl-ExtUtils-ParseXS2012-06-07 02:24:27
416455ServerperlUNCONFIRMEDmail-filter/spamassassin-3.3.2-r1 - child process [3695] exited or timed out without signaling produ2012-05-27 12:05:55
408151LibraryperlUNCONFIRMEDdev-perl/Cairo-1.90.0 with dev-lang/perl-5.14.2 - Failed 1/8 test programs. 6/270 subtests failed.2012-04-03 19:32:36
407841ApplicationsperlUNCONFIRMED=dev-lang/perl-5.14.2[build] is missing feature.pm, required by aclocal (during stage building)2012-05-27 02:40:44
402691ApplicationsperlUNCONFIRMEDapp-text/po4a-0.41 doesn't honor LINGUAS for locale files2012-02-23 21:38:44
386751ApplicationsperlUNCONFIRMEDdev-lang/perl-5.12.4-r1: 2 files left after upgrade and "perl-cleaner --all"2012-07-14 17:16:36
381561DevelopmentperlUNCONFIRMEDdev-perl/DateTime-0.700.0 does not work with dev-lang/perl-5.14.1-r12011-09-03 16:16:11
383241ApplicationsperlUNCONFIRMEDdev-lang/perl-5.12.4-r1 - ./hints/linux.sh: line 194: ./a.out: cannot execute binary file2011-09-19 02:57:56
378645DevelopmentperlUNCONFIRMEDdev-perl/math-pari ignores profile, and fails when compiling on2011-08-20 17:10:38
374149DevelopmentperlUNCONFIRMEDMoose-2.1.0 conflicts with all existent versions of File-ChangeNotify, MooseX-Params-Validate, and M2011-07-10 03:47:03
457102DevelopmentpchristUNCONFIRMEDdev-lang/swig-2.0.8 automagically depends on sci-mathematics/octave2013-02-13 19:57:05
404453EbuildspchristUNCONFIRMED=dev-lang/swig-2.0.4-r1 - Invalid conversion breaks PHP 5.4 support2012-12-28 19:37:35
431036ApplicationspchristUNCONFIRMEDdev-lisp/sbcl fails to compile (when the build system is testing "sb-posix")2012-08-30 18:50:48
455268DevelopmentpchristUNCONFIRMED=dev-lisp/sbcl-1.1.3 - WARNING! Some of the contrib modules did not build successfully or pass the2013-02-05 16:16:54
446318ApplicationspatrickUNCONFIRMEDdev-lang/rakudo-2012.11 - pbc_to_exe: Missing or wrong version of dependency 'src/Perl6/Grammar.pm'2012-12-07 17:14:57
440576ApplicationspatrickUNCONFIRMEDapp-benchmarks/phoronix-test-suite-4.0.1: some elog messages should only be shown when upgrading fro2012-10-31 16:26:55
428418ApplicationspatrickUNCONFIRMEDsci-libs/openfoam-2.1.1 foamInstall in OpenFOAM's bashrc set wrong2012-11-30 13:38:17
424373ApplicationspatrickUNCONFIRMEDnet-misc/strongswan-5.0.0 - Outdated description about (non-)root privileges2012-07-03 14:39:13
409303ApplicationspatrickUNCONFIRMEDdev-lang/nqp-2012.02 - In file included from dyncall_thunk.c:27:0: dyncall_thunk.h:59:1: error: func2012-03-22 14:55:21
403953ServerpatrickUNCONFIRMEDwww-servers/apache-2.2.21 - CONNECT does not work over existing SSL connection2013-02-16 14:06:13
396179ApplicationspatrickUNCONFIRMEDdev-lang/nqp-2011.10 - /usr/bin/parrot: symbol lookup error: dynext/nqp_group.so: undefined symbol: 2011-12-27 21:15:43
391041ServerpatrickUNCONFIRMEDwww-servers/apache 2.2 - suexec and django non-ASCII file upload incompatibility as apache cut out L2013-02-16 14:04:07
456908Core systempam-bugsUNCONFIRMEDsys-libs/pam-1.1.6-r2: /usr/lib64/portage/bin/isolated-functions.sh: line 215: wait: `Failed Running2013-02-16 21:10:14
440582Applicationspam-bugsUNCONFIRMEDsys-auth/pambase-20101024-r2: some elog messages should only be shown when upgrading from an old eno2012-10-31 16:27:41
412941Applicationspam-bugsUNCONFIRMEDsys-auth/pam_blue-0.9.0: various username matching problems2012-05-21 21:45:01
437420ApplicationspachoUNCONFIRMEDmail-client/mail-notification-5.4-r6 - wrong rendering for the icon in message tray of Gnome 32012-10-07 07:24:26
307401ApplicationspachoUNCONFIRMEDmedia-gfx/xsane crashes during startup if xinerama is enabled2012-03-02 11:17:03
458082OpenRCopenrcUNCONFIRMEDsys-apps/openrc-0.11.8 can't set address using "apipa"2013-02-18 13:34:42
458090OpenRCopenrcUNCONFIRMEDsys-apps/openrc-0.11.8 can't set address using "arping"2013-02-18 13:35:16
458156OpenRCopenrcUNCONFIRMEDsys-apps/openrc-0.11.8 creates /etc/runlevels/sysinit/udev with wrong target when ROOT is not /2013-02-19 09:30:05
455458OpenRCopenrcUNCONFIRMEDsys-apps/openrc - netmount fuser timeout - stopping the netmount script on shutdown. cifs shares won2013-02-06 12:18:47
455082OpenRCopenrcUNCONFIRMEDsys-apps/openrc-0.11.8: Sometimes iwconfig.sh appends "enc open" to the key_SSID string2013-02-02 02:14:03
446606OpenRCopenrcUNCONFIRMEDsys-apps/openrc: Routing policy rules need to be set before routes2013-01-15 20:33:29
444652OpenRCopenrcUNCONFIRMEDUpgrade to OpenRC 0.11.5 breaks services: "You are attempting to run an openrc service on a system w2012-12-16 02:58:07
425126OpenRCopenrcUNCONFIRMEDsys-apps/openrc-0.10.5 brings up br0 interface with nonfunctional route2012-07-07 00:20:16
434532OpenRCopenrcUNCONFIRMEDsys-apps/openrc - Unsafe Signal Handling?2012-09-18 21:01:49
436266OpenRCopenrcUNCONFIRMEDsys-apps/openrc-0.9.8.4: start in LXC brings down lxc-initialized interface2012-10-05 14:00:02
439136OpenRCopenrcUNCONFIRMEDsys-apps/openrc beta testing2012-11-06 21:25:24
417365OpenRCopenrcUNCONFIRMEDsys-apps/openrc: parameter "-1" passed to dhclient, causing dhclient not to retry when failing2012-12-07 11:49:41
411815OpenRCopenrcUNCONFIRMEDsys-apps/openrc-0.9.8.4 does not install ethtool_ring and txqueuelen params for network cards in bon2012-05-05 17:48:36
375597OpenRCopenrcUNCONFIRMEDsys-apps/openrc: netmount hangs with dead remotes2012-11-18 21:55:02
378633Core systemopenrcUNCONFIRMEDrestarting one interface complains that dhcpcd is already running, even if in fact it is not (race c2011-08-13 14:26:13
369811ApplicationsopenrcUNCONFIRMEDsys-apps/openrc: Patch to measure time required for starting daemons (was: delay to sys-auth/console2012-05-20 13:25:32
369925OpenRCopenrcUNCONFIRMED/etc/conf.d/net - Setting associate_timeout_ does not have any effect with net-wireless/wpa_s2013-01-01 17:01:05
372551OpenRCopenrcUNCONFIRMEDsys-apps/openrc: rc.c:read_key() hangs waiting for input at Interactive? prompt (termios problem)2012-02-15 12:49:05
367717OpenRCopenrcUNCONFIRMEDsys-apps/openrc: services which need net aren't starting on boot2011-06-29 16:46:02
456980ApplicationsopenofficeUNCONFIRMEDapp-office/libreoffice-4.0.0.3 - inserting movie or sound in impress fails with "The format of the s2013-02-13 19:08:21
415367ApplicationsopenofficeUNCONFIRMEDapp-office/libreoffice selecting part of a file name does not work when using "LibreOffice file dial2012-05-10 13:37:24
430224ApplicationsopenofficeUNCONFIRMEDapp-office/libreoffice-bin-3.5.4.2 - printing to CUPS fails before the job has been submitted2012-08-08 18:24:36
435448EbuildsopenofficeUNCONFIRMEDapp-office/libreoffice 3.6.1.2 - .../work/libreoffice-core-3.6.1.2/workdir/unxlngx6.pro/CxxObject/co2012-09-20 18:39:47
446892ApplicationsopenofficeUNCONFIRMEDapp-office/libreoffice-bin-3.6.3.2 - Conditional formatting in Calc cells disappears2013-01-02 06:17:09
451700ApplicationsopenofficeUNCONFIRMEDapp-office/libreoffice-4.0.0.1 - .../work/libreoffice-4.0.0.1/workdir/unxlngx6.pro/CxxObject/writerf2013-01-15 17:25:30
377933ApplicationsopenofficeUNCONFIRMEDapp-office/libreoffice-3.4.2.3 Impress text boxes become inaccessible when containing RTL text2012-04-03 23:26:53
448818DevelopmentnirbheekUNCONFIRMEDdev-python/pypy USE=jit does no pax-marking2012-12-27 14:29:36
458274ApplicationsnirbheekUNCONFIRMEDnet-misc/networkmanager-0.9.6.4 does not save settings for wired connection with 802.1x authenticati2013-02-21 08:24:51
369851ApplicationsnxUNCONFIRMEDnet-misc/nx-3.4.0-r3 *** stack smashing detected ***: nxagent - terminated2012-07-12 06:06:30
435762ApplicationsnirbheekUNCONFIRMEDnet-misc/networkmanager-0.9.6.0 disconnects shortly after establishing connection2012-10-26 23:03:17
435316ApplicationsnirbheekUNCONFIRMEDnet-misc/networkmanager-openvpn-0.9.4.0/0.9.6.0 segfaults when trying to connect2013-02-15 13:53:19
429372EbuildsnirbheekUNCONFIRMEDdev-python/pypy-1.9-r1 FEATURES=sandbox - Fatal error during initialization: out of memory2012-08-02 11:53:03
420807ApplicationsnirbheekUNCONFIRMEDnet-misc/networkmanager-0.9.4.0-r2 should set channel 1 before trying ad-hoc2012-11-23 07:45:38
457656ApplicationsnikoliUNCONFIRMEDmedia-sound/clementine (while scanning media) - segfault in TagLib::File::find(TagLib::ByteVector co2013-02-15 15:57:13
437840ApplicationsnetmonUNCONFIRMEDnet-analyzer/net-snmp-5.7.2_rc1 - snmpd(XX): floating-point assist fault at ip 20000595aab3efc2, isr2012-10-14 18:00:40
438630EbuildsnetmonUNCONFIRMEDnet-analyzer/cacti Adding Patch for dev-lang/php:5.42013-02-16 13:31:52
407075ApplicationsnetmonUNCONFIRMEDnet-analyzer/nmap USE=lua fails to run after upgrade to dev-lang/lua-5.2.0 and will not rebuild2013-01-15 17:07:41
420473ApplicationsnetmonUNCONFIRMEDnet-analyzer/fail2ban-0.8.6 violates Date-Mailheader standards when using sendmail*-actions and havi2012-12-17 11:17:57
427146ApplicationsnetmonUNCONFIRMEDnet-analyzer/ntop - Segfaulting with high load netFlow monitoring2012-09-25 17:27:26
396171ApplicationsnetmonUNCONFIRMEDnet-misc/iperf-2.0.5 when using -i flag, interval calculated to be negative and spews output2011-12-27 21:01:05
373865ApplicationsnetmonUNCONFIRMEDnet-analyzer/tcptraceroute cross compiling fix2011-07-05 00:10:15
366151EbuildsnetmonUNCONFIRMEDnet-analyzer/hping: Add a suid USE flag2011-05-10 20:33:23
366159EbuildsnetmonUNCONFIRMEDnet-analyzer/hping: Patch to make hping's traceroute mode increment TTL after N retries2011-05-10 20:33:04
425196Developmentnet-proxyUNCONFIRMEDnet-proxy/adzapper needs flush.pl (removed from dev-lang/perl-5.16.0)2012-09-30 19:55:13
442874Applicationsnet-proxyUNCONFIRMEDnet-proxy/http-replicator - local rsync server reports install flash player as wrong size2012-11-14 00:16:31
449818Applicationsnet-p2pUNCONFIRMEDnet-p2p/deluge-1.3.5 with >=net-libs/rb_libtorrent-0.16 - metadata for torrents added using a magnet2013-01-03 12:09:55
426912Librarynet-p2pUNCONFIRMEDnet-p2p/deluge unicode casting problems with net-libs/rb_torrent 0.16.x2013-01-26 06:22:29
388879Servernet-p2pUNCONFIRMEDnet-p2p/mldonkey-3.1.0: Exception setgid failed: Operation not permitted trying to set group_gid2011-11-21 00:31:52
394885Applicationsnet-p2pUNCONFIRMEDnet-p2p/rtorrent-0.8.9 fails to link because of missing lpthread for LIBS2011-12-16 02:48:12
448574Applicationsnet-mailUNCONFIRMEDmail-client/etpan-ng-0.7 fails to recognize address book when composing message2012-12-26 02:54:28
432502Ebuildsnet-mailUNCONFIRMEDmail-filter/mimedefang-2.73 please stabilize2012-11-09 18:12:51
409897Librarynet-mailUNCONFIRMEDcyrus-sasl-2.1.25-r2 breaks when using GSSAPI with MAXSSF=02012-03-27 19:22:10
432706Applicationsnet-imUNCONFIRMEDnet-im/pidgin 2.10.6 XMMP/IRC accounts do not connect automatically, "waiting for network connection2012-08-28 09:58:27
435238Applicationsnet-imUNCONFIRMEDnet-im/pidgin does not detect network connection after upgrading to net-misc/networkmanager-0.9.4.0-2012-09-17 11:35:16
403459Applicationsnet-mailUNCONFIRMEDnet-mail/perdition-1.18 - options.h:42:14: error: conflicting types for ‘gdbm_version’2012-12-04 18:16:40
428486Ebuildsnet-ircUNCONFIRMEDnet-irc/ngircd-19.2 version bump2012-07-29 05:08:33
453778Ebuildsnet-fsUNCONFIRMEDnet-fs/autofs - sandbox violation in `mount -s' touching /run/mount2013-02-16 13:20:27
428008Core systemnet-fsUNCONFIRMEDnet-fs/nfs-utils-1.2.3-r1: Issues mapping uids and usernames between RHEL5 server and Gentoo client2012-07-25 15:56:19
406615Applicationsnet-fsUNCONFIRMEDnet-fs/ncpfs: HOMEPAGE and SRC_URI no longer available2012-03-02 18:26:34
455690Servernet-dialupUNCONFIRMEDnet-dialup/freeradius-2.2.0 pkg_postinstall() hint not working2013-02-07 16:30:11
455470Applicationsnet-dialupUNCONFIRMEDnet-dialup/pptpclient-1.7.2-r2: applied patch hardcodes wrong ip path2013-02-04 18:47:35
449950Applicationsnet-dialupUNCONFIRMED=net-dialup/pptpd-1.3.4-r1 incorrect restart: no matching processes found2013-01-17 06:58:53
403631Applicationsnet-dialupUNCONFIRMEDnet-dialup/lrzsz-0.12.20-r3 doesn't honor LINGUAS for locale files2012-06-11 05:25:17
403633Applicationsnet-dialupUNCONFIRMEDnet-dialup/pppconfig-2.3.17-r1 doesn't honor LINGUAS for locale files2012-02-23 21:38:44
373365Applicationsnet-dialupUNCONFIRMEDnet-dialup/radiusclient-ng fail to cross-compile2011-07-01 19:11:38
453480Applicationsmysql-bugsUNCONFIRMEDdev-db/mysql-5.1.66 - emerge --config fails after change of datadir in my.cnf2013-01-22 19:11:18
442390Applicationsmysql-bugsUNCONFIRMEDdev-db/mysql-5.5.28 - mysql_config includes -lprobes_mysql in its output, missing lib causes package2012-11-15 22:19:14
382283Ebuildsmysql-bugsUNCONFIRMEDMySQL C API missing handle_options and get_tty_password functions2012-08-15 14:25:50
433994Servermysql-bugsUNCONFIRMEDdev-db/mysql-5.1.62-r1 stack smashing detected in mysqld2012-09-05 17:17:06
435690Applicationsmysql-bugsUNCONFIRMEDdev-db/mysql-5.1.62-r1 - Makefile:186: *** missing separator. Stop.2013-02-04 23:51:03
371369Applicationsmysql-bugsUNCONFIRMEDmod-auth-mysql-4.3.9: LoadModule statement is wrong (with solution)2012-11-27 19:59:19
370703Applicationsmysql-bugsUNCONFIRMEDdev-db/myodbc-5.1.6 - emerge --config fails: odbcinst: SQLWritePrivateProfileString failed with Gene2011-06-10 02:05:40
426814Servermr_bones_UNCONFIRMEDapp-admin/syslog-ng - default configuration should @include "scl.conf"2012-07-18 16:14:44
417947Applicationsmr_bones_UNCONFIRMEDapp-misc/figlet - bash completion fails with paths containing spaces2012-05-28 12:08:37
418317Applicationsmr_bones_UNCONFIRMEDapp-admin/syslog-ng-3.3.5 - add systemd support2013-01-31 20:52:53
456904ApplicationsmozillaUNCONFIRMED[mozilla overlay] dev-lang/spidermonkey-1.8.8 - ./dist/include/js/HashTable.h:898:9: error: size of 2013-02-12 16:50:39
410829Applicationsmr_bones_UNCONFIRMEDapp-admin/syslog-ng use "dbi" use flag instead of "sql"2012-04-05 02:44:56
455770ApplicationsmozillaUNCONFIRMEDmail-client/thunderbird - after changes to initial account setup, thunderbird can not fetch imap bec2013-02-06 03:48:42
446866UnspecifiedmozillaUNCONFIRMEDdev-libs/nspr-4.9.2 - checking whether the C compiler (gcc -Os -pipe -march=armv6j -mfpu=vfp -mfloat2013-01-05 13:03:54
443712ApplicationsmozillaUNCONFIRMED>=www-client/firefox-16: add USE flag for enabling the built-in profiler2012-11-26 19:47:03
434542ApplicationsmozillaUNCONFIRMEDwww-client/firefox-bin-15.0 is trying to automatically upgrade via Mozilla Upgrade path2013-02-20 21:53:50
439558EbuildsmozillaUNCONFIRMEDdev-lang/spidermonkey-1.8.5-r1 x32 fails to build2012-10-24 21:49:59
439106ApplicationsmozillaUNCONFIRMED>=www-client/firefox-15.0.1: random freezes (e.g. opening file chooser dialog)2012-11-17 12:30:47
432236ApplicationsmozillaUNCONFIRMEDmail-client/thunderbird-bin - missing media-libs/libpng:1.2 dependency2012-08-21 20:31:46
431560DevelopmentmozillaUNCONFIRMEDdev-lang/spidermonkey-1.8.2.15: building w/uClibc fails due to finite() vs isfinite()2013-02-18 06:26:46
419833ApplicationsmozillaUNCONFIRMEDmail-client/thunderbird-10.0.4 encoding "pdf" attachment as "video/x-flv"2012-06-07 12:28:52
406541ApplicationsmozillaUNCONFIRMEDmail-client/thunderbird-10.0.1-r1 and www-client/firefox-10.0.1-r1 - checking whether the C compiler2012-03-06 13:50:15
388647Eclasses and ProfilesmozillaUNCONFIRMEDmozextension.eclass: Add new function for installing extensions in new standard install location2012-05-23 18:22:51
398113Ebuildsmobile-phoneUNCONFIRMEDapp-mobilephone/obexftp: disable unnecessary dev-lang/perl[-build] dependency2013-01-01 22:54:07
452558DevelopmentmlUNCONFIRMEDdev-lang/mlton-20100608 fails to build, unknown type name '__gmp_const'2013-01-25 08:43:11
446304DevelopmentmlUNCONFIRMEDdev-lang/ocaml-4.00.1 +ocamlopt fails w/ *** [camlp4opt] Error 2552012-12-07 11:36:00
442818DevelopmentmlUNCONFIRMEDdev-lang/smlnj-110.75 - bin/sml: Fatal error -- bogus fault not in ML: sig = 11, code = 0x5356c35d, 2012-11-12 22:21:25
441580LibrarymlUNCONFIRMEDdev-ml/csv missing csvtool binary2012-11-28 17:01:04
414975ApplicationsmlUNCONFIRMEDnet-misc/unison-2.32.52 - hangs during file transfer2012-06-06 17:00:16
379499ApplicationsmlUNCONFIRMEDnet-misc/unison-2.27.57-r1 stack smashing detected2011-08-19 00:43:25
394771Server Problemmirror-adminUNCONFIRMEDChanges to Gentoo Mirror of Star Studio, UESTC2012-07-02 08:20:51
409415Eclasses and ProfilesmgornyUNCONFIRMEDgit-2.eclass fails to clone bare repository into working directory using specific EGIT_REPO_URI2012-04-03 10:30:48
448094Eclasses and ProfilesmgornyUNCONFIRMEDgit-2_update_repo fails if HEAD file is missing2012-12-24 09:48:06
411521ApplicationsmgornyUNCONFIRMEDapp-arch/zpaq-4.04 execution attempt in: 2013-01-12 17:31:30
402415Third-Party ToolsmgornyUNCONFIRMEDapp-portage/flaggie breaks soft link after doing a cleanup2012-02-06 17:27:38
457652Applicationsmedia-videoUNCONFIRMEDmedia-video/mplayer-1.1 - fix building against >=media-libs/giflib-52013-02-18 15:14:07
455058Applicationsmedia-videoUNCONFIRMEDmedia-video/gxine with dev-lang/spidermonkey-1.8.8 - build fails to find mozjs2013-02-05 11:27:23
450526Applicationsmedia-videoUNCONFIRMEDmedia-video/tovid-0.34_p20120123 - Please rebuild dev-python/pypy:1.9 with the following USE flags e2013-01-07 11:52:42
448706Applicationsmedia-videoUNCONFIRMEDmedia-plugins/frei0r-plugins-1.3 - defish0r plugin makes kdenlive rendering fail2013-02-01 10:32:02
449238Applicationsmedia-videoUNCONFIRMEDmedia-video/gpac-0.5.0 should use --extra-cflags in configure instead of overriding OPTFLAGS2012-12-31 15:11:00
449372Applicationsmedia-videoUNCONFIRMEDnet-misc/mediatomb - broken Samsung 2012 TV send an invalid request2013-01-24 20:18:11
435354Applicationsmedia-videoUNCONFIRMEDmedia-video/devede-3.22 looks in the wrong place for /usr/share/doc/devede/html/main.html2012-09-18 13:52:57
430564Applicationsmedia-videoUNCONFIRMEDmedia-video/devede - when converting mkv, devede passes an obsolete options to mencoder2012-08-09 23:46:58
433375Applicationsmedia-videoUNCONFIRMEDmedia-video/cinelerra ignores LDFLAGS, causing multilib compile failure2012-11-20 12:23:36
419955Applicationsmedia-videoUNCONFIRMEDmedia-video/vlc-2.0.1 - src_test(): srtp-test-aes / srtp-test-recv: Libgcrypt warning: missing initi2012-09-19 13:11:08
418037Applicationsmedia-videoUNCONFIRMEDmedia-video/subtitlecomposer-0.5.3 USE=xine fails due to underlinking: ld: CMakeFiles/subtitlecompos2012-05-29 00:01:02
414911Applicationsmedia-videoUNCONFIRMEDErrors while reading video-dvd with label contains special characters2012-05-20 15:31:07
409327Applicationsmedia-videoUNCONFIRMEDmedia-video/vlc-2.0.1 crashes when playing dvd with menu (and dvd-CSS)2012-09-19 13:10:13
384947Applicationsmedia-videoUNCONFIRMEDmedia-video/aacskeys-0.4.0c-r1: please update ProcessingDeviceKeysSimple.txt2012-08-23 16:40:14
383513Applicationsmedia-videoUNCONFIRMED>media-video/transcode-1.0.7 can handle only the first audio track when transcoding from media-video2011-12-06 10:16:57
367699Ebuildsmedia-videoUNCONFIRMEDmedia-video/winki - winki: [..] ImportError: No module named gnome (missing RDEPEND?)2011-05-17 23:55:09
423687Ebuildsmedia-tvUNCONFIRMEDmedia-tv/linuxtv-dvb-apps - Please enable building of alevt2012-06-27 14:05:27
430690EbuildsmattmUNCONFIRMEDnet-libs/wt-3.2.2 - Aborting due to QA concerns: 4 files installed in /tmp/portage/net-libs/wt-3.2.22012-09-17 06:33:36
446142EbuildsmattschUNCONFIRMEDnet-misc/openconnect-4.07 - after 30 minutes the VPN reconnects but only has a partially working con2013-01-09 13:33:21
457172Eclasses and ProfilesmaxUNCONFIRMEDssl-cert.eclass should use more secure defaults for crypto functions / keylengths2013-02-19 06:49:28
402673Applicationsmedia-opticalUNCONFIRMEDapp-cdr/graveman-0.3.12_p5-r1 doesn't honor LINGUAS for locale files2012-02-23 21:38:44
418007DevelopmentmaksbotanUNCONFIRMEDdev-python/scrapy-0.14.4 fails in setup while parsing urlparse_monkeypatches.py2012-06-14 16:40:49
458370Ebuildsmaintainer-wantedUNCONFIRMEDdev-db/libodb-sqlite - access a SQLite database using ODB (dependency of dev-db/odb)2013-02-20 13:24:27
458376Ebuildsmaintainer-wantedUNCONFIRMEDdev-db/odb-examples - Programming examples for use with ODB (dependency of dev-db/odb)2013-02-20 13:24:27
458352Ebuildsmaintainer-wantedUNCONFIRMEDdev-db/libodb-mssql - access a Microsoft SQL Server using ODB (dependency of dev-db/odb)2013-02-19 22:10:18
458348Ebuildsmaintainer-wantedUNCONFIRMEDdev-db/libodb-pgsql - acess a PostgreSQL database using ODB (dependency of dev-db/odb)2013-02-19 22:09:23
458218Ebuildsmaintainer-wantedUNCONFIRMEDapp-admin/amdoverdrivectrl-1.2.1 - control the frequency and fan settings of your AMD/ATI video card2013-02-19 20:28:02
458152Ebuildsmaintainer-wantedUNCONFIRMEDdev-db/odb-2.2.0 - C++ Object-Relational Mapping (ORM) implemented as a gcc plugin2013-02-19 22:42:42
455352Ebuildsmaintainer-wantedUNCONFIRMEDsys-boot/pesign - signing tool for PE-COFF binaries2013-02-09 19:35:57
454724Ebuildsmaintainer-wantedUNCONFIRMEDnet-analyzer/tallow - Block hosts that attempt to bruteforce SSH using the journald API2013-01-30 19:39:56
454396Ebuildsmaintainer-wantedUNCONFIRMEDNew ebuild: gnome-extra/proxy_applet-0.2 - GNOME applet for changing network proxy configuration fro2013-01-28 08:58:55
454346Ebuildsmaintainer-wantedUNCONFIRMEDEbuild request: app-misc/elasticsearch - Open Source, Distributed, RESTful, Search Engine2013-01-28 18:47:24
453658Ebuildsmaintainer-wantedUNCONFIRMEDdev-util/jenkins - application that monitors executions of repeated jobs, such as building a softwar2013-01-30 11:30:11
453476Ebuildsmaintainer-wantedUNCONFIRMEDgameandwatch-0.3.ebuild - This is a generic engine for simulation of Game & Watch-like games2013-01-23 03:24:22
453348Ebuildsmaintainer-wantedUNCONFIRMEDdev-ada/zlib-ada-1.3 - a thick [Ada] binding to the popular compression/decompression library ZLib2013-02-18 20:21:56
452916Servermaintainer-wantedUNCONFIRMEDnet-misc/stargazer - Stargazer billing system for small home and office networks.2013-02-03 16:39:33
452850Ebuildsmaintainer-wantedUNCONFIRMEDwww-apps/snorby - Ruby on Rails application for network security monitoring2013-01-18 17:12:00
452800Ebuildsmaintainer-wantedUNCONFIRMEDapp-office/gnuaccounting - a Free Java cross-platform accounting and bookkeeping application2013-01-19 16:41:10
452572Ebuildsmaintainer-wantedUNCONFIRMEDdev-php/PHP_Invoker - Utility class for invoking callables with a timeout.2013-01-22 16:32:38
452252Ebuildsmaintainer-wantedUNCONFIRMEDEbuild providing UEFI shell binary (from tianocore) would be useful2013-01-15 17:18:18
450946Ebuildsmaintainer-wantedUNCONFIRMEDapp-vim/syntastic - vim plugin: Syntastic is a syntax checking plugin that runs files through extern2013-01-08 20:07:20
450944Ebuildsmaintainer-wantedUNCONFIRMEDdev-python/flake8-9999 - code checking using pep8 and pyflakes2013-01-08 20:08:22
450068Ebuildsmaintainer-wantedUNCONFIRMEDsys-apps/evemu - Tools and bindings for kernel input event device emulation, data capture and replay2013-01-03 23:06:27
449794Ebuildsmaintainer-wantedUNCONFIRMEDapp-emulation/tilem-2.0 - an emulator and debugger for Texas Instruments Z80-based graphing calculat2013-01-03 00:16:42
448644Gamesmaintainer-wantedUNCONFIRMEDgames-arcade/xpilot-ng-4.7.3 - a multi-player 2D spacewar game2012-12-26 11:29:52
448400Librarymaintainer-wantedUNCONFIRMEDdev-php/PEAR-Image_Barcode2 - generate barcode representations of given strings2012-12-24 16:11:53
447542Ebuildsmaintainer-wantedUNCONFIRMEDdev-php/PHPExcel-9999 - A pure PHP library for reading and writing spreadsheet files2012-12-17 12:31:03
447920Ebuildsmaintainer-wantedUNCONFIRMEDnet-analyzer/check_mk - Nagios / Icinga general purpose plugin to retrieve data2013-01-11 16:04:32
448016Ebuildsmaintainer-wantedUNCONFIRMEDapp-misc/hardening-wrapper - New package. - Compiler wrapper to enable security hardening flags2012-12-26 21:51:22
447192Ebuildsmaintainer-wantedUNCONFIRMEDapp-admin/logstash - a tool for managing events and logs2013-02-02 04:42:43
447044Ebuildsmaintainer-wantedUNCONFIRMEDdev-perl/Parse-DebianChangelog - Parse Debian changelogs and output them in other formats2012-12-26 21:51:22
446680Ebuildsmaintainer-wantedUNCONFIRMEDsys-fs/snapper - a tool for managing btrfs snapshots2013-02-13 15:38:41
446198Ebuildsmaintainer-wantedUNCONFIRMEDdev-python/python-xcaplib-1.0.17 - Client for managing full or partial XML documents on XCAP servers2012-12-06 21:23:53
446192Ebuildsmaintainer-wantedUNCONFIRMEDdev-python/python-eventlib-0.1.1 - Coroutine-based networking library2012-12-06 08:27:46
446076Developmentmaintainer-wantedUNCONFIRMEDdev-lua/tir-0.9.3.3 - simple Lua+Mongrel2 web framework2012-12-05 14:16:08
445724Ebuildsmaintainer-wantedUNCONFIRMEDnet-p2p/armory - New package. - Full-featured Bitcoin client, offering a dozen innovative features..2012-12-04 14:45:46
445396Ebuildsmaintainer-wantedUNCONFIRMEDapp-text/debiandoc-sgml - DebianDoc SGML DTD and formatting tools2012-12-04 21:26:44
444946Ebuildsmaintainer-wantedUNCONFIRMEDdev-python/txscheduling-1.1 - A scheduling plugin for Twisted2013-02-17 16:25:45
445106Eclasses and Profilesmaintainer-wantedUNCONFIRMEDxmlcatalog.eclass needed for managing xml catalogs in packages2012-11-29 19:33:23
443714Ebuildsmaintainer-wantedUNCONFIRMEDdev-java/jllvm-3.1.2 - bindings for LLVM, providing an object-oriented interface as similar as possi2012-11-19 09:24:34
443476Ebuildsmaintainer-wantedUNCONFIRMEDapp-admin/reprepro - Tool for creating a Debian APT repository with a pool structure2012-11-16 16:10:46
442104Ebuildsmaintainer-wantedUNCONFIRMEDsci-geosciences/osmconvert - Tool for converting and processing OpenStreetMap files2012-11-06 21:45:24
441652Ebuildsmaintainer-wantedUNCONFIRMEDdev-python/pybird-1.0.8 - class for talking to bird bgp daemon2012-11-04 18:50:37
439700Ebuildsmaintainer-wantedUNCONFIRMEDapp-vim/evervim - a vim plugin for editing Evernote note's directly from vim2012-10-26 16:19:43
439640Ebuildsmaintainer-wantedUNCONFIRMEDdev-python/twilio-3.4.1: Python bindings for twilio2012-10-26 16:10:05
438236Ebuildsmaintainer-wantedUNCONFIRMEDsys-kernel/xenomai-sources and sys-libs/xenomai-libs - a real-time development framework cooperating2012-10-19 15:32:10
438490Ebuildsmaintainer-wantedUNCONFIRMEDwww-plugins/mozilla-gnome-keyring-0.6.4 - A firefox extension that enables Gnome Keyring integration2012-10-15 18:59:37
439396Ebuildsmaintainer-wantedUNCONFIRMEDmedia-sound/postfish - The Postfish is a digital audio post-processing, restoration, filtering and m2012-10-26 06:43:41
439408Ebuildsmaintainer-wantedUNCONFIRMEDdev-db/rockmongo-1.1.5 - Web-based administration for Mongo database in PHP2013-02-07 14:35:09
437106Ebuildsmaintainer-wantedUNCONFIRMEDapp-misc/stiki - a tool for reverting vandalism on Wikipedia2012-10-04 06:58:58
436372Ebuildsmaintainer-wantedUNCONFIRMEDdev-ruby/jruby-pageant - Gem for communicating with Pageant agent from JRuby2012-09-27 07:21:29
435596Ebuildsmaintainer-wantedUNCONFIRMEDdev-ruby/rainbow - extension to ruby's String class adding support for colorizing text on ANSI termi2012-10-03 17:50:28
435558Applicationsmaintainer-wantedUNCONFIRMEDnet-analyzer/graphite - Enterprise scalable realtime graphing2013-02-12 17:05:51
434592Ebuildsmaintainer-wantedUNCONFIRMEDnet-misc/bubbleupnpserver - extends your existing UPnP AV Media Servers and Media Renderers on your 2012-09-11 14:16:40
433786Ebuildsmaintainer-wantedUNCONFIRMEDmedia-fonts/opengostfont-0.3 - Open-source version of the fonts by Russian standard GOST 2.304-812012-09-04 09:14:50
432040Ebuildsmaintainer-wantedUNCONFIRMEDdev-libs/xdispatch - a event processing library (aka Grand Central Dispatch by Apple)2012-08-23 09:02:49
431802Ebuildsmaintainer-wantedUNCONFIRMEDwww-apps/gitlab Project management and code hosting application written in ruby2013-01-23 04:07:24
431706Applicationsmaintainer-wantedUNCONFIRMEDdev-lang/jwasm - masm compatible crossplatform assembler2012-10-20 19:27:43
431566Ebuildsmaintainer-wantedUNCONFIRMEDdev-tex/blahtexml - Blahtex and Blahtexml: Converting TeX equations into MathML2012-08-17 23:46:19
431364Ebuildsmaintainer-wantedUNCONFIRMEDdev-util/lttngtop - lttng top like utility2012-08-14 12:55:50
431358Ebuildsmaintainer-wantedUNCONFIRMEDdev-util/lttng-modules - lttng kernel modules2012-08-14 12:55:20
431356Ebuildsmaintainer-wantedUNCONFIRMEDdev-util/lttng-tools - linux trace tools2012-08-14 12:54:32
431354Ebuildsmaintainer-wantedUNCONFIRMEDdev-util/lttng-ust - Linux Trace Toolkit - UST library2012-08-14 12:55:20
427744Ebuildsmaintainer-wantedUNCONFIRMEDdev-python/django-dajaxice-0.2 - Easy to use AJAX library for django2012-12-12 12:09:22
427746Ebuildsmaintainer-wantedUNCONFIRMEDdev-python/django-dajax-0.8.4 - Easy to use library to create asynchronous presentation logic with d2012-12-12 12:17:56
427754Ebuildsmaintainer-wantedUNCONFIRMEDdev-python/django-tinymce-1.5.1_beta2 - TinyMCE integration for Django2012-12-12 12:32:51
427762Ebuildsmaintainer-wantedUNCONFIRMEDNew: dev-python/django-grappelli-2.4.0 - A grid-based alternative/extension to the Django administra2012-07-24 14:52:05
427764Ebuildsmaintainer-wantedUNCONFIRMEDNew: dev-python/django-filebrowser-3.5.0 - File management in the Django admin interface2012-12-13 06:57:02
427770Ebuildsmaintainer-wantedUNCONFIRMEDNew: dev-python/django-publisher-0.0.3 - Django external publishing app2012-12-13 07:01:05
428024Ebuildsmaintainer-wantedUNCONFIRMEDdev-libs/breakpad -- An open-source multi-platform crash reporting system2012-08-17 21:05:56
428246Ebuildsmaintainer-wantedUNCONFIRMEDapp-backup/jungledisk-server - offsite managed backup for servers2012-07-28 23:06:49
429576Applicationsmaintainer-wantedUNCONFIRMEDapp-misc/ola: Open Lighting Architecture2013-01-20 18:34:59
427734Ebuildsmaintainer-wantedUNCONFIRMEDNew: dev-python/django-sekizai-0.4.2 - Django Template Blocks with extra functionality2012-12-12 11:51:41
427738Ebuildsmaintainer-wantedUNCONFIRMEDNew: dev-python/django-cms-2.3 - A Django application for managing hierarchical pages of content2012-12-12 12:04:20
427730Ebuildsmaintainer-wantedUNCONFIRMEDNew: dev-python/django-mptt-0.4.2 - Utilities for implementing a modified pre-order traversal tree i2012-12-12 11:46:23
427728Ebuildsmaintainer-wantedUNCONFIRMEDNew: dev-python/django-classy-tags-0.3.4.1 - Class based template tags for Django2012-12-12 11:41:28
427296Ebuildsmaintainer-wantedUNCONFIRMEDdev-python/django-tables2-0.11.0 - Table/data-grid framework for Django2012-12-12 11:30:43
426926Ebuildsmaintainer-wantedUNCONFIRMEDsys-kernel/mkinitramfs-ll-{0.10.8,9999}: consider adding this ebuild to the tree2012-07-30 15:04:36
427162Ebuildsmaintainer-wantedUNCONFIRMEDdev-python/django-admin-tools-0.4.1 - a collection of tools for the django administration interface2012-12-12 12:25:24
425202Ebuildsmaintainer-wantedUNCONFIRMEDx11-plugins/torchat - Pidgin plugin for p2p instant messaging through Tor hidden service tunnels2012-07-08 14:10:34
424818Ebuildsmaintainer-wantedUNCONFIRMEDnet-nntp/moviegrabber - a fully automated way of downloading movies from usenet2012-11-29 03:18:46
423533Ebuildsmaintainer-wantedUNCONFIRMEDx11-misc/gdm3setup - A GUI to setting GDM32012-11-14 15:19:55
419847Ebuildsmaintainer-wantedUNCONFIRMEDmedia-plugins/gst-editing-services - a high-level library for facilitating the creation of audio/vi2012-07-08 08:53:36
419599Ebuildsmaintainer-wantedUNCONFIRMEDdev-libs/folly - Newly open-sourced C++ library from Facebook Engineering2012-06-04 10:42:01
418195Ebuildsmaintainer-wantedUNCONFIRMEDsci-misc/hets - the Heterogeneous Tool Set, a parsing, static analysis and proof management tool2012-05-30 12:49:44
418285Ebuildsmaintainer-wantedUNCONFIRMEDmedia-libs/dcmtk - DCMTK - a collection of libraries and applications implementing large parts the D2012-05-30 18:44:00
419167Ebuildsmaintainer-wantedUNCONFIRMEDgames-rpg/bastion-20120529-r2 - an original action role-playing game set in a lush imaginative world2012-09-25 08:31:15
418403Ebuildsmaintainer-wantedUNCONFIRMEDapp-admin/puppet-dashboard - a web interface providing node classification and reporting features fo2012-10-09 03:21:48
417681Ebuildsmaintainer-wantedUNCONFIRMEDmedia-plugins/gimp-apng-0.1.0 - provides Animated PNG (APNG) image file load and save modules for th2012-07-06 20:09:12
417295Ebuildsmaintainer-wantedUNCONFIRMEDmedia-video/sview-12.05 - a universal stereoscopic player which supports image viewing and movie pla2012-10-14 10:12:17
415829Ebuildsmaintainer-wantedUNCONFIRMEDsci-chemistry/cclib-1.0.1 - Library for parsing and interpreting the results of computational chemis2012-05-15 15:01:01
415531Core systemmaintainer-wantedUNCONFIRMEDsys-kernel/uksm-sources - Full Linux sources including the Gentoo patchset and UKSM patch2012-05-13 02:28:39
415443Ebuildsmaintainer-wantedUNCONFIRMEDnet-fs/junglediskworkgroup-3.16 - Networked storage/backup using Amazon's S3 service2012-07-28 23:06:49
413535Ebuildsmaintainer-wantedUNCONFIRMEDdev-lang/julia - a high-level, high-performance dynamic programming language for technical computing2012-12-19 07:31:31
413389Ebuildsmaintainer-wantedUNCONFIRMEDmedia-fonts/prosto-1 - New font for project of free fonts www.jovanny.ru / / Font has multilanguage 2012-04-24 19:51:59
412921Ebuildsmaintainer-wantedUNCONFIRMEDapp-text/peg-multimarkdown - An implementation of MultiMarkdown in C, using a PEG grammar2012-04-24 14:13:30
412493Ebuildsmaintainer-wantedUNCONFIRMEDmedia-tv/mumudvb - (Multi Multicast DVB) is a program for streaming TV over a network originally bas2012-04-18 17:40:58
412041Ebuildsmaintainer-wantedUNCONFIRMEDmedia-sound/mudita24-1.0.3 - an application controlling the digital mixer, channel gains and other h2012-04-16 10:43:36
411619Ebuildsmaintainer-wantedUNCONFIRMEDmedia-sound/rockbox-utility - Graphical utility for automating Rockbox firmware installation and man2012-11-07 20:02:26
411515Ebuildsmaintainer-wantedUNCONFIRMEDdev-util/peg - tools for generating recursive-descent parsers.2012-06-30 09:24:16
411173Ebuildsmaintainer-wantedUNCONFIRMEDsys-cluster/orangefs-2.8.5 - a branch of the PVFS2 cluster filesystem2012-04-09 18:51:41
411087Core systemmaintainer-wantedUNCONFIRMEDsys-fs/ddumbfs-1.0.11 - An inline data deduplicating filesystem designed with backup in mind2012-04-07 14:35:41
409759Ebuildsmaintainer-wantedUNCONFIRMEDx11-themes/gtk-engines-clearlooks-compact-1.5 - Theme for Clearlooks GTK+ engine, optimized for smal2012-07-12 11:32:18
408729Ebuildsmaintainer-wantedUNCONFIRMEDapp-misc/shelr - console screencasting tool2012-06-03 20:50:21
408207Ebuildsmaintainer-wantedUNCONFIRMEDmedia-fonts/gohufont-2.0 - a bitmap font for programming and terminal use2012-11-01 14:25:15
408037Ebuildsmaintainer-wantedUNCONFIRMEDNew ebuild: net-mail/maildirarc - Maildirarc is a tool for archiving a given set of Maildir folders2012-03-13 16:00:30
408155Gamesmaintainer-wantedUNCONFIRMEDgames-misc/limbs-off - a 2D fighting game2012-08-01 12:04:55
408013Ebuildsmaintainer-wantedUNCONFIRMEDdev-python/netzob - Network protocol modelization by reverse engineering2012-05-09 15:21:42
405945Ebuildsmaintainer-wantedUNCONFIRMEDNew ebuild: app-misc/pycarddav - a simple way of accessing a CardDAV resource, mainly for use with m2012-10-14 18:19:44
406865Ebuildsmaintainer-wantedUNCONFIRMEDwww-servers/distcache - Distributed session caching2012-03-05 20:17:46
406935Ebuildsmaintainer-wantedUNCONFIRMEDmedia-libs/silly-0.1.0 - Silly image codec (Simple Image Loading LibrarY)2012-03-05 20:40:08
402767Ebuildsmaintainer-wantedUNCONFIRMEDagner - a rebar-friendly Erlang package index and package manager inspired by Clojars and Homebrew2012-03-09 08:30:12
403579Ebuildsmaintainer-wantedUNCONFIRMEDdev-tex/latexdraw - a graphical drawing editor for LaTeX2012-04-29 18:30:43
403667Ebuildsmaintainer-wantedUNCONFIRMEDapp-vim/ropevim-0.3_rc0 - vim plugin for using rope python refactoring library2012-02-14 21:15:54
404143Ebuildsmaintainer-wantedUNCONFIRMEDapp-misc/kirikoo-upload-0.5.1 - CLI script for uploading images to http://kirikoo.net (French)2012-02-16 21:00:50
404477Ebuildsmaintainer-wantedUNCONFIRMEDNew Ebuild: x11-misc/unagi-0.3 Unagi Compositing Manager2012-02-22 05:09:14
401921Ebuildsmaintainer-wantedUNCONFIRMEDsci-libs/o2scl - An object-oriented library for scientific computing in C++2012-02-04 17:07:01
402211Applicationsmaintainer-wantedUNCONFIRMEDapp-misc/freeplane (app-misc/freemind replacement) - software to support thinking, sharing informati2012-10-16 14:54:19
401409Ebuildsmaintainer-wantedUNCONFIRMEDsys-auth/oath-toolkit - Toolkit for using one-time password authentication with HOTP/TOTP algorithms2012-02-01 20:03:54
401009Unspecifiedmaintainer-wantedUNCONFIRMEDdev-python/pillow - a fork of (dev-python/)imaging2012-01-27 21:14:38
399711Ebuildsmaintainer-wantedUNCONFIRMED[ebuild request] sys-process/ulatencyd - monitors the system and categorizes the running processes i2012-04-09 14:20:31
399199Ebuildsmaintainer-wantedUNCONFIRMEDmedia-sound/acoustid-fingerprinter - GUI application for submitting audio fingerprints to Acoustid2012-01-17 21:28:50
399009Ebuildsmaintainer-wantedUNCONFIRMEDnet-im/myagent-im - Instant messenger that implements Mail.ru protocol2012-01-17 03:58:52
396543Ebuildsmaintainer-wantedUNCONFIRMEDEbuild for Cherrytree - A hierarchical note taking application2013-01-30 17:37:55
398137Ebuildsmaintainer-wantedUNCONFIRMEDitap rdp client - a closed source rdp client that supports (among other things) TS-Gateway servers2012-01-10 15:05:30
396151Ebuildsmaintainer-wantedUNCONFIRMEDx11-misc/xinequery-0.3 - utility to view information regarding active Xinerama screens2012-01-06 21:16:00
396247Ebuildsmaintainer-wantedUNCONFIRMEDx11-misc/xcompmgr-dana - Dana Jansens's fork of the X Composisting Manager2011-12-28 18:12:36
395415Ebuildsmaintainer-wantedUNCONFIRMEDdev-lang/dmd - Digital Mars D Programming Language2013-02-07 20:33:19
394295Gamesmaintainer-wantedUNCONFIRMEDgames-misc/timeseal - a chess timekeeping utility2011-12-11 12:22:41
392975Ebuildsmaintainer-wantedUNCONFIRMED[science overlay] sci-mathematics/pulp - a Python wrapper for linear programming solvers2011-12-04 05:05:24
392737Ebuildsmaintainer-wantedUNCONFIRMEDnet-misc/turpial-1.6.6 - Lightweigth and featurefull microblogging client2012-10-03 15:56:13
391923Ebuildsmaintainer-wantedUNCONFIRMEDapp-office/charm-1.5.2 - Charm time tracking application2013-01-15 17:57:57
391767Ebuildsmaintainer-wantedUNCONFIRMED[EBuild Request] QDjango2011-12-10 07:31:25
390751Ebuildsmaintainer-wantedUNCONFIRMEDRequest to add meego-packaging-tools ebuild2011-11-17 12:28:33
389707Developmentmaintainer-wantedUNCONFIRMEDoh-my-zsh: framework for managing your zsh configuration2011-11-08 03:31:32
390225Core systemmaintainer-wantedUNCONFIRMEDAll kernels missing cbfw_fc.bin file.2011-11-13 04:58:26
390401Ebuildsmaintainer-wantedUNCONFIRMEDx11-misc?-glc-9999 - OpenGL & ALSA video capture tool2011-12-24 09:50:12
389151Ebuildsmaintainer-wantedUNCONFIRMEDnet-misc/justwifiindicator-0.1 - Simple WiFi signal strength tray indicator2011-11-20 12:10:03
389017Ebuildsmaintainer-wantedUNCONFIRMEDdev-python/acutil - Tool for setting up authentication from network services ( Python2 library )2011-11-01 15:34:30
389021Ebuildsmaintainer-wantedUNCONFIRMED[net-misc?]/dlan-linux - Find and configure your devolo (Ethernet via existing electrical wiring) dL2012-01-12 10:14:40
389027Ebuildsmaintainer-wantedUNCONFIRMEDnet-misc/qpid-cpp - cross-platform Enterprise Messaging system which implements the Advanced Message2012-08-31 06:30:43
389029Ebuildsmaintainer-wantedUNCONFIRMEDsys-libs/libuser - implements a standardized interface for manipulating and administering user and g2011-11-01 15:42:13
383299Ebuildsmaintainer-wantedUNCONFIRMED[ebuild request] degate - IC digital logic reverse engineering tool2011-09-17 10:44:18
382099Ebuildsmaintainer-wantedUNCONFIRMEDmedia-gfx/mitsuba - An extensible rendering framework written in portable C++ (ebuild request)2011-09-07 04:01:42
381563Librarymaintainer-wantedUNCONFIRMEDSISL - "The SINTEF Spline Library", a comprehensive NURBS library for the modeling and interrogation2011-10-07 01:01:21
380943Ebuildsmaintainer-wantedUNCONFIRMEDsys-apps/udev-discover: Sysfs browsing tool focused on helping udev users and developers (new packag2011-08-28 18:11:10
380015Ebuildsmaintainer-wantedUNCONFIRMEDrequesting an ebuild for ubuntuone-client2012-07-27 12:59:34
379691Ebuildsmaintainer-wantedUNCONFIRMEDPlease add telepathy-ring ebuild into portage2013-01-18 10:49:26
371775Ebuildsmaintainer-wantedUNCONFIRMEDprotobuf-c-0.15.ebuild (New Package) - C bindings for Google's Protocol Buffers2012-06-03 20:47:25
371373Ebuildsmaintainer-wantedUNCONFIRMEDapp-i18n/wordforge-0.8_rc1 - Offline translation and localization program working internally with XL2011-06-13 22:39:51
369855Ebuildsmaintainer-wantedUNCONFIRMED[media-video(?)/]freeseer - a video capture utility capable of capturing and streaming video2012-03-16 04:22:13
368985Ebuildsmaintainer-wantedUNCONFIRMEDgames-kids/scratch: New ebuild for MIT's "scratch" programming environment for young people2012-11-21 10:11:11
369549Ebuildsmaintainer-wantedUNCONFIRMEDdev-lua/luaposix-5.1.11 - Lua bindings for POSIX APIs2011-06-06 00:24:15
368091Ebuildsmaintainer-wantedUNCONFIRMED[new package] sci-libs/sprng-2.02011-06-01 04:39:17
367027Ebuildsmaintainer-wantedUNCONFIRMEDnet-analyzer/amun - Low-interaction honeypot, capture autonomous spreading malware in an automated f2012-03-08 02:09:36
366259Ebuildsmaintainer-wantedUNCONFIRMEDx11-themes/gtk-engines-equinox - Equinox GTK+2 Engine based on Aurora2012-08-16 21:03:11
365933Ebuildsmaintainer-wantedUNCONFIRMEDNew Ebuild, plug-0.7: Linux software for Fender Mustang amplifiers2011-05-07 04:30:11
365245Ebuildsmaintainer-wantedUNCONFIRMEDEbuild request app-dicts/stardict-freedict-fra-eng2012-01-22 22:08:04
365345Ebuildsmaintainer-wantedUNCONFIRMEDgxsm-2.0 (New Package Gnome X Scanning Microscopy)2011-05-02 01:45:44
455414Librarymaintainer-neededUNCONFIRMEDdev-libs/libmix-2.05-r6 with clang-3.2 - aes/saferp.c:22:8: error: redefinition of 'expf' as differe2013-02-05 12:13:40
456256Librarymaintainer-neededUNCONFIRMEDdev-libs/libical fails when cross compiling2013-02-12 02:26:18
450156Applicationsmaintainer-neededUNCONFIRMEDmedia-gfx/splashutils-1.5.4.4-r2 unable to switch from silent mode to verbose using F2 with the 2nd 2013-01-20 10:25:23
447352Unspecifiedmaintainer-neededUNCONFIRMEDapp-laptop/tp_smapi-0.41 with kernel 3.7 - modprobe: FATAL: Error inserting tp_smapi (/lib/modules/32013-01-02 20:30:53
440544Applicationsmaintainer-neededUNCONFIRMEDmedia-gfx/splashutils-1.5.4.4-r1: some elog messages should only be shown when upgrading from an old2013-01-20 10:24:06
434240Developmentmaintainer-neededUNCONFIRMEDdev-util/bam-0.4.0 with dev-lang/lua-5.2.1: src/context.c:34:18: error: ‘LUA_GLOBALSINDEX’ undeclare2012-09-16 10:46:57
434926Applicationsmaintainer-neededUNCONFIRMED>=net-im/skype-4.0.0.7 - login failure, stuck at "signing in" with JFS filesystem2013-01-03 19:31:41
427030Applicationsmaintainer-neededUNCONFIRMEDnet-misc/sks version bump (and it should install an init.d script along with a uid/gid)2013-01-05 21:37:02
426980Ebuildsmaintainer-neededUNCONFIRMEDdev-lang/gforth-0.7.0: fails to build2012-07-23 17:43:24
426352Applicationsmaintainer-neededUNCONFIRMEDapp-text/htmldoc-1.8.27-r3 does not render PNGs properly2013-01-01 20:24:39
402701Applicationsmaintainer-neededUNCONFIRMEDapp-dicts/fantasdic-1.0_beta7-r2 doesn't honor LINGUAS for locale files2013-02-03 13:13:42
402681Applicationsmaintainer-neededUNCONFIRMEDapp-editors/cooledit-3.17.17-r1 doesn't honor LINGUAS for locale files2012-02-23 21:38:44
399217Librarymaintainer-neededUNCONFIRMEDnet-libs/udns - please add building of rblcheck, dnsget binaries2013-02-16 14:13:07
378711Applicationsmaintainer-neededUNCONFIRMEDdev-libs/dietlibc-0.33_pre20110403 - allow to install in proper place when cross-compiling2013-01-03 20:15:43
446924LibrarymabiUNCONFIRMEDx11-libs/fox-1.6.40 - Upstream bug makes build ignore -opengl.2013-01-02 19:32:57
375777Applicationsmaintainer-neededUNCONFIRMEDapp-admin/ulogd-2.0.0_beta4 should warn about needed config changes2012-12-04 17:37:14
455478ApplicationslxdeUNCONFIRMEDlxde-base/lxdm-0.4.1-r5 - How can I stop it from creating "/.dbus"?2013-02-04 19:38:47
385401ApplicationslxnayUNCONFIRMEDapp-admin/packagekit-base-0.6.18 compile error on using python3 as default2012-05-12 22:10:25
456696ApplicationslxnayUNCONFIRMED[sabayon overlay] app-text/gimagereader-0.9: complains: Could not load sane or twain, scanning will 2013-02-13 13:59:47
434812ApplicationslxdeUNCONFIRMEDlxde-base/lxdm-0.4.1-r5 - session selection not working2012-09-12 18:15:27
452874Applicationslu_zeroUNCONFIRMEDmedia-video/mplayer-1.1 - mplayer-1.1-libav-9.patch introducing enum AVPixelFormat, should be called2013-02-18 15:15:08
417239ApplicationslxdeUNCONFIRMEDIf LXDE session is running the kbd input on tty1 is broken (need to press keys twice)2012-06-14 13:17:06
135923Applicationslu_zeroUNCONFIRMEDx11-drivers/ati-drivers: weird image rendering problems with www-client/firefox2012-06-06 13:44:40
440586ApplicationslivecdUNCONFIRMEDsys-fs/squashfs-tools-4.2: some elog messages should only be shown when upgrading from an old enough2012-10-31 16:28:08
439912LiveCD/DVDlivecdUNCONFIRMEDapp-misc/livecd-tools-2.0.2: DHCP Broadcasting for IP not working2012-12-30 00:39:23
456862Libraryldap-bugsUNCONFIRMEDnet-nds/openldap-2.4.30[gnutls] is crashing2013-02-13 18:54:36
450528Serverldap-bugsUNCONFIRMEDnet-nds/openldap-2.4.30: configure: error: crossing compiling: use --with-yielding_select=yes|no|man2013-01-07 11:32:59
438702Core systemldap-bugsUNCONFIRMEDsys-auth/nss_ldap-265 encodes wrong libc version in library name if compiling for $ROOT2012-10-17 13:23:33
442324Ebuildslang-miscUNCONFIRMEDdev-lang/fpc ebuilds are largely outdated2012-11-08 09:14:16
454874Developmentlang-miscUNCONFIRMEDdev-lang/tcc-0.9.26_pre1 - access violation in install tcc-doc.info /usr/share/info2013-02-04 05:50:10
399899Developmentlang-miscUNCONFIRMEDdev-lang/fpc-2.6.0 USE=ide - fpcalc.pas(244,3) Fatal: Selected assembler reader not supported2012-02-15 16:20:16
416641Ebuildslang-miscUNCONFIRMEDdev-lang/fpc-2.6.0 configuration files contain paths with ${D}2012-05-21 03:37:35
376519Ebuildslang-miscUNCONFIRMEDdev-lang/dmd-2.054 version bump2011-09-19 08:24:26
454868ApplicationslackUNCONFIRMEDx11-wm/fluxbox-? with updated media-libs/glew-1.9.0 - `fbrun` yields error while loading shared libr2013-02-04 17:23:15
454866ApplicationslackUNCONFIRMEDx11-misc/ipager-1.1.0 - Calls imlib_render_image_on_drawable with image being NULL. (Imlib2 Develope2013-01-31 19:30:56
451202ApplicationslackUNCONFIRMEDx11-wm/fluxbox-1.3.3 100%CPU hangs2013-01-10 16:11:20
449340ApplicationslackUNCONFIRMEDwww-client/firefox-17.0.1 crashed while watching movie online2013-01-02 22:09:55
382235EbuildslackUNCONFIRMEDapp-admin/gkrellm: Missing x11-libs/pango dependency2012-02-29 18:42:56
399325ApplicationslackUNCONFIRMEDapp-admin/gkrellm-2.3.5 crashes when enabling x11-plugins/gkrellm-cpufreq-0.6.1 plugin2012-01-18 23:07:12
415153ApplicationslackUNCONFIRMEDx11-wm/fluxbox-1.3.2 tabbing windows breaks drag & drop2013-01-08 21:34:01
415667ApplicationslackUNCONFIRMEDx11-misc/fbpager - HOMEPAGE has been changed2012-05-13 15:42:57
438872ApplicationslackUNCONFIRMEDapp-admin/gkrellm - chart rendering bug2012-10-19 15:01:23
436402Eclasses and Profileskernel-miscUNCONFIRMEDkernel-2.eclass - Print the value of PATCH_DEPTH actually used for patching rather than it's initial2012-09-28 14:33:19
438730Core systemkernel-miscUNCONFIRMEDSandbox violations when emerging kernel modules from /etc/kernel/postinst.d hook against a kernel bu2012-11-05 03:29:40
438784Eclasses and Profileskernel-miscUNCONFIRMEDlinux-mod.eclass - kernel modules packages are incompatible with using multiple kernels2012-10-18 14:18:50
409207Eclasses and Profileskernel-miscUNCONFIRMEDlinux-info.eclass should document WARNING_ variables2012-03-22 03:00:57
458116Core systemkernelUNCONFIRMEDkernel 3.7.5 - BUG related to skb when sysctl net.ipv4.tcp_mtu_probing!=02013-02-21 02:44:06
366733Eclasses and Profileskernel-miscUNCONFIRMEDkernel-2.eclass enhancement proposal: removing unnecessary arch directories to save space2012-04-16 11:29:25
458028Core systemkernelUNCONFIRMEDKernel:3.7.8 BUG: unable to handle kernel paging request in radeon_mmap()2013-02-21 02:43:20
456198Core systemkernelUNCONFIRMEDsys-kernel/gentoo-sources-3.7.4 - /proc/vmcore missing?2013-02-09 19:16:36
445022Core systemkernelUNCONFIRMED=sys-kernel/gentoo-sources-3.5.7/3.6.6 - Firmware missing for Broadcome NetXtreme II2012-11-30 15:26:00
444742ApplicationskernelUNCONFIRMEDnet-fs/autofs-5.0.6-r3 unable to mount NFS on HPPA: do_mount_indirect: path to be mounted is to long2013-02-06 04:36:10
458402KDEkdeUNCONFIRMEDkde-base/kig-4.10.0 fails to emerge with USE=scripting2013-02-20 05:25:24
457732KDEkdeUNCONFIRMEDkde-base/kwin - Hyperthreading enabled + Java = Kwin unresponsive2013-02-17 17:49:19
457430KDEkdeUNCONFIRMEDkde-base/kde...-4.10.0: KDE (un-)lock dialog stays on screen after unlocking2013-02-17 22:42:33
457132KDEkdeUNCONFIRMEDkde-base/plasma-workspace-4.10.0(-r1) wont save changed wallpapers2013-02-14 06:57:54
456360KDEkdeUNCONFIRMEDkde-base/print-manager looking for org.fedoraproject.Config.Printing2013-02-14 21:31:30
456230KDEkdeUNCONFIRMEDapp-cdr/k3b-2.0.2-r4: complains about "process can't started. Calling of In/Output module not possib2013-02-10 15:13:30
455634KDEkdeUNCONFIRMEDkde-base/systemsettings kde-base/powerdevil and other kde apps have automagical media-sound/pulseaud2013-02-06 07:13:02
455286UnspecifiedkdeUNCONFIRMED=media-libs/gstreamer-0.10.36 upgrade causes kde-base/dragon-4.9.5 to crash when playing movies2013-02-04 17:58:38
453420KDEkdeUNCONFIRMEDmedia-libs/opengtl with sys-devel/llvm-3.2 fix2013-02-18 15:40:33
445392ApplicationskdeUNCONFIRMEDkde-base/konsole-4.9.3: backgroundcolor is not reset when scrolling2012-12-01 20:25:30
449296KDEkdeUNCONFIRMEDnet-im/ktp-call-ui-0.5.1: gsttaglist.h:152:28: error: conflicting declaration ‘typedef struct _GstTa2013-01-18 10:50:15
449630KDEkdeUNCONFIRMEDkde-base/kdelibs-4.9.4-r1: several *.desktop files are not compliant with XDG standard (missing trai2013-01-01 13:31:13
434216KDEkdeUNCONFIRMEDdev-util/cmake-2.8.9: FindLua51.cmake finds dev-lang/lua-5.2.12012-10-02 07:29:27
423827KDEkdeUNCONFIRMEDkde-base/kdm fails to start using binpkgs2013-02-17 22:50:42
403923KDEkdeUNCONFIRMEDKDE device notifier does not show USB devices after umounting2012-02-16 18:07:10
395397KDEkdeUNCONFIRMEDkde-base/systemsettings-4.7.3: kdm settings->Theme "Get new theme" button doesn't work2012-04-14 08:21:23
435784EbuildsjsbronderUNCONFIRMED=sys-cluster/ganglia-3.3.7 calling gcc/ar/ranlib directly2012-09-22 16:41:49
407155UnspecifiedjsbronderUNCONFIRMEDsys-cluster/openmpi - Rmpi fails to install under dev-lang/R-2.14.2 due to undefined symbol: mca_bas2012-05-11 12:13:24
406855EbuildsjsbronderUNCONFIRMEDsys-cluster/ganglia: Install gmetad-python.2013-02-15 17:46:20
373923LibraryjsbronderUNCONFIRMEDsys-cluster/openmpi-1.5.3-r1: mpirun hangs or fails with Segmentation faults2012-02-06 19:20:57
434242DevelopmentjohnnyUNCONFIRMEDdev-vcs/monotone-1.0-r3 with dev-lang/lua-5.2.1: src/lua.hh:41:23: error: ‘LUA_GLOBALSINDEX’ was not2013-01-29 06:21:50
409867EbuildsjmbsvicettoUNCONFIRMEDnet-misc/vde-2.3.2 version bump including Python support2012-06-08 13:16:39
433481LibraryjlecUNCONFIRMEDsci-libs/vtk bundles the following netcdf, ftgl, sqlite3 and exodusii2012-12-13 12:38:46
412303ApplicationsjlecUNCONFIRMEDsci-chemistry/gsim[opengl] segfaults2012-04-17 17:28:23
387567ApplicationsjlecUNCONFIRMEDx11-terms/terminator-0.96: Segmentation fault when starting2011-10-24 05:16:07
457930LibraryjkarlsonUNCONFIRMEDx11-drivers/ati-drivers-12.11_beta11 system lock on exiting X2013-02-17 17:04:26
415521ApplicationsjerUNCONFIRMEDwww-client/opera with www-plugins/adobe-flash - opera: Plug-in NNNNNN is not responding. It will be 2012-05-16 03:19:54
456718LibraryjdhoreUNCONFIRMEDmedia-plugins/audacious-plugins-3.3.4 is incompatible with media-video/libav, fails during configure2013-02-11 17:14:50
403605ApplicationsjdhoreUNCONFIRMEDmedia-plugins/audacious-plugins-3.2 doesn't honor LINGUAS for locale files2012-02-23 21:52:28
403621ApplicationsjdhoreUNCONFIRMEDmedia-sound/audacious-3.2 doesn't honor LINGUAS for locale files2012-02-23 21:38:44
422483ApplicationsjdhoreUNCONFIRMEDdev-lang/pike-7.8.352-r2 multilib-strict check failed!2012-12-21 03:51:15
427688EbuildsjdhoreUNCONFIRMEDmedia-video/miro-5.0.1, pre-stripped files, and revdep-rebuild keeps rebuilding due to /usr/bin/code2012-08-14 16:25:31
428138ApplicationsjdhoreUNCONFIRMEDwww-client/seamonkey-bin-2.10.1: png icon has no transparency2012-07-26 17:38:00
439372Core systemjdhoreUNCONFIRMEDsys-apps/paludis[ruby-bindings] installs unslotted to latest ruby (actually 1.9) disregarding eselec2013-02-07 08:07:43
453212JavajavaUNCONFIRMEDwww-servers/tomcat-7.0.X - classloading issues due to too much jars in initial classpath2013-01-21 11:59:16
450298JavajavaUNCONFIRMEDdev-lang/scala-2.10.0 version bump2013-02-14 01:32:57
439140JavajavaUNCONFIRMEDdev-java/icedtea: Use meaningful names for distfiles2013-02-20 07:39:04
438834JavajavaUNCONFIRMEDdev-java/icedtea-6.1.11.4 fails to build with java.lang.OutOfMemoryError2012-10-18 18:57:31
431972JavajavaUNCONFIRMEDicedtea-bin-7 should depend on gsettings-desktop-schemas2012-08-19 14:21:47
426756JavajavaUNCONFIRMEDsci-physics/jaxodraw-2.0.1 - doicon etc/OS/Linux/*.png: etc/OS/Linux/*.png is not a valid file/direc2012-12-16 14:31:24
421223JavajavaUNCONFIRMEDdev-java/gnu-classpath should make installing /usr/gnu-classpath-*/bin scripts optional2012-06-15 11:06:00
421677JavajavaUNCONFIRMEDdev-java/ant-commons-net-1.8.4 - *** Semantic Error: The abstract method "int compareTo(java.lang.Ob2012-06-19 02:39:45
417895JavajavaUNCONFIRMEDdev-java/stringtemplate-4.0.6 released2012-12-07 19:10:27
405865JavajavaUNCONFIRMEDjavatoolkit improvement for xpath-like xml handling2012-02-26 15:48:58
401717JavajavaUNCONFIRMEDdev-lang/scala-2.9.1 with USE=binary should not depend on ant2012-05-01 22:32:43
399471JavajavaUNCONFIRMEDdev-java/ibm-jre-bin-1.6.0.9_p2-r1: error while loading shared libraries: libstdc++.so.5: cannot op2012-01-27 02:05:35
382807ApplicationsjavaUNCONFIRMED[java-overlay] app-text/languagetool-0.9.8 needs >=virtual/ooo-3.02011-12-09 23:13:42
373561UnspecifiedjavaUNCONFIRMED[java-overlay] dev-java/testng-5.2 fails to download testng-5.2.zip2012-07-10 09:51:53
438226Documentationinfra-bugsUNCONFIRMEDwrong doc link at http://www.gentoo.org/2012-10-13 14:26:55
454218CVS/SVN/Gitinfra-bugsUNCONFIRMEDUnconfirmed reports of anonvcs (specifically cvs) failing to sync entirely2013-01-26 22:06:35
371911Otherinfra-bugsUNCONFIRMEDrequesting an A record for contest.gentoo.org2012-05-05 18:33:49
456136Libraryidl0rUNCONFIRMEDnet-dns/bind-tools with dev-libs/openssl-1.0.1c - nslookup: error: [...] /usr/lib64/engines/libgost.2013-02-11 12:12:54
443086Ebuildsidl0rUNCONFIRMEDmedia-plugins/vdr-xineliboutput-9999 change actual CVS from 9999 to 999999992012-12-02 22:03:17
417129Applicationsidl0rUNCONFIRMEDnet-dns/bind-tools-9.8.1[ssl] hardcodes OpenSSL path checks which breaks cross-compiling/etc...2013-02-08 06:12:18
439686Applicationsidl0rUNCONFIRMEDmedia-video/nvidia-settings-304.60: ignoring '.nvidia-settings-rc' when '--load-config-only' is used2012-10-26 16:36:03
382719Ebuildsidl0rUNCONFIRMEDmedia-video/nvidia-settings hangs with three connected displays [patch]2012-02-17 05:16:12
456684ApplicationshwoarangUNCONFIRMEDmedia-gfx/shotwell-0.13.1-r2: opening preferences window causes segfault in gnome-shell-3.6.2-r1 + m2013-02-13 11:47:53
450536ServerhwoarangUNCONFIRMEDnet-ftp/vsftpd-3.0.2 prints warning: `vsftpd' uses 32-bit capabilities (legacy support in use) in ke2013-01-15 23:14:17
397587ApplicationshollowUNCONFIRMEDwww-servers/nginx - add Naxsi web application firewall support2013-02-21 09:09:26
401397ServerhollowUNCONFIRMEDwww-servers/nginx: add automatic minification module (jitify)2012-11-26 08:02:58
427194ApplicationshollowUNCONFIRMEDwww-servers/nginx: add rtmp module support2012-11-26 08:04:35
442610ServerhollowUNCONFIRMEDwww-servers/nginx - Feature support request for dav-ext-module.2012-11-26 20:05:19
446734EbuildshollowUNCONFIRMEDwww-servers/nginx - init script changes owner and mode of /var/log/nginx on each startup/restart2013-01-21 03:28:06
456752Keywording and StabilizationhollowUNCONFIRMED=www-servers/nginx-1.2.6-r1 keyword request2013-02-11 11:36:03
391339EbuildshsggebhardtUNCONFIRMED[systemd overlay] sys-apps/systemd-units kdm.service long stopping2013-02-07 20:46:36
392401ApplicationshwoarangUNCONFIRMEDmedia-gfx/mypaint-0.9.1 (and 1.0.0) Can't paint after focus change2012-10-09 21:09:58
454934GameshasufellUNCONFIRMEDgames-rpg/grimrock-20121222 segfault loading dungeon editor with USE=system-libs2013-02-05 01:39:36
457728ApplicationshasufellUNCONFIRMEDx11-misc/spacefm fails by opeining files with ö ä ü or pdf file with acroread.2013-02-16 17:18:18
458064ApplicationshaskellUNCONFIRMEDx11-misc/xmobar-0.16 with dev-lang/ghc-6.12.3-r2 - src/Xmobar.hs:170:16: Not in scope: `void'2013-02-18 13:39:06
433998DevelopmenthaskellUNCONFIRMEDincompatibility between =dev-lang/ghc-7.4.1-r1 and =x11-wm/xmonad-0.102012-12-16 13:42:38
444012ApplicationshaskellUNCONFIRMED=dev-lang/ghc-6.12.3 poorly handles -fPIC (ZCMain_main_closure' can not be used when making a shared2012-12-16 14:18:00
451290LibraryhaskellUNCONFIRMEDdev-haskell/pandoc-types-1.9.1.1 - setup: At least the following dependencies are missing: syb -any2013-01-11 18:00:06
456386DevelopmenthaskellUNCONFIRMEDdev-lang/ghc-7.6.2 - Segmentation fault [libraries/haskell98/dist-install/build/Prelude.o] & others 2013-02-14 10:41:34
457780Keywording and StabilizationhaskellUNCONFIRMEDstabilization request dev-lang/ghc-7.4.22013-02-16 21:14:28
420573UnspecifiedhaskellUNCONFIRMEDhaskell-updater wrongly identifies packages as not installed by package manager2012-06-12 18:40:25
421623DevelopmenthaskellUNCONFIRMEDdev-lang/ghc-7.4.1-r1: unable to compile with portage because it results in a segmentation fault.2012-06-19 16:29:37
453492Hardenedhardened-kernelUNCONFIRMEDsys-kernel/hardened-sources-3.7.3: kernel panic when loading modules2013-01-28 14:15:36
457192HardenedhardenedUNCONFIRMEDnet-misc/quagga-0.99.21 with sys-devel/gcc-4.5.3 sometimes gives PAX: terminating task /usr/sbin/osp2013-02-21 02:32:42
448322HardenedhardenedUNCONFIRMEDmake fails on kernel/sched/core.o when trying to build sys-kernel/hardened-sources-3.5.4-r12013-01-18 21:53:13
450776HardenedhardenedUNCONFIRMEDapp-emulation/wine-1.5.21 - configure: checking for -lGL... ./conftest: error while loading shared l2013-02-11 21:23:57
391839HardenedhardenedUNCONFIRMEDcompiling external module which is using file_operations fails2011-11-25 08:09:59
395609HardenedhardenedUNCONFIRMEDsys-devel/gcc-4.5.3-r2 is aware but does not honor libssp USE flag, breaking glibc upgrades2012-01-30 01:11:12
443648ApplicationshannoUNCONFIRMEDapp-emulation/dosemu-1.4.1_pre20091009 hangs2012-11-17 18:49:41
365589HardenedhardenedUNCONFIRMEDdev-db/mysql: Doesn't starting.2012-02-02 03:06:50
386647HardenedhardenedUNCONFIRMEDdev-java/jamvm-1.5.4-r1 segfaults with hardened gcc-4.5.3-r1 (any profile), unless -Xnoinlining is s2012-07-11 11:36:26
438316ApplicationshannoUNCONFIRMEDsci-geosciences/viking-1.3.2.1 version bump2012-10-15 04:31:21
416387ApplicationshannoUNCONFIRMEDnet-analyzer/openvas-scanner - openvassd: serving 127.0.0.1: Libgcrypt warning: missing initializati2012-05-18 14:57:06
415107ApplicationshannoUNCONFIRMEDmedia-libs/gegl-0.2.0: suspect runtime-depend on dev-lang/perl2012-05-18 15:50:06
402675ApplicationshannoUNCONFIRMEDapp-arch/unp-2.0_pre7 doesn't honor LINGUAS for locale files2012-02-23 21:38:44
406333ApplicationshannoUNCONFIRMEDmedia-gfx/gimp-2.6.12 - Black and yellow striped rectangle on zoom2012-04-02 22:14:48
411271ApplicationshannoUNCONFIRMEDnet-im/python-otr-0.2.1.1 SRC_URI has changed2012-04-10 13:34:22
396525ApplicationshannoUNCONFIRMEDmail-mta/courier-0.66.3: wrong file ownership on /usr/share/courier/esmtpd2012-06-23 19:03:26
394417ApplicationshannoUNCONFIRMEDmail-mta/courier - wrong ownership/permissions on /etc/courier/ldapaliasrc2012-09-27 07:54:34
392261UnspecifiedhannoUNCONFIRMEDapp-emulation/dosemu -fno-pic causes build failure when using hardened compiler with PIE2012-12-23 17:38:30
389453Keywording and StabilizationhannoUNCONFIRMEDnet-analyzer/openvas ebuilds missing arm keyword2013-02-04 18:26:13
387147Core systemhannoUNCONFIRMEDsys-auth/pam_mount-2.12: running xfce4-session-logout eats all memory2013-01-08 13:37:30
373847ApplicationshannoUNCONFIRMEDmedia-gfx/gimp-2.6.11-r1: crash on startup with error GLib-WARNING ignoring no-arg, optional-arg or 2011-10-22 18:15:20
365561EbuildshannoUNCONFIRMEDsci-geosciences/viking-1.1 - should install or RDEPEND on "gcget"2011-10-04 04:13:34
436674ApplicationsgstreamerUNCONFIRMEDmedia-libs/gst-plugins-base-0.10.35: www-client/firefox-15.0.1[gstreamer] segfaults playing some vid2013-01-31 21:51:41
422707EbuildsgstreamerUNCONFIRMEDmedia-plugins/gst-plugins-ffmpeg-0.10.13-r2 blocking, conflicts ffmpeg and libav2012-09-03 18:03:01
418199ApplicationsgrozinUNCONFIRMEDsci-libs/mathgl-1.11.2 install phase - ln: failed to create symbolic link './mathgl-1.11.2/ChangeLog2012-06-04 09:41:36
365043GNOMEgstreamerUNCONFIRMEDmedia-plugins/gst-plugins-v4l2-0.10.28-r1: v4l2src is not working with ffmpegcolorspace (gst-plugins2011-07-07 12:30:25
440212ServergrobianUNCONFIRMEDmail-mta/exim - R=localuser T=local_delivery defer (27): File too large: error while writing to /var2012-10-30 16:23:42
389701ApplicationsgregkhUNCONFIRMEDsys-kernel/linux-firmware missing Adaptec aic94xx firmware2011-11-08 10:22:58
456180ApplicationsgraphicsUNCONFIRMEDmedia-gfx/graphicsmagick-1.3.16-r1: Perl bindings not linked properly2013-02-11 11:22:06
449086ApplicationsgraphicsUNCONFIRMEDmedia-libs/lensfun-0.2.5-r2 fails using multiple jobs2013-01-10 07:44:47
446628EbuildsgraphicsUNCONFIRMEDmedia-gfx/gtkimageview-1.6.4 should not restrict userpriv when not running tests2012-12-09 23:41:57
440960ApplicationsgraphicsUNCONFIRMEDmedia-gfx/wings crashes at startup with incorrect version of erl_driver.h2012-11-02 17:02:33
437446ApplicationsgraphicsUNCONFIRMEDmedia-gfx/nip2-7.26.4 - parser.h:57:12: error: conflicting types for ‘yyleng’ lex.c:275:11: note: pr2013-02-16 13:23:10
438436ApplicationsgraphicsUNCONFIRMEDmedia-gfx/enblend-4.0 USE=doc - !pdfTeX error: pdfetex (file ./smooth-edge.pdf): reading image file 2012-10-15 11:31:41
431986ApplicationsgraphicsUNCONFIRMEDmedia-gfx/luminance-hdr-2.3.0 - crash when loading any hdr file if compiled with -march=core22012-08-20 12:08:47
403045ApplicationsgraphicsUNCONFIRMEDmedia-gfx/tuxpaint-0.9.21-r1 doesn't honor LINGUAS for locale files2013-02-16 13:25:53
383239EbuildsgraphicsUNCONFIRMEDmedia-gfx/wings-1.4.1 version bump2011-09-16 21:42:53
369539ApplicationsgraphicsUNCONFIRMEDmedia-gfx/k3d 0.7.11.0-r1 - work/k3d-source-0.7.11.0/k3dsdk/ngui/main_document_window.cpp:1572:36: e2012-06-19 11:22:07
413489ApplicationsgnustepUNCONFIRMEDgnustep-base/gnustep-gui-0.22.0 - ld: warning: libicuuc.so.48, needed by /usr/lib64/libgnustep-gui.s2012-05-05 21:04:42
416829Applicationsgnome-officeUNCONFIRMEDapp-office/abiword-2.8.6-r2: USE=gnome is misleading, suggesting USE=goffice2012-07-07 13:04:16
455386GNOMEgnomeUNCONFIRMEDnet-misc/vinagre-3.6.2: No toolbar in fullscreen mode after upgrading to gnome 3.6 for RDP2013-02-05 02:29:22
456760GNOMEgnomeUNCONFIRMEDgnome-base/gvfs-1.14.2: segfault in gvfsd-obexftp when trying to browse cell phone via bluetooth2013-02-15 20:53:06
402689Applicationsgnome-accessibilityUNCONFIRMEDdev-libs/atk-2.2.0 doesn't honor LINGUAS for locale files2012-04-19 08:58:57
449466GNOMEgnomeUNCONFIRMEDgnome-base/gnome-control-center-3.6.3-r1 - ** (gnome-control-center:8591): WARNING **: Couldn't conn2012-12-31 19:10:49
449688GNOMEgnomeUNCONFIRMEDgnome-extra/libgda-5.1.1 ingoring introspection flag2013-01-01 20:43:41
450246LibrarygnomeUNCONFIRMEDdev-python/pygtk-2.24.0 - memory leak in _wrap_pango_cairo_create_layout2013-01-05 16:55:14
450930GNOMEgnomeUNCONFIRMEDglib-2.34.x causes nautilus-2.32 to consume 1 whole core when attempting to display thumbnails2013-02-20 16:36:03
452464GNOMEgnomeUNCONFIRMEDmedia-video/totem-3.6.x: nautilus warning: libtotem-properties-page.so: undefined symbol: bacon_vide2013-01-16 18:49:29
453730GNOMEgnomeUNCONFIRMEDdev-libs/libgweather-3.6.2: Changes between v3.4 and v3.6 break 4 gnome packages2013-01-23 20:49:10
454474GNOMEgnomeUNCONFIRMEDnet-im/empathy-3.6.3: history uses wrong encoding to show utf8 logs2013-01-28 22:49:52
454956GNOMEgnomeUNCONFIRMEDgnome-base/orbit-2.14.19-r1 with sys-devel/automake-1.13.1 - test/everything/Makefile.am:81: error: 2013-02-01 06:41:21
455222GNOMEgnomeUNCONFIRMEDnet-libs/webkit-gtk - add support for XT PaX marking2013-02-09 20:41:04
448896EbuildsgnomeUNCONFIRMEDdev-python/pygobject-3.4.2-r1 (and others): py-compile coming from 2012-12-28 19:03:04
447500GNOMEgnomeUNCONFIRMEDnet-libs/webkit-gtk-1.8.3 USE=spell - bad utf8 data is being passed to enchant_dict_check2012-12-17 19:41:30
443282GNOMEgnomeUNCONFIRMEDgnome-base/gnome-shell-3.6.1-r1 : text-scaling-factor doesn't return as user choice after using the 2012-11-16 09:57:17
428514GNOMEgnomeUNCONFIRMEDmedia-gfx/gthumb-3.0.0 broken video thumbnail handling2012-07-29 13:16:35
433706GNOMEgnomeUNCONFIRMEDGnome 3.4 Exiting games change desktop resolution2012-09-02 18:54:50
378931GNOMEgnomeUNCONFIRMEDmail-client/evolution-2.32.3: Changes in Account Editor windows cannot be submitted because of the d2012-03-05 08:17:37
398419New DocumentationgnomeUNCONFIRMEDPlease provide documentation for using pam_ldap.so in combination with sys-auth/pambase[gnome-keyrin2012-07-08 23:26:02
404475GNOMEgnomeUNCONFIRMEDgnome-base/gnome-shell-3.2.2.1 segfaults in on_apps_tree_changed_cb()2012-02-20 03:31:40
415801GNOMEgnomeUNCONFIRMEDwww-client/epiphany-3.4.1 fails test test-ephy-embed-single2012-09-16 08:52:40
420771GNOMEgnomeUNCONFIRMEDgnome-base/gvfs-1.12.3 (and apps using it, e.g. Nautilus) corrupt files on copy. Caused by prelink?2012-07-24 08:26:50
423993GNOMEgnomeUNCONFIRMEDgnome-base/gnome-keyring: unable to create a new keyring due general protection2013-02-01 20:57:07
455796genkernelgenkernelUNCONFIRMEDDetect version of building kernel from CALLBACK2013-02-06 05:53:05
448156Core systemgenkernelUNCONFIRMEDGenkernel creates broken initramfs image - wrong lvm links blocks booting to a LVM rootfs2013-02-17 02:24:54
442078genkernelgenkernelUNCONFIRMEDsys-kernel/genkernel-3.4.45 - wrong lvm.static usage2013-01-04 17:15:11
426338genkernelgenkernelUNCONFIRMEDgenkernel 3.4.24_p2: missing separator between old and new kernel version2012-12-03 20:03:30
398601genkernelgenkernelUNCONFIRMED[patch] sys-kernel/genkernel few fixes to splash handling2012-01-12 17:17:06
401149genkernelgenkernelUNCONFIRMEDcomputer hangs before shutdown with genkernel config when trying suspend to ram2012-01-28 10:25:48
409979genkernelgenkernelUNCONFIRMEDinitrd mounting /usr read/write2012-09-05 12:25:29
458456GamesgamesUNCONFIRMEDlxdream needs pax-marking2013-02-20 13:03:54
381361genkernelgenkernelUNCONFIRMEDConfigure videocards using vga_switcheroo during boot2012-04-28 00:14:57
452352GamesgamesUNCONFIRMEDgames-fps/quake2-icculus uses wrong library name on x86(-32) with 64-bit kernel2013-01-15 15:02:35
451674ApplicationsgamesUNCONFIRMEDgames-strategy/xconq-7.4.1 fails to build with dev-lang/tcl-8.6.02013-01-14 07:03:16
448416GamesgamesUNCONFIRMEDgames-strategy/dungeon-defenders - Humble Indie Bundle 7 game2013-01-04 00:06:56
436600GamesgamesUNCONFIRMEDgames-simulation/fgrun-1.6.0 fails to find dev-games/openscenegraph libs during linking2012-11-08 21:11:12
435818GamesgamesUNCONFIRMEDgames-roguelike/dungeons-of-dredmor-1.1.2.ebuild - new ebuild2012-09-22 08:12:03
424539GamesgamesUNCONFIRMEDgames-fps/qudos: problem with opengl & sdl use flags2012-10-21 12:32:14
423031GamesgamesUNCONFIRMEDgames-puzzle/mindless-1.6 crash in generating sealed deck2012-08-27 12:45:23
420603GamesgamesUNCONFIRMEDgames-roguelike/dungeons-of-dreadmore - new ebuild2012-06-10 23:28:34
417187GamesgamesUNCONFIRMEDgames-puzzle/world-of-goo installs 32-bit binary on 64-bit system, causing shadow dependency on emul2012-06-03 13:44:16
411295EbuildsgamesUNCONFIRMEDnew ebuild: games-engines/openmw2012-10-14 16:02:59
411715GamesgamesUNCONFIRMEDgames-fps/etxreal-0.30 - a heavily improved Quake 3 Arena engine2012-04-30 19:06:16
403599GamesgamesUNCONFIRMEDgames-puzzle/gtetrinet-0.7.11-r1 doesn't honor LINGUAS for locale files2012-10-03 10:09:20
405839GamesgamesUNCONFIRMEDdelay created when selecting tiles2012-02-26 03:03:55
400779GamesgamesUNCONFIRMEDgames-puzzle/lemmini - a Java port of Lemmings2012-01-25 20:53:58
394849GamesgamesUNCONFIRMEDgames-action/shank - A side scrolling beat 'em up with a comic book art style2012-09-23 17:44:45
372413GamesgamesUNCONFIRMEDImproved ebuild for games-action/transcend, also fixing sound on amd642012-12-14 06:03:39
372501GamesgamesUNCONFIRMEDNew ebuilds for Lips Of Suna (lipsofsuna-0.4.0 and git), a dungeon crawl game. Server and Client.2011-08-11 20:35:23
367787GamesgamesUNCONFIRMEDrevenge-of-the-titans-1.80.12 doesn't support humble bundle installation files.2012-12-27 10:32:12
443530Applicationsfreedesktop-bugsUNCONFIRMEDsys-power/pm-utils - fix wireless power saving in /usr/lib/pm-utils/power.d/wireless2012-11-16 16:35:14
426510Applicationsfreedesktop-bugsUNCONFIRMEDsys-power/pm-utils-1.4.1-r2 hangs PC instead of suspend to RAM2012-07-29 09:16:57
403523Core systemfreedesktop-bugsUNCONFIRMEDsys-power/pm-utils-1.4.1-r2: power.d/xfs_buffer writes wrong/invalid value(s) in battery mode2012-02-14 18:47:19
400919Unspecifiedfreedesktop-bugsUNCONFIRMEDnet-libs/libproxy-0.4.7 is linking against gnome-base/gconf2012-01-30 07:57:00
385741Applicationsfreedesktop-bugsUNCONFIRMEDsys-power/pm-utils-1.4.1-r2: delay upon starting xsession resulting in harddrive error2011-10-14 00:25:12
449666Forumsforum-modsUNCONFIRMEDURL formating issues2013-01-01 16:52:06
447694Applicationsford_prefectUNCONFIRMEDmedia-sound/pulseaudio-2.99.3 USE=-system-wide - * Starting D-BUS system messagebus ... Unknown user2013-01-30 07:04:04
365299EbuildsforensicsUNCONFIRMEDapp-forensics/aide-0.15.1 hash signing does not work2013-02-03 13:00:34
441624KDEford_prefectUNCONFIRMEDmedia-sound/pulseaudio-2.1-r1: KDE freezes when using pulseaudio.2012-11-16 17:53:45
427266Applicationsford_prefectUNCONFIRMEDmedia-sound/pulseaudio - When playing Flash plugin based video in browsers, .xsession-errors fills u2012-12-15 13:05:18
440590ApplicationsfontsUNCONFIRMEDmedia-libs/freetype-2.4.9-r1: some elog messages should only be shown when upgrading from an old eno2012-10-31 16:28:45
437082LibraryfontsUNCONFIRMEDmedia-fonts/hunkyfonts has wrong LICENSE2013-01-06 03:05:35
440538ApplicationsfontsUNCONFIRMEDmedia-fonts/urw-fonts-2.4.9: some elog messages should only be shown when upgrading from an old enou2012-10-31 16:23:03
434262ApplicationsfontsUNCONFIRMEDmedia-fonts/urwvn-fonts - wrong license due to vn garamond2013-01-06 03:07:50
433157LibraryfontsUNCONFIRMEDmedia-libs/freetype-2.4.10-r1 USE=infinality causes segmentation faults running x11-wm/openbox in _f2012-10-17 12:10:36
411643ApplicationsfontsUNCONFIRMEDapp-arch/cabextract - consistent USE flag naming? - rename USE2012-04-12 01:14:50
415653ApplicationsfontsUNCONFIRMEDx11-misc/gbdfed - HOMEPAGE has been changed2012-05-13 16:29:09
443924ApplicationsfloppymUNCONFIRMEDnet-misc/remmina-1.0.0_p20121004 - When connecting to a RDP server, the icons appear white.2013-02-11 19:16:17
455208Core systemflameeyesUNCONFIRMEDsys-firmware/amd-ucode-2012.09.10 - ebuild SRC_URI no longer available2013-02-04 00:50:10
449720Core systemferringbUNCONFIRMEDsys-apps/pkgcore-0.8.6: SyntaxError during compilation of Python modules for Python 3.22013-01-02 10:12:25
368251EbuildsevermindUNCONFIRMED[pro-audio overlay] media-libs/armstrong-9999 ebuild needs updating: distutils.eclass2011-05-23 08:42:25
438778EbuildsevermindUNCONFIRMED[pro-audio overlay] media-sound/non-things - git structure change causing configure fail and eutils 2012-10-25 13:48:06
426994EbuildsevaUNCONFIRMEDx11-drivers/xf86-input-synaptics - Enable natural scrolling for MacBooks by default2012-09-10 14:04:38
393161ApplicationsevaUNCONFIRMEDx11-drivers/xf86-input-synaptics-1.5.0: TwoFingerScroll no longer has any effect2012-03-23 20:58:34
456726Core systemeudevUNCONFIRMEDsys-fs/eudev-1_beta2-r2 has wrong KV_min value2013-02-11 15:02:13
376153EselecteselectUNCONFIRMEDRequest: eselect module for managing /etc/init.d/net.* symlinks2011-07-26 10:41:35
454344LibraryenlightenmentUNCONFIRMEDdev-libs/eet - Missing dependency on dev-libs/libgcrypt2013-01-28 00:14:15
435752LibraryenlightenmentUNCONFIRMEDmedia-libs/evas-9999 - configure: WARNING: unrecognized options: --enable-software-sdl2012-09-21 16:55:35
416227EbuildsemailUNCONFIRMEDmedia-gfx/splash-themes-livedvd: missing execute bit on /etc/splash/livedvd-12.0/scripts/*2012-10-29 21:32:09
370063DevelopmentembeddedUNCONFIRMEDsys-devel/crossdev: settings masked via arch profiles are not considered with cross-compilers2012-03-08 21:08:25
407099Project-specific documentationembeddedUNCONFIRMEDIncorrect mount options and binfmt_misc mask for "Compiling with qemu-user chroot" secion2012-03-06 17:22:43
412909EbuildsembeddedUNCONFIRMEDx11/libxcb: xcb-proto should be RDEPEND instead of DEPEND or cross compiling fail2012-05-10 03:29:04
417263EbuildsembeddedUNCONFIRMEDsys-apps/busybox - USE=make-symlinks should not overwrite existing files2012-06-28 04:01:46
441976StagesembeddedUNCONFIRMEDIdea: Providing a tiny stage (and profile) for limited embedded devices.2013-02-15 11:46:25
444524DevelopmentembeddedUNCONFIRMEDcrossdev: emerge-wrapper: arm-unknown-linux-gnueabi-emerge virtual/init fail becaus of missing USE-f2012-11-26 17:26:27
439618DevelopmentdotnetUNCONFIRMEDdev-lang/mono-3 version bump2013-02-16 23:15:04
437118EbuildsdotnetUNCONFIRMEDdev-lang/mono-9999 - git master live ebuild2012-10-04 18:35:50
435168EbuildsdotnetUNCONFIRMEDdev-lang/mono-2.10.9-r2 merge fails with configure error2012-10-04 18:38:09
435684ApplicationsdotnetUNCONFIRMEDdev-lang/boo-0.9.4.9 - [exec] .../work/boo-0.9.4.9/default.build(1049,4): [exec] External Program F2012-10-10 06:29:54
404263EbuildsdotnetUNCONFIRMEDdev-lang/mono-2.10.5: remove MAKEOPTS=-j1 limitation2012-02-19 11:00:47
410981ToolsdolsenUNCONFIRMEDapp-portage/etc-proposals with dev-lang/python-2.7[-berkdb] - raise error, "db type could not be det2012-04-09 20:36:29
453360[RU]docs-teamUNCONFIRMEDChange "??????" to Portage2013-01-21 15:56:55
455874Installation Handbookdocs-teamUNCONFIRMEDminor typo in code listing 2.1 (ru translation)2013-02-06 16:33:17
451846Installation Handbookdocs-teamUNCONFIRMEDwireless-tools no longer function with default installation2013-01-20 16:04:16
451040[DE]docs-teamUNCONFIRMEDConflict with english translation "Anacron exits"2013-01-09 12:11:06
445186Installation Handbookdocs-teamUNCONFIRMEDA link to the online list of local USE flags is missing in the installation handbook2012-11-29 12:18:57
442158Installation Handbookdocs-teamUNCONFIRMEDhandbook chapter numbering2012-11-07 13:12:47
437542Other documentsdocs-teamUNCONFIRMEDSuggestion for using speaker-test instead of relying on an audio player in the ALSA guide2012-10-29 19:09:04
424513Other documentsdocs-teamUNCONFIRMEDiptables comment for working w/ UML2012-07-02 15:44:13
400721Installation Handbookdocs-teamUNCONFIRMEDPart about bonding should be reworked2012-09-05 11:11:12
392743Other documentsdocs-teamUNCONFIRMEDImplicit assumptions -> confusion when trying to use printer on a Win7 machine2011-12-29 01:31:50
370865Other documentsdocs-teamUNCONFIRMEDX11 keyboard layout will not change that easily2011-06-10 13:49:58
452898DevmanualdevmanualUNCONFIRMEDPortage only does dependency checking on the latest slot2013-01-21 15:46:28
455320Applicationsdev-zeroUNCONFIRMEDnet-wireless/blueman-1.23-r2 - blueman crashes when theme misses icon gtk-missing-image2013-02-05 11:38:08
444306Librarydev-zeroUNCONFIRMEDx11-drivers/xf86-input-vmmouse-12.9.0 with x11-base/xorg-server-1.13.0-r1 - Warning: attempting to l2013-01-01 21:31:12
399845Applicationsdev-zeroUNCONFIRMEDnet-nds/gosa-core - wrong apache group in gosa-encrypt-passwords script2012-01-25 13:25:43
386125Applicationsdev-zeroUNCONFIRMEDx11-drivers/xf86-video-vmware does not install with reason bad programming practice2013-01-31 11:11:18
380907Applicationsdev-zeroUNCONFIRMEDx11-drivers/xf86-input-vmmouse-12.7.0: /usr/bin/vmmouse_detect segfaults during boot2012-07-11 14:54:13
447638Coredev-portageUNCONFIRMEDBuilding packages as normal user with fakeroot sometimes fails due to tar complaining about "Too man2012-12-18 19:12:05
448138Coredev-portageUNCONFIRMEDsys-apps/portage no longer works with dev-lang/python-2.52012-12-22 07:22:48
453834Unclassifieddev-portageUNCONFIRMEDsys-apps/portage-2.1.11.xy - (anger at) handling of dir symlinks2013-01-24 20:23:11
457760Enhancement/Feature Requestsdev-portageUNCONFIRMEDemerge -v to print expected total build time according to emerge.log?2013-02-16 10:08:21
447118Enhancement/Feature Requestsdev-portageUNCONFIRMEDFEATURES=clean-logs can be dangerous2012-12-13 14:54:27
427748Core systemdev-portageUNCONFIRMEDsys-apps/portage-2.2.0_alpha120 crashing when compile fails2012-07-23 18:57:51
428474Enhancement/Feature Requestsdev-portageUNCONFIRMEDPrint a warning after merge with wrong permissions on existing file2012-07-28 22:34:46
429926Coredev-portageUNCONFIRMEDportage should add --nodeps when using -f2012-08-05 06:20:02
430102Unclassifieddev-portageUNCONFIRMEDEmerging in a deleted directory outputs lots of "getcwd: cannot access parent directories: No such f2012-08-21 00:22:33
437112Unclassifieddev-portageUNCONFIRMEDno TIMESTAMP field when using ftps/https binhost2012-10-08 21:24:38
437494Core - Interface (emerge)dev-portageUNCONFIRMEDProvide a parameter for emerge so that 'emerge -pv' can display package description along with other2012-10-08 19:09:40
442054Portage Documentationdev-portageUNCONFIRMEDman make.conf should warn users about not using extra spaces in *FLAGS variables2012-11-10 17:44:56
425554Core systemdev-portageUNCONFIRMEDsys-apps/portage-2.2.0_alpha116: Ctrl+C during --jobs simply halts progress w/o quitting2012-12-25 21:05:58
425682Enhancement/Feature Requestsdev-portageUNCONFIRMEDTrue parallel fetch for each job running2012-07-14 20:37:13
422491Coredev-portageUNCONFIRMEDemerging updates to nfs-mounted file systems can cause running programs to segfault2012-06-21 02:59:59
421353Core - Interface (emerge)dev-portageUNCONFIRMED'The following REQUIRED_USE flag constraints are unsatisfied:' is not specific enough2013-01-14 09:02:15
420459Enhancement/Feature Requestsdev-portageUNCONFIRMEDemerge --keep-going should leave behind --resume state for skipped/failed builds2012-09-07 04:13:06
419381Core - Interface (emerge)dev-portageUNCONFIRMEDsys-apps/portage-2.2.0_alpha109: emerge autounmask comment shows confusing "required by" dependency 2013-02-18 21:17:14
404157Coredev-portageUNCONFIRMEDsys-apps/portage : die in pkg_pretend() stops --keep-going from working2012-03-19 16:35:13
404445Core - Dependenciesdev-portageUNCONFIRMEDsys-apps/portage-2.1.10.44 tries to pull in dev-lang/perl-5.10.1 for virtual/perl-Time-Local-1.19.012012-02-18 22:44:10
409441Coredev-portageUNCONFIRMEDportage-2.1.10.49 elog ignoring PORTAGE_ELOG_CLASSES2012-03-23 13:26:59
414249Core - Dependenciesdev-portageUNCONFIRMEDAutomatically keyword/unmask all dependencies with a single entry2012-12-25 21:12:28
416907Core systemdev-portageUNCONFIRMEDOption to remove orphaned dependencies when using emerge -C2012-12-25 21:12:35
394419Enhancement/Feature Requestsdev-portageUNCONFIRMEDportage: provide a make.conf option for changing to cgroups (configuring them if needed) on package 2011-12-19 18:43:41
395433Core systemdev-portageUNCONFIRMEDdev-libs/libiconv - static archives (*.a) and libtool library files (*.la) do not belong in /2011-12-22 00:37:10
389843Coredev-portageUNCONFIRMEDemerge --skipfirst without --resume tries to emerge wrong packages with portage 2.2.0_alpha722011-11-08 01:14:55
378559Applicationsdev-portageUNCONFIRMEDsys-apps/portage-2.1.10.10 add support for stripping PE322011-08-11 07:34:53
382827Coredev-portageUNCONFIRMEDsys-apps/portage-2.1.10.11 crashes with confusing error when out of memory: TypeError: an integer is2011-09-14 13:56:03
367479Enhancement/Feature Requestsdev-portageUNCONFIRMEDemerge fetch function should be mirror-selective depending on ebuild location2012-12-07 05:07:03
365029Enhancement/Feature Requestsdev-portageUNCONFIRMEDemerge-webrsync incorrect/incomplete proxy error codes handling2011-05-10 11:19:57
389533Applicationsdesktop-wmUNCONFIRMEDx11-wm/icewm-1.3.7 - src_test(): iceview.cc:480:38: error: no matching function for call to ‘TextVie2012-07-05 11:48:34
425188ApplicationscppUNCONFIRMED[TRACKER] Packages failing to build with >=dev-libs/boost-1.502012-12-16 15:28:26
442484LibrarycppUNCONFIRMEDdev-libs/boost-1.49.0-r2: Segmentation fault during install phase.2012-11-12 12:00:11
450956LibrarycppUNCONFIRMEDdev-libs/boost USE=icu - sub-slot operator causes downgrade to dev-libs/icu-49.1.22013-01-12 13:32:41
382849Prefix Supportdeb-toolsUNCONFIRMEDdev-util/debhelper: please review prefix changes2012-11-13 23:09:06
404423Unspecifiedcommon-lispUNCONFIRMEDdev-lisp/ecls-12.2.1 fails to run tests - An error occurred during initialization: Module error: Don2013-02-02 10:15:50
380693Applicationscommon-lispUNCONFIRMEDdev-lisp/clisp-2.48 - hangs in ./lisp.run -B . -N locale -E UTF-8 -Epathname 1:1 -Emisc 1:1 -norc -m2011-08-28 21:49:06
380125Ebuildscommon-lispUNCONFIRMED[lisp overlay] dev-lisp/gcl-2.7.0_alpha SRC_URI no longer valid2011-08-25 12:54:08
436218EbuildsclusterUNCONFIRMEDnet-misc/pssh with dev-lang/python-3.2 - pssh --help: ImportError: No module named version2013-01-04 06:31:50
417501ApplicationsclusterUNCONFIRMEDsys-block/tgt-1.0.24-r1: missing RDEPEND on dev-libs/libaio2012-05-25 17:52:51
407173ApplicationsclusterUNCONFIRMEDsys-devel/icecream: distributed jobs fail because of missing libraries2012-06-27 00:00:39
365713ApplicationsclusterUNCONFIRMEDsys-cluster/maui-3.3.1 - mismatching spool dir in different files2011-05-08 19:17:50
411687ApplicationscjkUNCONFIRMEDapp-i18n/ibus-mozc: support uim-mozc (Mozc engine for app-i18n/uim)2012-04-12 23:00:50
402891ApplicationscjkUNCONFIRMEDapp-i18n/uim-1.7.1-r1 doesn't honor LINGUAS for locale files2012-05-13 23:28:32
407483ApplicationscjkUNCONFIRMEDapp-i18n/ibus-pinyin with dev-lang/lua-5.2.0 - ./.libs/libpylua.a(libpylua_la-lua-plugin.o): In func2012-03-09 15:19:06
390261EbuildschutzpahUNCONFIRMEDwww-plugins/nspluginwrapper-1.4.4-r1 - /usr/include/dirent.h:42:19: error: conflicting types for 'in2012-08-11 07:17:55
458174DevelopmentchromiumUNCONFIRMED=dev-lang/v8-3.15.11.15 does not build on RaspberryPi2013-02-20 16:19:23
458394ApplicationschromiumUNCONFIRMEDwww-client/chromium-26.0.1410.5 audio skipping2013-02-20 03:20:40
406583ApplicationschithanhUNCONFIRMEDwww-plugins/lightspark-0.5.4.1-r1 build fails - error regarding some ffmpeg stuff (?)2012-03-03 01:49:39
423409ApplicationschithanhUNCONFIRMEDwww-plugins/gnash does not respect LINGUAS2012-06-26 16:00:26
457594ApplicationscardoeUNCONFIRMEDx11-drivers/nvidia-drivers: some elog messages could be shown only first time using readme.gentoo.ec2013-02-15 07:29:28
429626CatalystcatalystUNCONFIRMEDdev-util/catalyst-2.0.10.1: get_libdir() return an empty value when cross compiling2012-08-13 13:01:10
456846ApplicationscardoeUNCONFIRMEDapp-emulation/libvirt-1.0.2-r1 has broken python bindings2013-02-12 22:17:07
442996ApplicationscardoeUNCONFIRMEDmedia-tv/mythtv - logging to a file in /etc/conf.d/mythbackend fails because of hard-wired /etc/ini2012-12-30 16:58:46
403037Applicationsc1pherUNCONFIRMEDmedia-gfx/darktable-0.9.3 doesn't honor LINGUAS for locale files2012-02-23 21:38:44
425708ApplicationscalchanUNCONFIRMEDdev-lang/R-2.10.1 - R: stack smashing attack in function - terminated2012-10-07 11:57:34
458176DevelopmentcalchanUNCONFIRMEDdev-lang/R - USE=X should not manage both X11 driver support and HTTP-Help support2013-02-21 06:57:03
457784BugzillabugzillaUNCONFIRMED/data/cached/buglist-*.html missing last-modified timestamps2013-02-16 03:03:10
426450BugzillabugzillaUNCONFIRMEDUsing "File a new bug" on the bugzilla search result page leads to a different bug entry form than "2012-07-13 13:41:26
414049BugzillabugzillaUNCONFIRMEDwww-client/links - links2 has trouble adding extra files to bugs2012-05-03 14:50:59
458594Applicationsbug-wranglersUNCONFIRMEDlibreoffice-bin: plain text files are opened by default using libreoffice writer, not gedit2013-02-21 14:20:01
458596Applicationsbug-wranglersUNCONFIRMEDmedia-gfx/wings-1.1.1: can't find include lib "esdl/include/gl.hrl" and "esdl/include/glu.hrl"2013-02-21 14:35:44
374949BugzillabugzillaUNCONFIRMEDSubmitting bugs with attachments without method to determine content type causes error but still cre2011-10-30 23:16:37
458580Ebuildsbug-wranglersUNCONFIRMEDmedia-gfx/sane-backends-1.0.23 unnecessary linking to libnetsnmp.so2013-02-21 12:38:16
458554Applicationsbug-wranglersUNCONFIRMEDlibarchive-3.0.4-r1 and libarchive-3.1.1 fail compile when using gcc i686-pc-linux-gnu-4.5.4 but not2013-02-21 09:28:12
458548Unspecifiedbug-wranglersUNCONFIRMED=sys-apps/shadow-4.1.5.1-r1 failing sed in ebuild2013-02-21 08:10:22
454962FreeBSDbsdUNCONFIRMED=dev-lang/php-5.4.11-r1[fpm] build fail2013-02-01 15:42:58
435648FreeBSDbsdUNCONFIRMEDSegmentation fault always occurs when starting X, using later versions xf86-video-vesa-2.3.0-r12012-09-23 13:02:11
427430FreeBSDbsdUNCONFIRMEDWhen using latest clang-3.1-r5, sys-freebsd/boot0-9.0/9.1_beta1 will fail to compile2012-11-25 11:39:35
453902HardenedbluenessUNCONFIRMEDsys-kernel/hardened-sources-3.7.0 kernel panic or something like this2013-01-26 15:33:28
438508Core systembluenessUNCONFIRMEDhardened kernel 3.4.9 with ZFS patch - Recursive fault on unsuspending (resuming from RAM) laptop wi2012-10-17 03:55:19
436680ApplicationsbluenessUNCONFIRMEDapp-admin/webapp-config wrong permissions for vhost_perms_defaultowned_dir2012-10-01 00:54:40
431048Core systembluenessUNCONFIRMEDsys-kernel/hardened-sources-3.4.7 panic on UP->SMP transition when putting CPU core online - BUG: un2013-01-18 20:53:51
432206ApplicationsbluenessUNCONFIRMEDnet-misc/arm with dev-lang/python:3.2 - SyntaxError: invalid syntax in print "TorCtl successfully in2013-01-15 13:00:59
374699ApplicationsbinkiUNCONFIRMEDdev-libs/lzo need LDFLAGS -no-undefined to build DLL for CHOST *-*-mingw322011-12-02 03:19:46
385121ApplicationsbilllUNCONFIRMEDmedia-video/ogmrip refuses to install due to "poor programming practices"2011-11-12 17:23:29
427972PrintingbillieUNCONFIRMEDnet-print/hplip - Scanning with hplip fails: Invalid argument2012-11-13 18:44:02
454248Core systembase-systemUNCONFIRMEDnet-misc/openssh-6.1_p1-r1: ssh login with key hangs2013-01-28 12:38:04
453098Core systembase-systemUNCONFIRMEDsys-devel/patch-2.7.1-r1: fails tests crlf-handling and need-filename2013-01-21 11:54:50
453038Ebuildsbase-systemUNCONFIRMEDsys-fs/reiser4progs-1.0.7 ? w/ patches from reiserfs-devel mailing list2013-02-08 17:27:09
447530Ebuildsbase-systemUNCONFIRMEDnet-firewall/iptables[netlink] - please add support for loading fingerprint definitions from pf.os f2013-02-16 14:09:37
445744Core systembase-systemUNCONFIRMEDsys-apps/hprofile - Add patch for improving init file.2012-12-04 15:09:20
442690baselayoutbase-systemUNCONFIRMEDsys-apps/baselayout - share.BSD/fstab device names have changed with FreeBSD 9.02012-11-12 22:39:21
440556Core systembase-systemUNCONFIRMEDsys-apps/util-linux-2.21.2: some elog messages should only be shown when upgrading from an old enoug2012-10-31 16:24:34
440562Core systembase-systemUNCONFIRMEDsys-fs/cryptsetup-1.4.3: some elog messages should only be shown when upgrading from an old enough p2012-10-31 16:25:30
438998Core systembase-systemUNCONFIRMEDsys-fs/cryptsetup[selinux,static]: with sys-libs/libselinux-2.1.12, link fails with pcre missing sym2012-10-23 15:34:25
432454Applicationsbase-systemUNCONFIRMEDsys-block/open-iscsi - init script has problems with automatic mounting of iSCSI2012-10-22 16:22:50
431054Applicationsbase-systemUNCONFIRMEDnet-misc/icecast-2.3.3 USE=yp - libtool linker mangles CFLAGS ( x86_64-pc-linux-gnu-gcc: error: l1-c2012-08-12 20:10:16
425022Core systembase-systemUNCONFIRMEDsys-apps/pciutils - lib/configure: Looking for access methods... Unfortunately, your OS is not suppo2012-07-10 09:18:23
424453Core systembase-systemUNCONFIRMEDsys-devel/automake-1.1[12] cause warning in combination with dev-lang/perl-5.16.02012-07-03 16:25:08
418287Core systembase-systemUNCONFIRMEDsys-boot/grub-0.97-r11 - Failed Running autoconf ! - configure.ac:59: error: possibly undefined macr2012-10-09 04:21:54
423593Core systembase-systemUNCONFIRMEDnet-misc/openssh-6.0_p1-r1: ssh hangs with 100% cpu connecting to HPUX sshd2012-11-12 12:36:02
418177Core systembase-systemUNCONFIRMEDsys-power/apcupsd-3.14.8-r1: apcupsd.powerfail init script runlevel check fails when shutting down2012-10-11 16:58:37
416361Core systembase-systemUNCONFIRMEDapp-arch/dump-0.4.44-r1 restore crashes restoring UNIX-domain socket with very long name2012-05-18 14:49:10
414259Core systembase-systemUNCONFIRMEDsys-fs/mdadm: handling root-on-raid in init.d on shutdown2012-11-12 11:38:56
413621Core systembase-systemUNCONFIRMEDsys-apps/coreutils-8.15 - src_test(): errors setting up rm/deep-2 and du/long-from-unreadable2012-11-20 03:30:47
410605Core systembase-systemUNCONFIRMEDsys-apps/util-linux-2.20-r1: fsck complains about checking file systems mounted ro2013-02-05 14:52:10
408139Core systembase-systemUNCONFIRMEDsys-fs/mdadm-3.2.1 sends ioctl 1261 (BLKFLSBUF) to partition when displaying array details2012-11-11 22:39:56
401903Core systembase-systemUNCONFIRMEDapp-admin/sysklogd-1.5-r2: improve default syslog.conf to match syslog-ng.conf behavior2012-02-02 17:46:23
402057Core systembase-systemUNCONFIRMEDsys-power/apcupsd-3.14.10-r1 - daemon fails to stop during shutdown2012-08-03 19:38:52
402245Core systembase-systemUNCONFIRMEDsys-fs/dosfstools-3.0.12 dosfslabel does not work if long file names are used in partition2013-01-23 19:12:35
383339Applicationsbase-systemUNCONFIRMEDapp-admin/syslog-ng-3.2.4: init script fails to start with ethernet bonding2011-09-19 10:38:08
365321Eclasses and Profilesbase-systemUNCONFIRMEDeutils.eclass lacks eclass-to-man formatting for documentation of make_desktop_entry function2011-05-02 01:44:57
366923Ebuildsbase-systemUNCONFIRMEDapp-arch/tar-1.26 changes matching behavior2011-05-13 00:18:52
365263Core systembase-systemUNCONFIRMEDsys-apps/less - auto convert UTF16/UTF32 inputs to active encoding2011-05-02 01:45:04
237994Applicationsbase-systemUNCONFIRMEDadd support for microcode loading with linux-2.6.27+2013-02-17 17:39:21
446736Applicationsarmin76UNCONFIRMEDnet-misc/tigervnc-1.2.0 - vncviewer segfaults when dismissing context menu2012-12-11 15:16:48
381123Applicationsarmin76UNCONFIRMEDx11-drivers/xf86-video-intel[sna] CPU load very high when remotely connecting to a local X-Server us2012-09-16 18:39:43
409641DevelopmentaraujoUNCONFIRMEDdev-lang/io-2009.01.02-r2: Uncomment the IO_USE_SIMD define to turn on SIMD acceleration2012-12-24 08:55:55
456090Applicationsapp-dictsUNCONFIRMEDapp-text/aspell-0.60.6.1 ebuild missing HU and HY languages2013-02-10 14:35:50
451400Applicationsapp-dictsUNCONFIRMEDapp-dicts/wordnet with dev-lang/tcl-8.6.0 - replace interp -> result by call to Tcl_SetResult() rout2013-02-01 06:55:10
409947Unspecifiedapp-backupUNCONFIRMEDapp-backup/rdiff-backup-1.3.3 - "Security Violation" warning then "Fatal Error"2012-03-30 06:29:16
416267Applicationsapp-backupUNCONFIRMEDapp-backup/backuppc-3.2.1 hangs and shows warnings about deprecated qw(...) with perl-5.142012-05-16 14:10:07
458060Applicationsandreis.vinogradovsUNCONFIRMEDdev-libs/xmlrpc-c-1.28.03-r1 - xmlrpc crashes when trying to connect to an XMLRPC server2013-02-19 20:25:14
414549Libraryamd64UNCONFIRMEDapp-emulation/emul-linux-x86-*; support for running PCSX2 32-bit released binary (or own)2012-07-18 15:48:39
417191Ebuildsamd64UNCONFIRMEDapp-emulation/emul-linux-x86-gtklibs-20120520 needs pax marking - gtk-query-immodules-2.0-32: error 2012-12-12 16:42:02
402303Applicationsalsa-bugsUNCONFIRMEDmedia-sound/alsa-utils-1.0.25 doesn't honor LINGUAS for locale files2012-02-23 21:38:44
445550ApplicationsalexxyUNCONFIRMEDwww-apps/rutorrent-3.4-r1: outputs garbage to Apache error.log if PHP is running in strict mode2012-12-02 06:13:37
458056ApplicationsaidecoeUNCONFIRMEDapp-admin/hddtemp submission for Samsung 840 Series SSD2013-02-18 13:22:13
390231EbuildsalexxyUNCONFIRMEDsys-fs/ocfs2-tools-1.6.4 init scripts not working on kernel 3.X2012-12-25 18:46:59
413417EbuildsalexxyUNCONFIRMEDsys-cluster/glusterfs - Stopping glusterd init script should not kill the glusterfsd processes2012-12-07 13:08:00
413659DevelopmentadaUNCONFIRMEDdev-lang/gnat-gcc 4.6.2 4.7.0 version bumps2012-09-11 19:00:29
386661DevelopmentadaUNCONFIRMED[portage-multilib] dev-lang/gnat-gcc: configure error for x85-abi due to gnatboot-4.4-amd64.tar.bz22012-12-25 21:03:35
392727DevelopmentadaUNCONFIRMEDdev-lang/gnat-gcc-4.3.5: fetch failed missing gnatboot-4.3-amd64.tar.bz22012-02-03 18:23:19
400701GCC PortingadaUNCONFIRMEDdev-lang/gnat-gcc-4.4.5 cannot find system.ads2012-01-25 15:19:05
371322Eclasses and ProfilesadaUNCONFIRMEDdev-lang/gnat-gcc-4.3.2 - work/gcc-4.3.2/libgcc/../gcc/unwind-pe.h:136: error: expected declaration 2012-03-19 19:22:36
428462EbuildsaballierUNCONFIRMEDmedia-sound/a2jmidid should [R]DEPEND on dev-lang/python-2.72012-07-30 12:57:07
437728Core systema3liUNCONFIRMEDsys-boot/plymouth - static archives (*.a) and libtool library files (*.la) do not belong in /2012-11-15 22:53:53
366885Prefix SupportprefixUNCONFIRMEDx11-misc/xdg-user-dirs-0.13: build fails because of missing -liconv and _strndup on Darwin2011-05-11 14:09:14
270860EbuildspatrickUNCONFIRMEDwww-servers/apache apxs2 should _not_ save the CFLAGS and LDFLAGS used during build2013-02-16 13:15:39
446696Applicationsnet-fsUNCONFIRMEDrevdep-rebuild selectes net-fs/ncpfs - QA Notice: Missing soname symlink(s): usr/lib/libncp.so.2.3 2012-12-10 20:02:00
258018Applicationsnet-mailUNCONFIRMEDmail-mta/ssmtp-2.62-r8: blank password sent if ssmtp.conf defines password containing '#'2012-12-21 12:48:02
298753EbuildsnetmonUNCONFIRMEDnet-analyzer/rrdtool - src_configure() hangs at: configure:19935: checking if msync with MS_ASYNC up2011-06-01 15:21:23
209617OpenRCopenrcUNCONFIRMEDsys-apps/openrc-0.8.2-r1: user should be able to interrupt service start/stop pressing Ctrl+C2013-02-18 09:41:51
211203GamesgamesUNCONFIRMEDgames-rpg/bass: script for getting bass translated2011-07-27 09:15:01
266311Applicationsford_prefectUNCONFIRMEDmedia-sound/pulseaudio is lacking suspend support for sys-power/pm-utils (?)2012-10-19 12:32:55
256259ApplicationschutzpahUNCONFIRMEDwww-plugins/nspluginwrapper should allow native wrapping2012-04-18 08:47:57
393683ApplicationsbluenessUNCONFIRMEDwww-servers/varnish-3.0.2 log '%r' format specifier returns the wrong info2012-05-23 00:57:09
383363UnspecifiedbilllUNCONFIRMEDmedia-video/ogmrip-0.13.6 needs threads patch to enable multithreading2011-09-19 18:57:43
436916Keywording and Stabilizationbase-systemUNCONFIRMEDsys-boot/lilo-22.8-r2: Fatal: Setup length exceeds 31 maximum; kernel setup will overwrite boot load2013-01-27 14:59:32


back



Other free services
toURL.org
Shorten long
URLs to short
links like
http://tourl.org/2
tourl.org
.
Reverse DNS lookup
Find out which hostname(s)
resolve to a
given IP or other hostnames for the server
www.reversednslookup.org

New Packages

- as rdf newsfeed
- as rss newsfeed
- as Atom newsfeed
2018-08-18
Term-ProgressBar-Quiet - 0.310.0-r1
Ebuild name:

dev-perl/Term-ProgressBar-Quiet-0.310.0-r1

Description

Provide a progress meter if run interactively

Added to portage

2018-08-18

clamav-unofficial-sigs - 5.6.2
Ebuild name:

app-antivirus/clamav-unofficial-sigs-5.6.2

Description

Download and install third-party clamav signatures

Added to portage

2018-08-18

gentoo-sources - 4.14.64
Ebuild name:

sys-kernel/gentoo-sources-4.14.64

Description

Full sources including the Gentoo patchset for the . kernel tree

Added to portage

2018-08-18

gentoo-sources - 4.17.16
Ebuild name:

sys-kernel/gentoo-sources-4.17.16

Description

Full sources including the Gentoo patchset for the . kernel tree

Added to portage

2018-08-18

gentoo-sources - 4.18.2
Ebuild name:

sys-kernel/gentoo-sources-4.18.2

Description

Full sources including the Gentoo patchset for the . kernel tree

Added to portage

2018-08-18

gentoo-sources - 4.4.149
Ebuild name:

sys-kernel/gentoo-sources-4.4.149

Description

Full sources including the Gentoo patchset for the . kernel tree

Added to portage

2018-08-18

gentoo-sources - 4.9.121
Ebuild name:

sys-kernel/gentoo-sources-4.9.121

Description

Full sources including the Gentoo patchset for the . kernel tree

Added to portage

2018-08-18

hplip - 3.18.7
Ebuild name:

net-print/hplip-3.18.7

Description

HP Linux Imaging and Printing - Print, scan, fax drivers and service tools

Added to portage

2018-08-18

php - 7.1.21
Ebuild name:

dev-lang/php-7.1.21

Description

The PHP language runtime engine

Added to portage

2018-08-18

portage - 2.3.47
Ebuild name:

sys-apps/portage-2.3.47

Description

Portage is the package management and distribution system for Gentoo

Added to portage

2018-08-18

portapack-havoc - 0.0_p20180612
Ebuild name:

net-wireless/portapack-havoc-0.0_p20180612

Description

Custom firmware for the HackRF SDR + PortaPack H1 addon

Added to portage

2018-08-18

qtm - 1.3.19
Ebuild name:

net-misc/qtm-1.3.19

Description

Qt blogging client

Added to portage

2018-08-18

recoll - 1.24.1
Ebuild name:

app-misc/recoll-1.24.1

Description

A personal full text search package

Added to portage

2018-08-18

wmix - 3.3-r2
Ebuild name:

x11-plugins/wmix-3.3-r2

Description

Dockapp mixer for OSS or ALSA

Added to portage

2018-08-18

2018-08-17
accountsservice - 0.6.50
Ebuild name:

sys-apps/accountsservice-0.6.50

Description

D-Bus interfaces for querying and manipulating user account informa

Added to portage

2018-08-17

arel-helpers - 2.8.0
Ebuild name:

dev-ruby/arel-helpers-2.8.0

Description

Tools to help construct database queries

Added to portage

2018-08-17

bladerf - 2018.08_rc1
Ebuild name:

net-wireless/bladerf-2018.08_rc1

Description

Libraries for supporing the BladeRF hardware from Nuand

Added to portage

2018-08-17

bladerf-firmware - 2.2.0
Ebuild name:

net-wireless/bladerf-firmware-2.2.0

Description

bladeRF FX3 firmware images

Added to portage

2018-08-17

bladerf-fpga - 0.7.3
Ebuild name:

net-wireless/bladerf-fpga-0.7.3

Description

bladeRF FPGA bitstreams

Added to portage

2018-08-17

busybox - 1.29.2
Ebuild name:

sys-apps/busybox-1.29.2

Description

Utilities for rescue and embedded systems

Added to portage

2018-08-17

catkin_pkg - 0.4.8
Ebuild name:

dev-python/catkin_pkg-0.4.8

Description

Standalone Python library for the catkin package system

Added to portage

2018-08-17

chrome-binary-plugins - 70.0.3521.2_alpha
Ebuild name:

www-plugins/chrome-binary-plugins-70.0.3521.2_alpha

Description

Binary plugins from Google Chrome for use in Ch

Added to portage

2018-08-17

claws-mail - 3.17.0
Ebuild name:

mail-client/claws-mail-3.17.0

Description

An email client (and news reader) based on GTK+

Added to portage

2018-08-17

conky - 1.10.8-r2
Ebuild name:

app-admin/conky-1.10.8-r2

Description

An advanced, highly configurable system monitor for X

Added to portage

2018-08-17

dump1090 - 0.0_p20180509
Ebuild name:

net-wireless/dump1090-0.0_p20180509

Description

simple Mode S decoder for RTLSDR devices

Added to portage

2018-08-17

gcc - 6.4.0-r3
Ebuild name:

sys-devel/gcc-6.4.0-r3

Description

The GNU Compiler Collection

Added to portage

2018-08-17

gcc - 7.3.0-r4
Ebuild name:

sys-devel/gcc-7.3.0-r4

Description

The GNU Compiler Collection

Added to portage

2018-08-17

google-chrome-unstable - 70.0.3521.2
Ebuild name:

www-client/google-chrome-unstable-70.0.3521.2

Description

The web browser from Google

Added to portage

2018-08-17

gqrx - 2.11.5
Ebuild name:

net-wireless/gqrx-2.11.5

Description

Software defined radio receiver powered by GNU Radio and Qt

Added to portage

2018-08-17

gr-osmosdr - 0.1.4_p20170612-r1
Ebuild name:

net-wireless/gr-osmosdr-0.1.4_p20170612-r1

Description

GNU Radio source block for OsmoSDR and rtlsdr and hackrf

Added to portage

2018-08-17

gr-osmosdr - 0.1.4_p20180626
Ebuild name:

net-wireless/gr-osmosdr-0.1.4_p20180626

Description

GNU Radio source block for OsmoSDR and rtlsdr and hackrf

Added to portage

2018-08-17

laser_proc - 0.1.5
Ebuild name:

dev-ros/laser_proc-0.1.5

Description

Converts representations of sensor_msgs/LaserScan and sensor_msgs/MultiEch

Added to portage

2018-08-17

libuv - 1.23.0
Ebuild name:

dev-libs/libuv-1.23.0

Description

Cross-platform asychronous I/O

Added to portage

2018-08-17

llvm - 6.0.1-r1
Ebuild name:

sys-devel/llvm-6.0.1-r1

Description

Low Level Virtual Machine

Added to portage

2018-08-17

mustermann - 1.0.3
Ebuild name:

dev-ruby/mustermann-1.0.3

Description

A library implementing patterns that behave like regular expressions

Added to portage

2018-08-17

nm-applet - 1.8.16
Ebuild name:

gnome-extra/nm-applet-1.8.16

Description

GNOME applet for NetworkManager

Added to portage

2018-08-17

php - 7.2.9
Ebuild name:

dev-lang/php-7.2.9

Description

The PHP language runtime engine

Added to portage

2018-08-17

php - 7.3.0_beta2
Ebuild name:

dev-lang/php-7.3.0_beta2

Description

The PHP language runtime engine

Added to portage

2018-08-17

rosdistro - 0.6.9
Ebuild name:

dev-python/rosdistro-0.6.9

Description

Tools to work with catkinized rosdistro files

Added to portage

2018-08-17

rospkg - 1.1.7
Ebuild name:

dev-python/rospkg-1.1.7

Description

Standalone Python library for the ROS package system

Added to portage

2018-08-17

rtl-entropy - 0.1.2_p20180118-r1
Ebuild name:

sys-apps/rtl-entropy-0.1.2_p20180118-r1

Description

An entropy generator using SDR peripherals, including rtl-s

Added to portage

2018-08-17

skopeo - 0.1.31
Ebuild name:

app-emulation/skopeo-0.1.31

Description

Command line utility foroperations on container images and image reposi

Added to portage

2018-08-17

soapybladerf - 0.3.5
Ebuild name:

net-wireless/soapybladerf-0.3.5

Description

Soapy SDR plugin for the Blade RF

Added to portage

2018-08-17

soapyhackrf - 0.3.3
Ebuild name:

net-wireless/soapyhackrf-0.3.3

Description

SoapySDR HackRF module

Added to portage

2018-08-17

soapyrtlsdr - 0.2.5
Ebuild name:

net-wireless/soapyrtlsdr-0.2.5

Description

SoapySDR RTL-SDR Support Module

Added to portage

2018-08-17

spice - 0.14.0-r2
Ebuild name:

app-emulation/spice-0.14.0-r2

Description

SPICE server

Added to portage

2018-08-17

spice-gtk - 0.35
Ebuild name:

net-misc/spice-gtk-0.35

Description

Set of GObject and Gtk objects for connecting to Spice servers and a client

Added to portage

2018-08-17

spice-protocol - 0.12.14
Ebuild name:

app-emulation/spice-protocol-0.12.14

Description

Headers defining the SPICE protocol

Added to portage

2018-08-17

telegram-desktop-bin - 1.3.10-r1
Ebuild name:

net-im/telegram-desktop-bin-1.3.10-r1

Description

Official desktop client for Telegram (binary package)

Added to portage

2018-08-17

virt-viewer - 7.0
Ebuild name:

app-emulation/virt-viewer-7.0

Description

Graphical console client for connecting to virtual machines

Added to portage

2018-08-17

wsproto - 0.11.0
Ebuild name:

dev-python/wsproto-0.11.0

Description

WebSockets state-machine based protocol implementation

Added to portage

2018-08-17

rdf newsfeed | rss newsfeed | Atom newsfeed
- Powered by LeopardCMS - Running on Gentoo -
Copyright 2004-2018 Sascha Nitsch Unternehmensberatung UG(haftungsbeschänkt)
Valid XHTML1.1 : Valid CSS : buttonmaker
- Level Triple-A Conformance to Web Content Accessibility Guidelines 1.0 -
- Copyright and legal notices -
Time to create this page: 10.1 ms