from small one page howto to huge articles all in one place
 

search text in:




Other .linuxhowtos.org sites: www.linuxhowtos.org
toolsntoys.linuxhowtos.org



Last additions:
How to make X listen on port 6000

How to make X listen on port 6000

words:

34

views:

38556

userrating:

average rating: 1.5 (4 votes) (1=very good 6=terrible)


May, 25th 2007:
April, 26th 2007:
Apr, 10th. 2007:
Druckversion . pdf icon
You are here: Portage


Details of app-editors/ne:

Description: the nice editor, easy to use for the beginner and powerful for the wizard
Homepage:
http://ne.di.unimi.it/

available versions:

releasesalphaamd64armhppaia64mipsppcppc64ppc macoss390shsparcx86USE-Flagsdependenciesebuild warnings
ne-3.0.1-r1 -~----~~----~tinfo
show
show
ne-3.0.1 -~----~~----~none
show
show
Legend:
+ stable
~ testing
- not available
some ebuild warning depend on specific use-flags or architectures, all ebuild-warnings are shown.

Known bugs:
bug IDcomponentassigned tostatusdescriptionlast change
417883ServerbluenessUNCONFIRMEDnet-firewall/ipsec-tools-0.8.0-r3: racoon segfaults on incoming connections if privsep is used2012-07-31 02:44:59
325541Ebuildsmaintainer-wantedUNCONFIRMEDNew package: frandom (to sys-apps?)2012-09-19 19:20:54
424633EbuildssambaUNCONFIRMEDnet-fs/samba 3 vs. 4 should be SLOTted2013-01-09 17:21:01
434702ApplicationsspingUNCONFIRMEDmedia-sound/mp3splt-gtk-0.7.3: QA Notice: This package installs one or more .desktop files that do n2012-11-21 18:48:15
438782EbuildsqtUNCONFIRMEDnet-im/qutim-9999 live ebuild2012-10-30 13:21:47
389423Mac OSXprefixUNCONFIRMEDnet-proxy/dante mask blocks net-irc/irssi[socks5]2011-12-16 22:20:50
441720PrintingprintingUNCONFIRMEDnet-print/cups-1.6.1: QA Notice: This package installs one or more .desktop files that do not pass v2012-11-27 16:02:55
455842ServerpatrickUNCONFIRMEDwww-servers/apache-2.2.23 should check for CONFIG_SYSVIPC in kernel2013-02-16 14:15:09
383353Core systemmaintainer-wantedUNCONFIRMEDsys-kernel/vanilla-sources-9999: new live git ebuild2011-11-07 01:47:25
81424Ebuildsmaintainer-wantedUNCONFIRMEDgnome-translate-0.99.ebuild (New Package)2011-05-16 09:10:09
455122EbuildszerochaosUNCONFIRMEDnet-analyzer/wireshark-1.8.5{,-r1} emerge fails - Can't locate object method "recurse" via package 2013-02-16 13:32:31
457084ApplicationszerochaosUNCONFIRMEDnet-analyzer/wireshark-1.8.5-r1 - non-root user cannot see network interfaces?2013-02-16 14:06:38
419573JavajavaUNCONFIRMEDdev-util/visualvm needs dev-java/icedtea, but dev-java/icedtea-bin works2012-10-12 09:41:16
434704ApplicationsgpeUNCONFIRMEDx11-misc/matchbox-keyboard-0.1: QA Notice: This package installs one or more .desktop files that do 2012-11-21 18:48:19
441718GNOMEgnomeUNCONFIRMEDgnome-base/libbonoboui-2.24.5: QA Notice: This package installs one or more .desktop files that do n2012-11-21 18:48:50
428588Applicationsc1pherUNCONFIRMEDnet-dns/djbdns: replace setup scripts with documentation2012-07-31 00:05:08
407071ApplicationszerochaosUNCONFIRMEDnet-analyzer/wireshark-1.6.4[lua] fails to run after upgrade to dev-lang/lua-5.2.0 and will not rebu2013-02-16 13:18:51
437236ApplicationszerochaosUNCONFIRMEDnet-analyzer/metasploit:4.4 | revdep-rebuild keeps reinstalling it when run2012-12-26 04:41:05
379169DevelopmentyngwinUNCONFIRMEDapp-vim/gentoo-syntax: new ebuild: swap DEPEND and RDEPEND2012-07-25 05:17:56
444692ApplicationsxmwUNCONFIRMEDnet-misc/aiccu systemd support2012-12-27 21:50:10
454116ApplicationsxmwUNCONFIRMEDnet-ftp/oftpd does not respect USE="-ipv6"2013-02-10 16:49:05
432954EbuildsxmwUNCONFIRMEDx11-misc/simpleswitcher - (new ebuild) simple EWMH window switcher2012-08-28 14:33:26
437958ApplicationsxmwUNCONFIRMEDnet-misc/minidlna - add epatch_user support2012-10-11 13:47:33
440464ApplicationsxmwUNCONFIRMEDnet-dns/dnssec-tools-1.14: some elog messages should only be shown for the first install.2012-10-31 21:15:16
412779EbuildsxmwUNCONFIRMEDx11-misc/remoot: new package2012-04-23 12:04:22
421897ApplicationsxfceUNCONFIRMEDxfce-base/xfce4-panel-4.10.0 - adding system action icon to panel breaks auto-hide2012-07-06 05:45:28
440182ApplicationsxfceUNCONFIRMEDxfce-extra/xfce4-mixer-4.10.0 panel plugin doesn't play nice with pulseaudio2012-10-30 07:12:10
450042EbuildsxfceUNCONFIRMED[xfce-dev overlay] New ebuild xfce4-notes-plugin-1.8.0_alpha and a patch to make it work2013-01-23 16:34:39
457588ApplicationsxboxUNCONFIRMEDmedia-tv/xbmc-11.0 with a PaX kernel - xbmc.bin: LLVM ERROR: Allocation failed when allocating new m2013-02-15 15:39:36
440340Core systemxenUNCONFIRMEDafter some time of running xen panics when the dom0 kernel is 3.X2012-10-31 03:02:38
458514ApplicationsxboxUNCONFIRMEDmedia-tv/xbmc USE=airplay should depend on net-dns/avahi[dbus] and media-libs/libshairport2013-02-21 12:39:06
449508EbuildsxboxUNCONFIRMEDmedia-tv/xbmc-12.0_rc2 with media-video/libav-0.8.4 - configure: error: You need either libswresampl2013-01-19 19:49:11
458300Libraryx11UNCONFIRMED>=media-libs/mesa-9.1_rc1[xa]: libxatracker.so has undefined symbol: _ZTVN10__cxxabiv120__si_class_t2013-02-21 13:47:33
458182Libraryx11UNCONFIRMEDdev-libs/wayland-1.0.4 - No rule to make target `wl_display_connect.xml', needed by `wl_display_conn2013-02-20 15:50:05
447862Applicationsx11UNCONFIRMEDx11-drivers/xf86-video-ati, x11-base/xorg-server or related components memory leak2013-01-03 13:26:06
449042Applicationsx11UNCONFIRMEDxorg-server, tslib, xinput - Pointer reappears in lower right hand corner after touchscreen tap foll2013-01-03 06:09:45
450664Applicationsx11UNCONFIRMEDapp-emulation/wine-1.4.1 with >=x11-base/xorg-server-1.11 - mouse behaves erratically2013-01-08 04:22:22
456220Applicationsx11UNCONFIRMEDx11-base/xorg-server on hardened - X exits fatally upon failure to enable sys_iopl2013-02-12 14:40:15
445902Libraryx11UNCONFIRMEDapp-emulation/emul-linux-x86-opengl-20121202{,-r1} makes some wine programs very sluggish2013-01-11 11:54:06
444928Libraryx11UNCONFIRMEDmedia-libs/mesa-9.0.1 - ld: ../../auxiliary//libgallium.a(u_dl.o): undefined reference to symbol 'dl2012-11-27 16:36:13
444157Core systemx11UNCONFIRMEDx11-base/nouveau-drm-20121015 needs patching for kernel 3.7.x2012-11-22 12:13:33
444566Unspecifiedx11UNCONFIRMEDx11-drivers/ati-drivers-12.11_beta: fglrx(0): unable to query kernel module!2012-11-24 15:58:50
433649Libraryx11UNCONFIRMEDsys-kernel/gentoo-sources-3.5, media-libs/mesa-8.1_rc1_pre20120814: i915: render error detected - In2012-09-16 12:44:13
413981Core systemx11UNCONFIRMEDsys-kernel/gentoo-sources-3.2.12: i915 driver sets strange resolution 1922x1080 on HDMI2012-05-01 05:35:57
411747Ebuildsx11UNCONFIRMEDx11-drivers/xf86-video-ati 6.14.3-6.14.4: Vertical pixel-line display artifacts from fvwm desktop m2012-12-15 18:54:01
408643Unspecifiedx11UNCONFIRMEDapp-admin/eselect-mesa needs update for r600 changes in mesa2012-07-11 11:14:47
405707Applicationsx11UNCONFIRMED=x11-apps/xdpyinfo-1.3.0 automagic dependency with x11-libs/libXinerama2012-02-27 00:04:12
390931Libraryx11UNCONFIRMEDmedia-libs/mesa-7.11: /usr/lib/dri/swrast_dri.so: undefined symbol: _glapi_tls_Context2012-04-27 07:05:34
384685Unspecifiedx11UNCONFIRMEDXorg fonts should warn about needing a re-login2012-07-13 08:51:01
384371Ebuildsx11UNCONFIRMEDx11-apps/xdm drop stict x11-libs/libXinerama dependency2011-09-25 06:54:17
381057Ebuildsx11UNCONFIRMEDkexec + x11-drivers/xf86-video-ati + sys-kernel/gentoo-sources-3.* + RadeonHD results in corrupted d2011-09-11 02:03:40
377395Libraryx11UNCONFIRMED[drm:radeon_crtc_page_flip] *ERROR* failed to reserve new rbo buffer before flip2011-08-03 08:59:16
436900EbuildswschlichUNCONFIRMEDnet-misc/connect-1.103(?) version bump and HOMEPAGE change2012-10-02 13:46:58
370001EbuildswrobelUNCONFIRMED[kolab overlay] ERROR: net-mail/kolab-resource-handlers-2.1 failed (depend phase): * php-lib.ecla2011-12-31 17:37:47
400927Core systemwschlichUNCONFIRMEDsys-block/megarc-1.11-r1 needs fetch restriction2012-04-15 19:43:17
451174DevelopmentwltUNCONFIRMEDdev-db/firebird-2.1.3.18185.0 - Unable to complete network request to host "localhost". Error readin2013-01-10 12:51:53
420939ApplicationswltUNCONFIRMEDFirebird-2.5.1.26351.0 with use xinetd implies superclassic patch and cannot build/install fb_inet_s2012-06-13 07:50:17
388425ApplicationswineUNCONFIRMEDapp-emulation/wine-1.3.30 sound not working, several apps stopped working.2012-03-22 12:19:51
390429ApplicationswltUNCONFIRMEDdev-db/firebird-2.0.3.12981.0-r6: buffer overflow with kernel 3.0.62012-06-02 07:33:59
453802Keywording and StabilizationwineUNCONFIRMEDapp-emulation/winetricks stable request2013-01-24 15:05:15
383395UnspecifiedwineUNCONFIRMEDapp-emulation/wine-1.3.28 can't find gecko2012-08-18 09:34:28
440410Core systemwilliamhUNCONFIRMEDnet-misc/dhcpcd-5.6.2: some elog messages should only be shown right after the relevant use flag is 2012-11-01 21:27:02
440216ApplicationswilliamhUNCONFIRMEDnet-misc/dhcpcd-5.6.2 outputs emerge messages only relevant when upgrading from <5.02012-10-30 15:25:24
428464DevelopmentwilliamhUNCONFIRMEDdev-lang/go-1.0.1 - "scanelf: Invalid ar entry" / LDFLAGS ignored2012-07-29 22:36:13
433441Core systemwilliamhUNCONFIRMEDnet-misc/dhcpcd should RDEPEND on net-dns/bind-tools (for either dig or host)2012-10-14 14:42:50
449032Serverweb-appsUNCONFIRMEDwww-apps/ampache-3.5.* needs additional dependency < dev-lang/php-5.42012-12-28 21:06:13
439516Core systemvserver-devsUNCONFIRMEDsys-kernel/openvz-sources-2.6.32.53.5 - In function 'setup_boot_APIC_clock': arch/x86/kernel/apic/ap2013-02-18 02:39:23
455986ApplicationsvoyageurUNCONFIRMEDnet-misc/gogoc - Introduce warning when bridge support is missing in kernel2013-02-07 11:47:29
458574Keywording and StabilizationvoyageurUNCONFIRMEDPlease stabilize net-ftp/filezilla-3.6.0.22013-02-21 12:14:55
447408DevelopmentvoyageurUNCONFIRMEDsys-devel/llvm-3.1r2 - X86ELFWriterInfo.cpp:85:1: interner Compiler-Fehler: Speicherzugriffsfehler2012-12-22 12:30:47
416691KDEvoyageurUNCONFIRMEDkde-base/nepomuk-4.8.3 fails with undefined references (dragonegg problem)2012-09-28 13:05:52
416827EbuildsvoyageurUNCONFIRMEDdev-libs/glib - CFLAGS="-fplugin=/usr/lib64/llvm/dragonegg.so" - gbitlock.c:210:3: sorry, unimplemen2012-09-28 13:05:51
403637ApplicationsvoyageurUNCONFIRMEDnet-ftp/filezilla-3.5.3 doesn't honor LINGUAS for locale files2012-02-23 21:38:44
393491UnspecifiedvoyageurUNCONFIRMEDsys-process/procps-3.2.8_p11 crashes (SIGSEGV) when built with sys-devel/dragonegg-3.02012-09-28 13:05:52
393489EbuildsvoyageurUNCONFIRMEDapp-office/libreoffice-3.5.0.0 fails to compile with sys-devel/dragonegg-3.02012-09-28 13:05:51
393391KDEvoyageurUNCONFIRMED[kde overlay] kde-base/katepart-9999 fails to compile with sys-devel/dragonegg-3.02012-09-28 13:05:52
393385EbuildsvoyageurUNCONFIRMEDmedia-libs/phonon-vlc-0.4.1 fails to compile with sys-devel/dragonegg-3.02012-09-28 13:05:51
393389KDEvoyageurUNCONFIRMED[kde overlay] kde-base/kdelibs-9999 fails to compile with sys-devel/dragonegg-3.02012-09-28 13:05:51
393379EbuildsvoyageurUNCONFIRMEDx11-libs/qt-qt3support-4.7.4 fails to compile with sys-devel/dragonegg-3.02012-09-28 13:05:51
393381EbuildsvoyageurUNCONFIRMEDx11-libs/qt-webkit-4.7.4 fails to compile with sys-devel/dragonegg-3.02012-09-28 13:05:52
393383EbuildsvoyageurUNCONFIRMEDsys-devel/llvm-3.0 fails to compile with sys-devel/dragonegg-3.02012-09-28 13:05:52
393377UnspecifiedvoyageurUNCONFIRMEDx11-libs/pixman-0.24.0 fails to compile with sys-devel/dragonegg-3.02012-09-28 13:05:51
393373UnspecifiedvoyageurUNCONFIRMEDx11-libs/qt-gui-4.7.4-r1 fails to compile with sys-devel/dragonegg-3.02012-09-28 13:05:52
455348EbuildsvostorgaUNCONFIRMEDnet-news/liferea 1.10 rc1 version bump2013-02-05 11:25:38
448930EbuildsvoipUNCONFIRMEDmedia-libs/mediastreamer needs a local description of bindist USE-flag2013-02-16 14:09:18
448934EbuildsvoipUNCONFIRMEDmedia-plugins/mediastreamer-silk needs a local description of bindist USE-flag2012-12-27 20:27:17
437938EbuildsvostorgaUNCONFIRMEDnet-nds/phpldapadmin-1.2.3 version bump2012-10-11 13:24:27
442628UnspecifiedvoipUNCONFIRMEDnet-voip/ekiga-3.9.90 - Fails to build, ld: cannot find -lQtCore2012-12-12 02:27:31
444380ApplicationsvoipUNCONFIRMEDnet-voip/ekiga-3.2.7 - Fails src_test for LINGUAS=en_GB - Document ./en_GB/ekiga.xml does not valida2012-11-22 22:49:37
448698ApplicationsvoipUNCONFIRMEDnet-voip/ekiga wipes out ~/.config/ekiga.conf on start2012-12-26 23:42:19
430474ApplicationsvoipUNCONFIRMEDnet-voip/ekiga-3.2.7 with sys-devel/gcc-4.7 - ../../../../lib/engine/addressbook/source-impl.h:209:32012-12-14 13:07:23
428850EbuildsvoipUNCONFIRMEDnet-libs/opal-9999 - .../work/opal-9999/src/h323/h323.cxx:3827:5: error: 'Fax' is not a member of 'O2012-10-07 14:58:53
387283ApplicationsvoipUNCONFIRMEDFailed to emerge net-voip/linphone-3.3.22012-10-23 16:24:00
396679ApplicationsvoipUNCONFIRMEDnet-misc/sipsak segmentation fault2012-01-04 21:08:51
403597ApplicationsvoipUNCONFIRMEDnet-voip/linphone-3.4.3-r1 doesn't honor LINGUAS for locale files2012-06-30 13:45:14
378705ApplicationsvoipUNCONFIRMEDnet-voip/linphone-3.4.3: sometimes crashes with SIGFPE2012-03-25 10:42:56
388983EbuildsvmwareUNCONFIRMEDapp-emulation/vmware-modules-238.5 with sys-kernel/hardened-sources-3.0.4-r4 - work/vmci-only/linux/2013-01-18 22:06:24
448362ApplicationsvirtualizationUNCONFIRMEDnet-misc/spice-gtk - after having been full screen, spicy changes DPI in X2013-01-12 21:54:37
453418ApplicationsvimUNCONFIRMEDapp-editors/vim-core-7.3.762 Opened file gets modified when mapping g to some other value2013-01-22 02:03:25
368955ApplicationsvadimkUNCONFIRMEDapp-emulation/open-vm-tools default scripts break network connectivity on pause/resume2011-12-03 05:48:53
439280LibraryvadimkUNCONFIRMEDapp-emulation/vmware-modules-264.4 - missing return carriage in printk in VNetUserIfSetUplinkState()2012-10-23 10:12:15
454492Toolstools-portageUNCONFIRMEDapp-portage/gentoolkit-0.3.0.7 - eclean-dist: UnboundLocalError: local variable 'cleaner' referenced2013-01-29 17:40:16
431256ApplicationstoveUNCONFIRMEDapp-shells/zsh-4.3.15 wrong syntax for "ip tunnel del"2012-08-14 12:58:33
393605ApplicationstuponeUNCONFIRMED[BUMP] app-misc/geneweb-6.05 version bump2013-02-19 18:52:27
420675ApplicationstuponeUNCONFIRMEDapp-misc/geneweb-5.02 - File "srcfile.ml", line 195, characters 4-56: Error: Unbound constructor Std2013-02-21 12:35:28
439164EbuildsultrabugUNCONFIRMED<=app-admin/rsyslog-5.8.12 USE=ssl undefined symbol: gcry_control2012-10-29 16:10:45
442706ApplicationsultrabugUNCONFIRMEDapp-admin/rsyslog.service file does not work with newer sys-apps/systemd2012-11-22 08:33:40
449822Third-Party Toolstools-portageUNCONFIRMEDapp-portage/genlop - genlop -itc shows two emerge jobs when it is only one2013-01-03 00:07:55
442980Toolstools-portageUNCONFIRMEDrevdep-rebuild misses net-print/cups-filters2012-11-14 00:12:49
447708Core systemtoolchainUNCONFIRMEDsys-devel/gcc-4.7.2 fails to crosscompile for mingw64: options.c:952:3: error: ‘HAVE_GAS_ALIGNED_COM2013-02-18 16:35:04
449948Core systemtoolchainUNCONFIRMEDsys-libs/glibc - inner-net license is of a boolean non-free nature2013-01-03 12:47:26
453100Core systemtoolchainUNCONFIRMEDsys-devel/binutils-2.23.1: 43 unexpected failures2013-01-21 11:57:21
435110Core systemtoolchainUNCONFIRMEDsys-devel/binutils: ar mishandles 4GB files (causing net-libs/webkit-gtk build to fail with debug fl2013-01-01 20:56:38
436636JavatoolchainUNCONFIRMEDsys-devel/gcc-{4.5,4.6,4.7?}: gcj fails to compile java source code on ia64 (hardened) - Exception i2012-12-14 08:15:05
434180Core systemtoolchainUNCONFIRMEDsys-devel/gcc sandbox violation in /usr/include/DONE (dev-db/oracle-instantclient-basic creates a li2012-12-25 08:33:27
433778Core systemtoolchainUNCONFIRMEDsys-devel/prelink-20120628: prelink: gelf_getphdr.c:120: gelf_getphdr: Unexpected error: Resource te2012-12-25 07:40:36
425524SandboxtoolchainUNCONFIRMED[ICE/4.6] sys-apps/sandbox build segfaults on hardened systems2012-11-17 19:16:55
423971Core systemtoolchainUNCONFIRMEDcross-i686-pc-mingw32/gcc-4.6.3: .../build/./gcc/as: line 87: exec: -o: invalid option2012-08-11 18:52:56
418209Core systemtoolchainUNCONFIRMEDcross-armv7m-none-eabi/gcc-4.5.3 stage1 cross-compiler fails2012-11-06 07:23:57
416757Core systemtoolchainUNCONFIRMEDcross-arm-elf/gcc-4.5.3-r2 - checking machine/endian.h usability... // .../work/gcc-4.5.3/libiberty/2012-06-17 17:06:03
414967Core systemtoolchainUNCONFIRMEDsys-devel/gcc-4.6.3 in dev-lang/gforth-0.7.0 - ./engine.c:460:1: internal compiler error: in simplif2012-06-28 17:14:55
409041Core systemtoolchainUNCONFIRMEDcross-x86_64-linux-uclibc/gcc-4.6.2: fails on gcc-stage1 - work/gcc-4.6.2/libgcc/generic-morestack-t2012-03-20 21:02:01
385087GCC PortingtoolchainUNCONFIRMEDsys-devel/gcc-4.4.5: gcj seem to not install needed ca-certificates (/usr/lib/security/cacerts)2012-09-24 06:08:56
376455DevelopmenttoolchainUNCONFIRMEDsys-devel/gdb-7.2 build broken by CFLAGS='-finline-functions -ftracer'2011-07-26 17:59:11
420065LibrarytommyUNCONFIRMEDsci-libs/naga-2.1 fails to connect to server (http://naga.googlecode.com) behind a proxy using subv2013-01-20 10:45:59
454496ServertommyUNCONFIRMEDdev-vcs/subversion - running /etc/xinetd.d/svnserve requires setting up a user/group through `emerge2013-01-29 14:37:34
456172ApplicationstommyUNCONFIRMEDdev-vcs/subversion-(1.7.* ?) needs dev-db/sqlite:3 to be compiled with threadsafe2013-02-11 11:20:24
373295UnspecifiedtoolchainUNCONFIRMEDsys-libs/glibc-2.12.2: building glibc interrupted in OpenVZ container, also tried rebuilding system2011-12-22 22:40:58
395949DevelopmenttitanofoldUNCONFIRMEDdev-util/premake-4.3 should generate architecture independent makefiles2011-12-26 23:59:11
406805ApplicationstitanofoldUNCONFIRMEDnet-dns/ddclient-3.8.1-r4 - Multiple interface support is broken2012-12-26 12:36:00
387115ApplicationstomjbeUNCONFIRMEDapp-backup/bacula init script kills all bacula-fd clients instead only one2013-01-30 18:13:20
441874ApplicationstexUNCONFIRMEDdev-tex/pgf - neither `texdoc pgfmanual` nor `texdoc pgf` yields pgfmanual.pdf2012-11-05 19:00:32
399087ApplicationstexUNCONFIRMEDdev-tex/pgf-2.10: Undefined control sequence "\pgf@test"2012-01-17 04:11:17
379177DevelopmenttexUNCONFIRMEDdev-tex/pdftex-1.40.10 ttf2afm.c:(.text+0x35e1): undefined reference to `kpse_set_progname'2011-08-19 21:14:54
457994LiveCD/DVDtenUNCONFIRMEDlivedvd-amd64-multilib-20121221.iso: kernel panic when booting in kvm with "-cpu host"2013-02-18 02:55:55
428680LiveCD/DVDtenUNCONFIRMEDlivedvd-amd64-multilib-2012.1.iso kernel panic2012-12-16 06:02:00
417871LiveCD/DVDtenUNCONFIRMED12.1 amd64 livedvd sshd default configuration AllowUsers line makes usage difficult2012-07-08 17:05:19
452910Core systemsystemdUNCONFIRMEDsys-apps/systemd-196[python] needs dev-python/pygobject:3 - ImportError: No module named gi.reposito2013-01-20 17:07:04
453278Core systemsystemdUNCONFIRMEDsys-apps/systemd - please port netcfg from Arch Linux for easier network configuration2013-01-21 20:21:49
454902ApplicationssystemdUNCONFIRMEDnet-misc/ntp: please add systemd service file2013-02-03 14:05:39
447960ApplicationssysadminUNCONFIRMEDnet-analyzer/munin: Rename 'apache' USE flag to 'apache2' for consistency2012-12-20 15:56:04
424637Core systemsystemdUNCONFIRMEDsys-apps/systemd won't work with lvm due to udev and genkernel problems2012-07-07 09:32:46
457042ServersysadminUNCONFIRMEDnet-analyzer/nagios-plugins check_rpc plugin missing dependency2013-02-13 19:23:00
455806EbuildssysadminUNCONFIRMEDnet-analyzer/{nagios,nagios-core}-3.4.4 - version bump request2013-02-06 12:51:08
453626ApplicationssysadminUNCONFIRMEDnet-analyzer/nagios-core-3.3.1 incomplete privilege grant2013-01-23 16:36:54
444022ApplicationssysadminUNCONFIRMEDnet-analyzer/nagios-plugins-1.4.16-r{2,3}: check_ping CRITICAL - You need more args!!!2012-11-21 09:27:19
444390ServersysadminUNCONFIRMEDnet-analyzer/nagios - Directory permissions for /etc/nagios are wrong, apache can't start2012-11-23 17:41:24
443502EbuildssysadminUNCONFIRMEDnet-analyzer/nagios-plugins-1.4.16-r2 check_http Plugin does not support checking certificates2012-12-03 20:28:53
438464UnspecifiedsysadminUNCONFIRMEDnet-analyzer/nagios-3.3.1: apache-2.4.3 fails to start with Syntax error on line 6 of /etc/apache2/2012-12-14 16:11:32
407421ApplicationssysadminUNCONFIRMEDnet-analyzer/nagios-plugins-1.4.15 script contrib/check_email_loop.pl doesn't work2012-08-19 15:26:58
417323ApplicationssysadminUNCONFIRMEDnet-analyzer/nagios-core version bump to 3.4.12012-10-30 00:47:14
434192ApplicationssysadminUNCONFIRMEDnet-analyzer/nagios-plugins - clean up rblservers in rblcheck-dns2012-09-23 02:54:31
401237ApplicationssysadminUNCONFIRMEDnet-analyzer/nagios should [R]DEPEND on sys-devel/libtool2012-08-19 15:26:59
391827EbuildssysadminUNCONFIRMEDnet-analyzer/nagios-check_logfiles 2.3.2.1-r1 -> 3.4.5.2 version bump2012-08-19 15:26:59
458018ServerswegenerUNCONFIRMEDnet-dns/pdns need more strict permissions for pdns.conf (security threat)2013-02-17 18:26:06
456412ServerswegenerUNCONFIRMEDnet-dns/pdns-3.2 version bump2013-02-10 14:48:24
455072ServerswegenerUNCONFIRMEDnet-dns/pdns-3.1 with USE="sqlite3" - checking for SQLITE3... configure: error: +Could not find sqli2013-02-02 17:34:19
453396ApplicationsswegenerUNCONFIRMEDnet-irc/irssi with sys-libs/ncurses[tinfo] - .../work/irssi-0.8.15/src/fe-text/terminfo-core.c:281: 2013-02-14 14:13:49
448918EbuildsswegenerUNCONFIRMEDdev-db/opendbx needs a local description of bindist USE-flag2012-12-27 20:13:18
440302EbuildsswegenerUNCONFIRMEDnet-irc/irssi - support static-libs and proxy USE flags2012-12-15 13:36:01
448988LibraryswaponUNCONFIRMEDnet-libs/gsoap should support USE=ntlm2012-12-28 14:47:42
426990LibraryswaponUNCONFIRMEDnet-libs/gsoap-2.8.9 USE=examples - chaining.o: In function `ns__pow': chaining.c:(.text+0x55): unde2013-01-12 16:57:59
405549LibrarysrinclanUNCONFIRMEDdev-python/pywebkitgtk-1.1.8 crashes at start when using Pax/Hardened2012-06-10 01:24:13
455162DevelopmentssuominenUNCONFIRMEDdev-util/catfish-0.4.0.2 needs dev-python/pygobject:3 in RDEPEND - Error: The required module gi.rep2013-02-04 02:33:15
448928EbuildssoundUNCONFIRMEDmedia-libs/libaacplus needs a local description of bindist USE-flag2012-12-27 20:21:50
436528LibrarysoundUNCONFIRMEDmedia-libs/speex: Resampler stops in the middle of run with multiple channels2012-09-29 15:26:02
389491ApplicationssoundUNCONFIRMEDmedia-sound/timidity++ - timidity crashes when connected to rosegarden2011-11-08 15:37:25
385409EbuildssoundUNCONFIRMEDmedia-libs/libclthreads-2.4.0 needs new URIs2012-05-28 22:50:46
385411EbuildssoundUNCONFIRMEDmedia-libs/libclxclient media-libs/libclthreads media-sound/aeolus need new URIs2012-05-28 23:39:40
458286EbuildsslyfoxUNCONFIRMED=net-im/openfire-3.8.02013-02-19 13:04:27
370581ApplicationssoundUNCONFIRMEDmedia-sound/freebirth-0.3.2-r1 - /bin/sh: line 1: 19963 Segmentation fault ./fusebirth > fused_2011-06-09 22:50:31
453032SELinuxselinuxUNCONFIRMEDcan't run wine on -9999 policies2013-01-27 13:26:04
431628Default ConfigssecurityUNCONFIRMEDinformation disclosure of the IP address of all connected users to all simple users2012-09-10 06:20:24
441570KernelsecurityUNCONFIRMEDKernel: btrfs: creates world writable files2012-11-29 17:29:18
402023KernelsecurityUNCONFIRMEDThe Linux kernel, when using IPv6, allows remote attackers to determine whether a host is sniffing t2012-02-03 04:38:20
394657VulnerabilitiessecurityUNCONFIRMEDnet-irc/xchat XChat Heap Overflow DoS (CVE-2011-5129)2012-09-08 15:28:51
395711KernelsecurityUNCONFIRMEDkernel: tight loop and no preemption can cause system stall (CVE-2011-4621)2011-12-22 19:16:12
451524Applicationssci-mathematicsUNCONFIRMEDsci-mathematics/octave-3.6.3 - libcruft/.libs/libcruft.so: undefined reference to `_gfortran_transfe2013-02-12 03:35:50
386987VulnerabilitiessecurityUNCONFIRMEDdev-lang/ruby malformed header vulnerabilities (CVE-2011-3624)2011-10-18 20:29:53
446500Librarysci-mathematicsUNCONFIRMEDsci-libs/cln-1.3.2-r1 USE="doc" LC_ALL="de_DE.utf-8" - egrep: Das Ende des angegebenen Intervalls is2013-01-14 10:02:26
455118Librarysci-geosciencesUNCONFIRMEDsci-libs/geos-3.3.7[php] does build fine with php-5.4.8[-threads]2013-02-04 02:29:24
441760Ebuildssci-geosciencesUNCONFIRMEDsci-geosciences/gpsd-3.7 - NameError: name 'gps_regress' is not defined: File "/var/tmp/portage/sc2012-11-07 02:15:55
427378Applicationssci-geosciencesUNCONFIRMEDsci-libs/gdal-1.9.1 gdalinfo fails to recognize classic netcdf (3) files2012-12-26 13:37:25
435676Applicationssci-chemistryUNCONFIRMEDsci-chemistry/ghemical-2.99.2-r2 - /usr/lib64/libSCwfn.so: undefined reference to `sc::DenFunctional2012-09-21 16:11:33
383789Applicationssci-biologyUNCONFIRMEDsci-biology/ncbi-tools++-2010.06.15-r1: libmzXML.so: undefined reference to `ncbi::CMemberInfo::SetN2013-02-17 08:11:13
435844LibrarysciUNCONFIRMEDsci-libs/netcdf-4.1.1-r4 USE=doc - egrep: Das Ende des angegebenen Intervalls ist nicht gültig2012-12-14 12:44:40
452622LibrarysciUNCONFIRMEDdev-python/pytables needs to be recompiled for the exact sci-libs/hdf5 version.2013-01-18 20:03:31
449472DevelopmentsciUNCONFIRMED[science overlay] dev-lang/julia-9999 - ld: cannot find -lunwind-generic2013-01-06 15:57:08
448110DevelopmentsciUNCONFIRMEDdev-python/rpy-2.2.6-r1 fails test testInterruptR - AssertionError: True is not false2013-01-23 17:03:53
442838EbuildssciUNCONFIRMEDsci-libs/netcdf-cxx-4.2: fails tests2012-11-13 06:16:03
433647ApplicationssciUNCONFIRMEDsci-libs/netcdf-4.1.3 fails with -l-L/usr/lib/gcc/x86_64-pc...2012-10-08 19:14:17
396057ApplicationssciUNCONFIRMED[science-overlay] embassy-phylipnew-3.69 fails to emerge due to wrong filesize2012-02-20 14:34:00
395891ApplicationssciUNCONFIRMED[science overlay] sci-biology/embassy-memenew-4.0.0-r1 fails to fetch embassy-memenew-4.0.0-r1.tar.g2012-02-20 14:34:30
376237ApplicationssciUNCONFIRMEDsci-misc/boinc-6.12.33: boinc is missing menu when connecting to localhost2012-06-27 10:06:22
386769ApplicationssbriesenUNCONFIRMEDnet-dialup/capi4k-utils-20050718-r5 init script should change opts variable to use either extra_comm2012-06-07 16:11:26
425124SandboxsandboxUNCONFIRMEDdev-vcs/git - git clone freezes when run in a sandbox2012-08-23 08:40:01
440580ApplicationssambaUNCONFIRMEDnet-fs/samba-3.5.15: some elog messages should only be shown when upgrading from an old enough packa2012-10-31 16:27:27
446190ServersambaUNCONFIRMEDnet-fs/samba-3.5.19: cross compile fixes2012-12-06 05:03:46
435570ApplicationssambaUNCONFIRMED>=net-fs/cifs-utils-5.5-r1 - users cannot mount shares2012-09-24 13:00:56
433074ServersambaUNCONFIRMEDnet-fs/samba: please add systemd unit file2013-02-15 18:19:32
395529EbuildssambaUNCONFIRMEDnet-fs/samba - add support for samba-virusfilter2011-12-21 17:17:13
397355ServersambaUNCONFIRMEDnet-fs/samba cluster flags wrong config file /etc/ctdb/functions2012-01-16 23:57:57
395007Prefix SupportryaoUNCONFIRMEDImport net-misc/tor-0.2.2.34-r1 on x64-macos2012-08-10 18:51:21
458022Core systemryaoUNCONFIRMEDsys-block/iscsitarget-1.4.20.2 - 1 out of 1 hunk FAILED -- saving rejects to file kernel/conn.c.rej2013-02-17 19:02:08
377339EbuildsroxUNCONFIRMEDNew Version rox-base/zeroinstall-injector-1.22011-08-02 10:52:56
453992Applicationsrobbat2UNCONFIRMEDnet-misc/rdate-1.4-r3 does not honor RDATE_TIMEOUT in /etc/conf.d/rdate2013-01-26 15:32:30
444402Serverrobbat2UNCONFIRMEDnet-misc/memcached - Malformed pid filename when running multiple instances2012-11-23 09:40:18
444532Applicationsrobbat2UNCONFIRMEDnet-misc/cfengine try to exec /sbin/ifconfig instead of /bin/ifconfig2013-02-08 06:53:29
446828Applicationsrobbat2UNCONFIRMEDnet-analyzer/sslsniff-0.8-r1 - conftest.cpp:21:26: fatal error: boost/asio.hpp: No such file or dire2012-12-11 22:11:50
448914Ebuildsrobbat2UNCONFIRMEDdev-db/libdbi-drivers needs a local description of bindist USE-flag2012-12-27 19:52:27
438262Core systemrobbat2UNCONFIRMEDsys-fs/lvm2-2.02.97 /etc/init.d/device-mapper does not support multi-line volumes in /etc/dmtab2013-01-28 12:11:27
435304Unspecifiedrobbat2UNCONFIRMEDapp-portage/g-cpan-0.16.4-r1 generates broken ebuild depending on perl-g-cpan instead of dev-perl mo2013-02-21 07:50:32
433411Serverrobbat2UNCONFIRMEDnet-firewall/ipset init-script should not "use logger"2012-09-03 15:21:15
434110Applicationsrobbat2UNCONFIRMEDapp-admin/cancd-0.1.0-r2: netconsole init script fails to start due to wrong ifconfig path2012-09-06 14:20:31
432992Core - Ebuild Supportrobbat2UNCONFIRMEDsys-apps/portage-2.2.0_alpha121 breaks g-cpan (/etc/make.globals symlink is gone)2013-01-04 22:46:36
405265Developmentrobbat2UNCONFIRMED"git svn clone/fetch/rebase" fail with dev-vcs/subversion[webdav-serf]2012-03-15 13:31:46
403371Applicationsrobbat2UNCONFIRMEDsys-apps/rescan-scsi-bus-1.48: line 592: [: 1.03: integer expression expected2012-02-13 17:42:59
392953Ebuildsrobbat2UNCONFIRMEDdev-java/lucene-3.6.1 Version Bump2012-11-19 09:35:47
395209Ebuildsrobbat2UNCONFIRMEDnet-misc/memcached-1.4.10 doesn't installs systemd service file2012-12-27 21:45:17
395839Applicationsrobbat2UNCONFIRMEDnet-misc/adjtimex-1.29 is not compatible with baselayout-22011-12-26 10:07:56
401249Applicationsrobbat2UNCONFIRMEDnet-mail/qmailadmin-1.2.16 version bump2012-01-30 11:52:34
401473Ebuildsrobbat2UNCONFIRMEDapp-misc/dnetc-2.9110.519 version bump2012-11-19 09:35:41
402277Applicationsrobbat2UNCONFIRMEDnet-misc/memcached-1.4.13 version bump (1.4.11 does not build)2013-01-01 15:39:01
376767Ebuildsrobbat2UNCONFIRMEDapp-portage/g-cpan-0.16.4 creates non-existent categories file without newline (inconsistent)2011-08-03 01:16:53
389905EbuildsRicardo.CordeiroUNCONFIRMEDnet-p2p/btpd-0.15: btpd can't start if BTPDUSER is "root"2011-11-08 21:44:58
456764Keywording and StabilizationrentorbuyUNCONFIRMED=net-firewall/shorewall{,-core}-4.5.11.2 stabilisation request2013-02-11 17:03:57
454728LiveCD/DVDreleaseUNCONFIRMEDnet-setup broken in livecd-tools2013-01-30 19:32:04
450330StagesreleaseUNCONFIRMEDno service can provide "net" on arm stage3-armv6j_hardfp (last known good build Nov 15 2012)2013-01-05 05:01:43
447110InstallCDreleaseUNCONFIRMEDnet-setup did not work for wlan wpa22012-12-13 14:22:30
448788InstallCDreleaseUNCONFIRMEDAMD 64 install CD: wireless network card not detected (lenovo T61, Intel Wireless 4965) - missing fi2012-12-27 07:54:59
437458InstallCDreleaseUNCONFIRMEDinstall-amd64-minimal-20120917.iso doesn't autodetect VirtIO blockdevice/network devices2012-12-16 06:09:55
370803NetbootreleaseUNCONFIRMEDgentoo.igz has very limited set of NIC drivers - this breaks netboot for machines without e1000 or 2011-06-22 18:25:31
380547InstallCDreleaseUNCONFIRMEDminimal CD - kernel doesn't initialize dual nic interfaces2012-10-01 04:17:36
429646GamesreavertmUNCONFIRMEDdev-games/openscenegraph-3.0.1 with sys-devel/clang-3.1 - error: cannot initialize a parameter of ty2012-08-04 00:29:11
398677GamesreavertmUNCONFIRMEDdev-games/openscenegraph-3.0.1 - /usr/lib64/libdcmimgle.a(dcmimage.o): relocation R_X86_64_32S again2012-11-18 23:58:42
451132ApplicationsrajivUNCONFIRMEDnet-dns/dnstop version bump request2013-02-03 15:00:48
373891EbuildsramerethUNCONFIRMEDnet-misc/stunnel build fails: #error OpenSSL library compiled without thread support2012-12-25 04:27:10
433153ApplicationsramerethUNCONFIRMEDapp-emulation/ganeti should install logrotate config2012-09-03 11:31:29
366395Keywording and StabilizationrafaelmartinsUNCONFIRMED>=dev-lang/luajit-2.0.0_beta7 needs arm and ppc testing2012-05-31 17:47:27
430996EbuildsradioUNCONFIRMEDnet-wireless/gnuradio-3.6.1-r1 does not byte-compile grc_gnuradio package2012-08-12 11:35:18
430348EbuildsradioUNCONFIRMEDnet-wireless/gnuradio-3.6.1-r1 USE="doc" - some documentation is installed outside /usr/share/doc/${2012-08-13 23:02:49
448910Applicationsqmail-bugsUNCONFIRMEDmail-mta/netqmail-1.06 - Force python version to 2.x. - pkg_postinst - SyntaxError: invalid token "02012-12-28 13:08:59
448830LibraryqtUNCONFIRMEDx11-libs/qt-openvg-4.8.4 - qpaintengine_vg.cpp:3212:5: error: narrowing conversion of ‘d->QVGPaintEn2013-02-17 11:26:14
449092LibraryqtUNCONFIRMED[qt overlay] x11-libs/qt-webkit-5.0.0 fails to build: undefined reference to `JSC::JSCell::classInfo2013-02-16 10:09:49
412581Installation Handbookr0bertzUNCONFIRMED[zh_cn] two problems in Chinese handbook2012-06-30 17:52:43
458170EbuildsqtUNCONFIRMEDnet-news/quiterss-0.12.1 - version bump request2013-02-18 22:02:11
435334Applicationsqmail-bugsUNCONFIRMEDmail-mta/netqmail-1.06 - pkg_postinst(): queue-repair failed2012-10-14 19:09:10
413269Ebuildsqmail-bugsUNCONFIRMEDmail-mta/netqmail-1.06 Add checkuser patch?2012-04-24 09:33:04
415929Serverqmail-bugsUNCONFIRMEDnet-mail/queue-repair should depend on dev-lang/python:2.*2012-05-15 15:06:41
408275Applicationsqmail-bugsUNCONFIRMEDmail-mta/netqmail-1.06 - SMTPRCPTTO is empty2012-12-10 15:51:17
405899Applicationsqmail-bugsUNCONFIRMEDnet-mail/queue-repair - /usr/bin/queue-repair.py: AttributeError: 'dict_keys' object has no attribut2012-02-27 01:35:46
404225Ebuildsqmail-bugsUNCONFIRMEDmail-mta/netqmail-1.06: no TCPSERVER_OPTS=-R in conf-pop3*2012-02-17 15:06:40
403893Serverqmail-bugsUNCONFIRMEDmail-mta/netqmail-1.06 - qmail-pop3sd doesn't run on amd64 with default config2012-02-15 13:49:13
403479Ebuildsqmail-bugsUNCONFIRMEDmail-mta/netqmail-1.06 - typo in /etc/tcprules.d/Makefile.qmail2012-02-14 18:31:39
379033Serverqmail-bugsUNCONFIRMEDmail-filter/qmail-scanner: Causing problems with RBL-checks activated spamassassin on target when se2011-08-14 02:01:12
377939Applicationsqmail-bugsUNCONFIRMEDnet-mail/vpopmail - added PostgreSQL support and USE flag2012-04-11 04:19:05
373909Applicationsqmail-bugsUNCONFIRMEDnet-mail/qmailadmin-1.2.12: unmerge chokes on webapp-config2011-07-03 16:21:55
375879Ebuildsqmail-bugsUNCONFIRMED[PATCH] mail-mta/netqmail: Add SMTP authentication support (AUTH LOGIN) to qmail-remote2012-02-24 13:11:27
370611Serverqmail-bugsUNCONFIRMEDmail-mta/netqmail-1.06 build failure: missing dependency - sys-apps/groff2011-06-08 06:31:17
407597DevmanualqaUNCONFIRMEDhardblockers and versioned slot deps missing under general-concepts/dependencies2013-01-01 18:38:03
390571CoreqaUNCONFIRMEDdev-perl/CDDB_get 2.27 - environment: line 345: pushd: /var/tmp/portage/dev-perl/CDDB_get-2.27/work/2011-11-22 19:19:25
447264UnspecifiedpythonUNCONFIRMEDdev-lang/python - QA Notice: USE Flag 'hardened' not in IUSE2012-12-15 15:50:35
450084Keywording and StabilizationpythonUNCONFIRMEDPlease stabilize =dev-python/virtualenv-clone-0.2.42013-01-05 17:04:31
446016LibrarypythonUNCONFIRMEDdev-python/python-gnutls-1.2.4 does not support >=net-libs/gnutls-32012-12-05 01:13:29
445081ApplicationspythonUNCONFIRMEDnet-zope/zope-interface-3.8.0 - src_test(): TypeError: metaclass conflict: the metaclass of a derive2013-02-02 10:01:54
439662EbuildspythonUNCONFIRMED=dev-lang/python-2.7.3-r2 pydoc-2.7 init script should drop need net2012-10-26 16:14:27
439724ApplicationspythonUNCONFIRMED>app-editors/leo-4.9 USE =tk is not needed anymore2012-10-26 16:26:57
433003LibrarypythonUNCONFIRMEDdev-libs/libxml2 - File "/usr/lib/python2.7/xml/sax/__init__.py", line 93, in make_parser raise 2012-09-09 04:48:34
431058Eclasses and ProfilespythonUNCONFIRMEDdev-util/gdbus-codegen-2.32.4 - /usr/portage/eclass/python-distutils-ng.eclass: line 206: syntax err2012-08-12 16:45:06
426194ApplicationspythonUNCONFIRMEDapp-admin/eselect-python: python wrapper breaks OpenELEC build2012-07-12 00:36:25
427244DevelopmentpythonUNCONFIRMEDdev-python/networkx 1.7 - Syntax errors / warnings in Python modules for CPython 3.2: File "/usr/lib2013-01-22 11:57:15
407681ApplicationspythonUNCONFIRMEDmedia-sound/quodlibet-2.3.92-r1 segfaults when dev-lang/python-2.7.2-r3 is compiled with the hardene2012-10-06 17:14:29
401651Core - DependenciespythonUNCONFIRMEDdev-lang/python 3.1.4-r3 and 2.7.2-r3 sys-libs/readline is conditional on ncurses?2012-02-01 06:29:39
457628ApplicationsprometheanfireUNCONFIRMEDsys-cluster/swift-1.7.6 has typo in "newinitd"2013-02-15 18:36:35
389633Unspecifiedproxy-maintUNCONFIRMEDx11-drivers/xf86-input-wacom / sys-kernel/linuxwacom-module - missing udev rules for wacom2013-02-16 14:37:56
426672EbuildsproaudioUNCONFIRMEDmedia-sound/timemachine should install a desktop file2012-07-18 15:45:01
407163LibraryproaudioUNCONFIRMEDmedia-libs/portmidi needs kernel config checks for CONFIG_SND_USB_AUDIO, CONFIG_SND_SEQUENCER2012-03-07 16:40:02
452896PrintingprintingUNCONFIRMEDnet-print/cups-1.6.1 - missing linguas2013-01-19 16:44:53
456314PrintingprintingUNCONFIRMEDnet-print/foo2zjs uses hotplug scripts to upload firmware to printers2013-02-12 14:34:00
457574PrintingprintingUNCONFIRMEDnet-print/cups-1.6.1 - Brother USB Laser Printer no longer prints anything2013-02-15 15:36:09
372525ApplicationsproaudioUNCONFIRMEDmedia-sound/jack-audio-connection-kit-0.120.2 crashes with buffer overflow detected in jack_alsa.so2011-10-10 00:02:33
396211ApplicationsproaudioUNCONFIRMEDmedia-sound/ardour crashes - /usr/share/themes/Clearlooks/gtk-2.0/gtkrc:76: error: unexpected identi2012-10-06 14:26:04
450220ApplicationsprintingUNCONFIRMED=net-print/cups-1.5.2-r4 - German localization file has empty strings.2013-01-05 18:07:19
445278PrintingprintingUNCONFIRMED>=net-print/cups-1.5.3 - Broken for some printer models [prints half last page]2013-02-19 17:40:28
443076PrintingprintingUNCONFIRMEDnet-print/foomatic-filters-4.0.16 - configure.ac:6: version mismatch. This is Automake 1.11.6, but2013-01-19 06:59:22
440502PrintingprintingUNCONFIRMEDnet-print/cups-1.5.2-r4: some elog messages should only be shown for the first install.2012-10-31 16:19:53
440578PrintingprintingUNCONFIRMEDnet-print/cups-1.5.2-r4: some elog messages should only be shown when upgrading from an old enough p2012-10-31 16:27:11
440886PrintingprintingUNCONFIRMEDnet-print/cups-bjnp-1.1 - In file included from bjnp-io.c:22:0: bjnp-protocol.h:100:5: error: redefi2013-02-11 11:01:36
434440PrintingprintingUNCONFIRMEDnet-print/cups-1.6.1 should pull in virtual/libusb:1 with USE=usb instead of libusb:02012-09-09 16:02:09
434940PrintingprintingUNCONFIRMEDnet-print/cups-1.6.1 prints square of number of prints requested2012-09-24 16:56:30
435188PrintingprintingUNCONFIRMEDnet-print/foo2zjs: Wrong path to the CUPS usb backend2012-09-16 15:56:26
431926PrintingprintingUNCONFIRMEDnet-print/foomatic-filters - foomatic-gswrapper symlink broken2013-02-04 19:46:49
432418PrintingprintingUNCONFIRMEDnet-print/gutenprint should optionally support Epson printers2012-11-09 14:13:17
430498PrintingprintingUNCONFIRMEDnet-print/cups-bjnp-1.0 and net-print/cups-1.6.1: Failed to read side-channel request!2012-08-09 23:40:25
420623PrintingprintingUNCONFIRMEDnet-print/foo2zjs-99999999 fails emerge with permission denied, access attempt outside the sandbox2013-01-27 23:07:16
419787PrintingprintingUNCONFIRMEDnet-print/foo2zjs-99999999 with app-text/ghostscript-gpl-9.05-r1 fails tests2012-10-09 09:27:44
403327PrintingprintingUNCONFIRMEDnet-print/foomatic-db-ppds-4.0.20120117-r1: Missing NickName and ModelName in /usr/share/cups/model/2012-02-14 21:13:08
455512Prefix SupportprefixUNCONFIRMEDsys-libs.readline has an incorrect install_name which trigger install failure because of QA2013-02-05 01:02:35
375397PrintingprintingUNCONFIRMEDnet-print/foo2zjs-99999999: firmware not loaded into printers2012-02-19 22:07:51
389665PrintingprintingUNCONFIRMEDnet-print/foo2zjs-99999999 fails to build osx-hplj-hotplug2012-06-13 20:01:41
450512Prefix SupportprefixUNCONFIRMEDmedia-gfx/graphite2: Undefined symbols for architecture ppc2013-02-02 15:39:11
436898Prefix SupportprefixUNCONFIRMEDnet-misc/connect-100 Interix support2012-10-02 00:52:10
430178Prefix SupportprefixUNCONFIRMEDnet-libs/libtirpc : port to Gentoo Prefix request2013-01-04 18:53:51
430266Prefix SupportprefixUNCONFIRMEDapp-arch/xz-utils fails to build on NetBSD2012-08-10 06:38:46
425222Prefix SupportprefixUNCONFIRMEDopenexr/openexr-1.7.0-r1.ebuild with support for prefix2012-08-20 19:34:56
422907Prefix SupportprefixUNCONFIRMEDdev-lang/ghc-7.4.1-r1: Undefined symbols for architecture x86_64 when building in-tree ghc-pwd2012-09-28 20:27:16
418333Prefix SupportprefixUNCONFIRMEDnet-proxy/nylon-1.21: configure: error: libevent not found2012-10-09 21:20:43
416949Prefix SupportprefixUNCONFIRMEDapp-misc/figlet-222 works fine on x64-macos2012-05-21 18:21:31
388245Prefix SupportprefixUNCONFIRMEDNew keywords for dev-php/pecl-apc-3.1.9-r2: ~{x86,x64}-macos2011-10-23 18:43:41
389033Prefix SupportprefixUNCONFIRMEDNew keywords and patches for dev-php/{xdebug,xdebug-client}-2.1.2 and eclass: ~{x86,x64}-macos2011-11-30 13:58:11
384581Mac OSXprefixUNCONFIRMEDapp-editors/emacs-23.3-r2: emerge failed with error unexec: my_endbss_static is not in section __bss2011-10-31 03:04:33
376435Prefix SupportprefixUNCONFIRMEDnet-libs/libpcap-1.1.1-r1 - ./pcap-usb-linux.c:228: error: storage size of 'ctrl' isn't known2011-12-19 02:04:51
401617Core systemppc64UNCONFIRMEDsys-kernel/gentoo-sources-3.2.1-r2 produces a lot of "BUG: using smp_processor_id() in preemptible .2012-02-05 03:20:56
436360Applicationspolynomial-cUNCONFIRMEDwww-client/seamonkey-2.12.1 - /bin/sh: line 1: 24652 Aborted .../work/comm-release/seamonk/suite/ins2012-09-28 14:44:46
436536Applicationspolynomial-cUNCONFIRMEDnet-irc/xchat-2.8.8-r2 - patches that apply cleanly and fix several issues2012-09-29 15:32:27
440478Applicationspolynomial-cUNCONFIRMEDnet-ftp/pure-ftpd-1.0.36: some elog messages should only be shown for the first install.2012-10-31 16:18:31
447356Unspecifiedpolynomial-cUNCONFIRMEDapp-emulation/virtualbox-modules-4.2.4 with kernel 3.7 - modprobe: FATAL: Error inserting vboxdrv (/2013-02-14 10:04:16
431144Applicationspolynomial-cUNCONFIRMEDnet-irc/xchat-2.8.8-r2 - saved configuration is corrupted on read or write2012-08-15 12:32:17
420291Applicationspolynomial-cUNCONFIRMEDnet-irc/xchat-2.8.8-r2 fails to build2012-06-11 18:44:41
426898Applicationspolynomial-cUNCONFIRMED=app-emulation/virtualbox-modules-4.1.12 with sys-kernel/vanilla-sources-3.4.5 - src_test(): .../wor2012-11-13 17:18:09
409961Applicationspolynomial-cUNCONFIRMEDapp-emulation/virtualbox-4.1.10[vboxwebsrv] with net-libs/gsoap-2.8.8[gnutls] - /usr/lib64/libgsoaps2012-03-28 12:53:46
379967Applicationspolynomial-cUNCONFIRMEDapp-emulation/virtualbox-modules-4.0.12 doesn't check kernel config on compatibility2011-08-22 12:36:13
395429Ebuildspolynomial-cUNCONFIRMEDapp-emulation/virtualbox-modules: need check CONFIG_HZ=value2011-12-21 02:10:58
380459PMS/EAPIpms-bugsUNCONFIRMEDMERGE_TYPE phases aren't defined2011-08-24 17:51:29
438494Conceptual/Abstract Ideaspms-bugsUNCONFIRMEDHave configuration file protection against new files in conf.d/ directories2012-10-16 15:46:11
368659Unspecifiedpolynomial-cUNCONFIRMEDapp-emulation/virtualbox - add USE flag for net-misc/vde2011-11-23 09:07:24
375565Serverpolynomial-cUNCONFIRMEDnet-ftp/pure-ftpd init script fails with UPLOADSCRIPT set2011-09-06 09:49:17
456928Applicationsphp-bugsUNCONFIRMEDdev-lang/php-5.4.8[imap] - ./conftest: symbol lookup error: /usr/lib64/libc-client.so.1: undefined s2013-02-13 19:05:07
453924Developmentphp-bugsUNCONFIRMEDdev-lang/php-5.4.8 - Shouldn't create /var/lib/net-snmp/mib_indexes at runtime2013-01-26 01:47:58
451840Developmentphp-bugsUNCONFIRMED=dev-lang/php-5.4.8 - /usr/lib/gcc/x86_64-pc-linux-gnu/4.5.4/../../../../lib64/libldap.so: undefined2013-01-14 12:35:20
423167Developmentphp-bugsUNCONFIRMEDdev-php/pecl-http-1.7.4 fails at runtime with "undefined symbol: gcry_control" when using net-libs/g2012-08-01 12:00:35
456018ApplicationsphosphanUNCONFIRMEDmedia-gfx/sane-backends should show add user to scanner group message2013-02-07 14:31:50
439920Core systemperlUNCONFIRMEDdev-lang/perl-5.12.4-r1 - pp.o: In function `Perl_pp_pow': pp.c:(.text+0x3a8a): undefined reference 2012-10-28 16:20:23
421159DevelopmentperlUNCONFIRMEDvirtual/perl-libnet needs updated RDEPEND2012-06-15 15:36:15
423973DevelopmentperlUNCONFIRMEDdev-perl/Net-DNS-0.660.0 and 0.680.0 damages $SIG{} hash when included.2012-06-28 13:41:39
420033DevelopmentperlUNCONFIRMEDdev-perl/MooseX-Types-DateTimeX fails tests with MooseX-Types-DateTime-ButMaintained-0.140.02012-06-07 09:09:11
400659DevelopmentperlUNCONFIRMEDperl-core/Module-Build and dependencies on it are unnecessary2012-01-29 00:25:09
386751ApplicationsperlUNCONFIRMEDdev-lang/perl-5.12.4-r1: 2 files left after upgrade and "perl-cleaner --all"2012-07-14 17:16:36
384137EbuildsperlUNCONFIRMEDdev-perl/Inline-0.480.0: fails tests with parallel make2011-09-27 16:26:48
383241ApplicationsperlUNCONFIRMEDdev-lang/perl-5.12.4-r1 - ./hints/linux.sh: line 194: ./a.out: cannot execute binary file2011-09-19 02:57:56
458470ServerpatrickUNCONFIRMEDwww-servers/apache-2.4.3 - Syntax error on line 156 of /etc/apache2/httpd.conf: Invalid command 'Use2013-02-20 15:13:48
458440ApplicationspatrickUNCONFIRMEDapp-office/openerp-6.1.1-r1 USE=-postgres - sed: can't read /var/tmp/portage/app-office/openerp-6.1.2013-02-20 15:16:18
453516ApplicationspatrickUNCONFIRMEDapp-emulation/virtualbox-bin-4.2.6 - can not use Bridged Adapter in network config2013-01-23 14:33:55
447780EbuildspatrickUNCONFIRMEDnet-analyzer/snort init scripts snort.rc1* still use opts variable2012-12-19 02:35:38
438240EbuildspatrickUNCONFIRMEDnet-irc/irker - several issues2012-11-06 18:15:18
438758ServerpatrickUNCONFIRMEDwww-servers/apache-2.4 - Syntax error on line 60 of /etc/apache2/modules.d/40_mod_ssl.conf: Invalid 2013-02-16 13:32:50
424373ApplicationspatrickUNCONFIRMEDnet-misc/strongswan-5.0.0 - Outdated description about (non-)root privileges2012-07-03 14:39:13
423145ApplicationspatrickUNCONFIRMEDnet-irc/quassel support for syslog in init script2012-06-25 20:11:44
403953ServerpatrickUNCONFIRMEDwww-servers/apache-2.2.21 - CONNECT does not work over existing SSL connection2013-02-16 14:06:13
405151ApplicationspatrickUNCONFIRMEDapp-emulation/virtualbox-guest-additions-4.1.4-r1: Failure to build with 3.2 kernel2012-04-02 07:44:24
398755ApplicationspatrickUNCONFIRMEDnet-misc/elliptics-2.11.0.12 - a fault tolerant key/value storage2012-12-25 19:11:17
392769ApplicationspatrickUNCONFIRMEDapp-emulation/virtualbox-guest-additions-4.1.6-r1 fails to build from /etc/kernel/postinst.d - make[2012-03-14 22:38:37
396179ApplicationspatrickUNCONFIRMEDdev-lang/nqp-2011.10 - /usr/bin/parrot: symbol lookup error: dynext/nqp_group.so: undefined symbol: 2011-12-27 21:15:43
373979EbuildspatrickUNCONFIRMEDapp-emulation/virtualbox-modules-4.0.10 does not compile if KBUILD_OUTPUT != KERNEL_DIR2012-09-11 09:29:19
456908Core systempam-bugsUNCONFIRMEDsys-libs/pam-1.1.6-r2: /usr/lib64/portage/bin/isolated-functions.sh: line 215: wait: `Failed Running2013-02-16 21:10:14
452162ApplicationspachoUNCONFIRMED=net-wireless/bluez-5.2 version bump request2013-02-08 20:41:38
458508EbuildspachoUNCONFIRMEDsys-power/bbswitch kernel 3.8 compatibility hack2013-02-20 22:50:36
428282LibrarypachoUNCONFIRMEDnet-wireless/bluez-4.99 expected specifier-qualifier-list before ‘typeof’ in bluetooth.h2013-02-12 21:43:00
307401ApplicationspachoUNCONFIRMEDmedia-gfx/xsane crashes during startup if xinerama is enabled2012-03-02 11:17:03
458074OpenRCopenrcUNCONFIRMEDsys-apps/openrc-0.11.8 doesn't parse correctly options contained two words abreast self2013-02-18 13:35:38
455912OpenRCopenrcUNCONFIRMEDsys-apps/openrc-0.11.8 with sys-libs/ncurses[tinfo] - ../libeinfo/libeinfo.so: undefined reference t2013-02-14 14:13:57
455458OpenRCopenrcUNCONFIRMEDsys-apps/openrc - netmount fuser timeout - stopping the netmount script on shutdown. cifs shares won2013-02-06 12:18:47
446606OpenRCopenrcUNCONFIRMEDsys-apps/openrc: Routing policy rules need to be set before routes2013-01-15 20:33:29
445820OpenRCopenrcUNCONFIRMEDsys-apps/openrc-0.11.6 don't populate /sys in Linux Container2013-02-18 19:02:42
443480OpenRCopenrcUNCONFIRMEDsys-apps/openrc: iproute2 net module: add xfrm ( ipsec ) support2012-11-17 08:02:46
439174OpenRCopenrcUNCONFIRMEDrc-update (and other rc utilities) need to be quiet when --quiet is specified2013-01-01 21:24:06
434020OpenRCopenrcUNCONFIRMEDnet.example in docs dir suggest a faulty bond0-configuration.2012-09-05 11:55:57
411815OpenRCopenrcUNCONFIRMEDsys-apps/openrc-0.9.8.4 does not install ethtool_ring and txqueuelen params for network cards in bon2012-05-05 17:48:36
402347OpenRCopenrcUNCONFIRMEDnet.wlan0 fails to auto-start with 2013-02-03 08:30:09
410271OpenRCopenrcUNCONFIRMEDnet init scripts fail to add route source address to tunnel interface: "RTNETLINK answers: Invalid a2012-04-02 01:31:02
375597OpenRCopenrcUNCONFIRMEDsys-apps/openrc: netmount hangs with dead remotes2012-11-18 21:55:02
378633Core systemopenrcUNCONFIRMEDrestarting one interface complains that dhcpcd is already running, even if in fact it is not (race c2011-08-13 14:26:13
383493baselayoutopenrcUNCONFIRMEDsys-apps/openrc-0.9.3-r1, net-firewall/ipset, net-firewall/iptables: Circular Dependency with custom2011-09-20 13:06:03
369925OpenRCopenrcUNCONFIRMED/etc/conf.d/net - Setting associate_timeout_ does not have any effect with net-wireless/wpa_s2013-01-01 17:01:05
367717OpenRCopenrcUNCONFIRMEDsys-apps/openrc: services which need net aren't starting on boot2011-06-29 16:46:02
448130ApplicationsopenofficeUNCONFIRMEDapp-office/libreoffice-3.6.4.3 - /usr/lib64//libclucene-core.so: undefined reference to `std::__deta2012-12-27 07:54:58
452674LibraryolemarkusUNCONFIRMEDdev-php/Yaml-2.1.7 - The Symfony 2 YAML Component2013-02-19 14:34:22
376505EbuildsnxUNCONFIRMEDnet-misc/nxserver-freenx should depend on xorg-server2011-07-26 19:05:18
410719ApplicationsnxUNCONFIRMEDnet-misc/nxclient - nxclient: symbol lookup error: /usr/lib/libfontconfig.so.1: undefined symbol: FT2012-04-04 02:19:00
424840ApplicationsolegUNCONFIRMEDnet-wireless/reaver-1.4 should probably maintain database in /var/lib/reaver, not /etc/reaver2012-07-05 15:27:53
426260ServernxUNCONFIRMEDnet-misc/x2goserver - x2go loses the applications menu under gnome2012-07-17 18:04:16
369851ApplicationsnxUNCONFIRMEDnet-misc/nx-3.4.0-r3 *** stack smashing detected ***: nxagent - terminated2012-07-12 06:06:30
458274ApplicationsnirbheekUNCONFIRMEDnet-misc/networkmanager-0.9.6.4 does not save settings for wired connection with 802.1x authenticati2013-02-21 08:24:51
457940ApplicationsnirbheekUNCONFIRMEDnet-misc/networkmanager should prioritise ethernet over wifi2013-02-18 15:59:18
457092ApplicationsnirbheekUNCONFIRMEDnet-misc/networkmanager disables IPv6 Privacy Extensions2013-02-13 19:21:04
440466ApplicationsnirbheekUNCONFIRMEDnet-misc/modemmanager-0.5.2.0-r3: some elog messages should only be shown for the first install.2012-10-31 16:16:29
443596ApplicationsnirbheekUNCONFIRMEDnet-misc/networkmanager: ifnet plugin does not save cloned MAC address & duplicates entries2013-01-26 21:16:37
451510ApplicationsnirbheekUNCONFIRMEDnet-misc/networkmanager-0.9.4.0-r6 does not pass hostname to DHCP server2013-01-12 16:42:13
450252EbuildsnirbheekUNCONFIRMEDNetworkmager and dhclient: can't create /var/lib/dhclient/*-eth0.lease2013-01-06 18:25:17
435762ApplicationsnirbheekUNCONFIRMEDnet-misc/networkmanager-0.9.6.0 disconnects shortly after establishing connection2012-10-26 23:03:17
435316ApplicationsnirbheekUNCONFIRMEDnet-misc/networkmanager-openvpn-0.9.4.0/0.9.6.0 segfaults when trying to connect2013-02-15 13:53:19
424365EbuildsnirbheekUNCONFIRMEDdev-python/pypy-1.9-r1: AssertionError: must come from an argument to the function, got <-88;esp>2012-07-03 14:41:31
399193ApplicationsnirbheekUNCONFIRMEDnet-misc/networkmanager-0.9.2.0-r2: init script needs net.lo2012-11-04 15:16:36
420807ApplicationsnirbheekUNCONFIRMEDnet-misc/networkmanager-0.9.4.0-r2 should set channel 1 before trying ad-hoc2012-11-23 07:45:38
376201ApplicationsnirbheekUNCONFIRMEDx11-themes/murrine-themes-0.98.0: NOX theme shows "Murrine configuration option 'gradients' is no lo2011-08-27 23:06:28
456024ApplicationsnikoliUNCONFIRMEDmedia-sound/clementine 1.1.1 crashes with 0 size .mood file when moodbar is enabled in the playlist2013-02-07 14:14:11
457566LibrarynikoliUNCONFIRMEDmedia-libs/libechonest-2.0.3 version bump2013-02-15 15:35:23
457656ApplicationsnikoliUNCONFIRMEDmedia-sound/clementine (while scanning media) - segfault in TagLib::File::find(TagLib::ByteVector co2013-02-15 15:57:13
448938EbuildsnikoliUNCONFIRMEDmedia-video/mplayer2 needs a local description of bindist USE-flag2012-12-27 20:30:03
439654EbuildsnetmonUNCONFIRMEDnet-misc/iperf iperf init script should drop need net2012-10-26 16:11:02
450674ApplicationsnetmonUNCONFIRMEDnet-analyzer/rrdtool needs a group for rrdcached2013-01-07 12:07:36
430428EbuildsnetmonUNCONFIRMEDnet-analyzer/ntop-5.0.1 version bump2013-01-11 16:41:42
430628ApplicationsnetmonUNCONFIRMED=net-analyzer/metasploit-4.3.0 add revdep-rebuild directory masks2012-08-13 00:54:27
433443EbuildsnetmonUNCONFIRMEDnet-analyzer/snmptt should install snmptthandler-embedded2012-09-03 15:46:10
435982ApplicationsnetmonUNCONFIRMEDnet-analyzer/tcpdump-4.3.0 fails tests: esp4, esp5, isakmp4, ikev2pI22012-10-12 10:51:32
437840ApplicationsnetmonUNCONFIRMEDnet-analyzer/net-snmp-5.7.2_rc1 - snmpd(XX): floating-point assist fault at ip 20000595aab3efc2, isr2012-10-14 18:00:40
439652EbuildsnetmonUNCONFIRMEDnet-analyzer/rrdtool rrdcached init script should drop need net2012-10-26 16:27:07
438630EbuildsnetmonUNCONFIRMEDnet-analyzer/cacti Adding Patch for dev-lang/php:5.42013-02-16 13:31:52
427146ApplicationsnetmonUNCONFIRMEDnet-analyzer/ntop - Segfaulting with high load netFlow monitoring2012-09-25 17:27:26
428674ApplicationsnetmonUNCONFIRMEDnet-analyzer/ifmetric-0.3 with kernel 3.5 -
NETLINK: Packet too small or truncated! 32!=16!=101
2012-07-30 23:43:53
426356ApplicationsnetmonUNCONFIRMEDnet-analyzer/mrtg-2.17.4: /etc/init.d/mrtg restart: overload arg '..' is invalid at /usr/lib/perl5/v2012-07-25 14:42:22
420473ApplicationsnetmonUNCONFIRMEDnet-analyzer/fail2ban-0.8.6 violates Date-Mailheader standards when using sendmail*-actions and havi2012-12-17 11:17:57
410549ServernetmonUNCONFIRMEDnet-analyzer/ntop init.d script looks for ntop data at a hardcoded location2012-04-06 22:12:41
407075ApplicationsnetmonUNCONFIRMEDnet-analyzer/nmap USE=lua fails to run after upgrade to dev-lang/lua-5.2.0 and will not rebuild2013-01-15 17:07:41
408263ApplicationsnetmonUNCONFIRMED=net-analyzer/fail2ban-0.8.6 iptables bans lost on restart2012-03-15 15:16:00
408825ApplicationsnetmonUNCONFIRMEDnet-analyzer/ntop-4.1.0 No interface has been configured. Please configure ntop first.2012-08-11 18:16:20
405765ApplicationsnetmonUNCONFIRMEDnet-analyzer/rrdtool-1.4.5-r2 - main.c:(.text+0x26c): undefined reference to `rrd_xport'2012-08-26 06:23:55
397517ServernetmonUNCONFIRMEDapp-admin/sshguard-1.5 add attack signatures for net-misc/asterisk2012-08-19 01:00:03
373283ApplicationsnetmonUNCONFIRMEDnet-analyzer/netcat-110-r9: -c does execve() instead of system()2011-07-03 17:35:12
373865ApplicationsnetmonUNCONFIRMEDnet-analyzer/tcptraceroute cross compiling fix2011-07-05 00:10:15
374085ApplicationsnetmonUNCONFIRMEDnet-analyzer/tcptrace cross compilation fix2011-07-08 19:12:28
383055EbuildsnetmonUNCONFIRMEDnet-analyzer/rrdtool[ruby] - fails to compile2011-09-16 22:56:02
386621ApplicationsnetmonUNCONFIRMEDnet-analyzer/metasploit SLOT correction request2012-03-26 03:21:46
396171ApplicationsnetmonUNCONFIRMEDnet-misc/iperf-2.0.5 when using -i flag, interval calculated to be negative and spews output2011-12-27 21:01:05
396353Prefix SupportnetmonUNCONFIRMEDnet-analyzer/nmap fails with LDFLAGS="-Wl,--as-needed" on sparc64-solaris2013-01-15 17:08:42
366151EbuildsnetmonUNCONFIRMEDnet-analyzer/hping: Add a suid USE flag2011-05-10 20:33:23
366159EbuildsnetmonUNCONFIRMEDnet-analyzer/hping: Patch to make hping's traceroute mode increment TTL after N retries2011-05-10 20:33:04
367375EbuildsnetmonUNCONFIRMEDnet-analyzer/ndoutils-1.4_beta9: "db/" directory from source code is not installed to system2012-02-09 10:57:19
450730Servernet-proxyUNCONFIRMEDnet-proxy/squid-3.1.22 vs net-proxy/squidclamav-6.10 vs net-proxy/c-icap-0.2.4 problems2013-01-08 12:01:38
447902Ebuildsnet-proxyUNCONFIRMEDnet-proxy/dansguardian-2.12.0.3 version bump request2012-12-21 05:38:19
417251Ebuildsnet-proxyUNCONFIRMEDnet-proxy/dansguardian init script for baselayout 2.x2012-12-12 12:36:48
425196Developmentnet-proxyUNCONFIRMEDnet-proxy/adzapper needs flush.pl (removed from dev-lang/perl-5.16.0)2012-09-30 19:55:13
437970Servernet-proxyUNCONFIRMEDnet-proxy/http-replicator-3.0-r3 - ERROR: HttpClient 1 caught an exception in __getattr__: HttpClien2012-10-11 13:53:15
442874Applicationsnet-proxyUNCONFIRMEDnet-proxy/http-replicator - local rsync server reports install flash player as wrong size2012-11-14 00:16:31
389675Applicationsnet-proxyUNCONFIRMEDnet-proxy/polipo-1.0.4.1 reports timeout for domains that are available2011-11-08 03:18:20
387001Applicationsnet-proxyUNCONFIRMEDnet-proxy/tsocks segfaults if /etc/tsocks/tsocks.conf does not exist2011-10-18 16:36:02
389419Applicationsnet-proxyUNCONFIRMEDnet-proxy/ntlmaps - add multiple configuration support2011-11-03 15:39:17
375713Applicationsnet-proxyUNCONFIRMEDnet-proxy/dante-1.3.1 can not enable "preload"2011-08-10 05:12:50
383969Applicationsnet-proxyUNCONFIRMEDnet-proxy/tsocks manpage mentions TSOCKS_CONFFILE, but the program uses TSOCKS_CONF_FILE2011-10-13 01:17:57
455816Librarynet-p2pUNCONFIRMEDnet-libs/gupnp-igd - src_prepare(): libgupnp-igd/Makefile.am:64: HAVE_INTROSPECTION does not appear 2013-02-06 13:54:26
450392Librarynet-p2pUNCONFIRMEDnet-libs/gupnp-igd-0.2.2 fails to build with USE_PYTHON="... 2.7-pypy-1.9"2013-01-05 17:56:48
449818Applicationsnet-p2pUNCONFIRMEDnet-p2p/deluge-1.3.5 with >=net-libs/rb_libtorrent-0.16 - metadata for torrents added using a magnet2013-01-03 12:09:55
446186Applicationsnet-p2pUNCONFIRMEDnet-p2p/rtorrent-0.9.2: bad configure check prevents cross-compilation2012-12-06 05:03:19
444700Applicationsnet-p2pUNCONFIRMEDnet-p2p/rtorrent-0.9.2 could not start initscript2012-12-29 14:14:37
445776Ebuildsnet-p2pUNCONFIRMEDnet-p2p/wire-1.1.3 version bump request2012-12-03 11:25:21
446184Applicationsnet-p2pUNCONFIRMEDnet-libs/libtorrent-0.13.2: fails to cross compile2012-12-06 05:02:50
439406Ebuildsnet-p2pUNCONFIRMEDnet-p2p/amule - add epatch_user support2012-10-25 01:07:21
437350Applicationsnet-p2pUNCONFIRMEDnet-p2p/deluge-1.3.5 init.d script does not apply DELUGED_OPTS2013-01-26 06:26:03
433942Applicationsnet-p2pUNCONFIRMEDnet-p2p/amule - amule fails to start when an empty ~/.aMule/statistics.dat file is present2012-09-04 15:33:37
427528Applicationsnet-p2pUNCONFIRMEDnet-p2p/deluge-1.3.3 and 1.3.5 segfaults on start2012-07-23 18:53:18
426912Librarynet-p2pUNCONFIRMEDnet-p2p/deluge unicode casting problems with net-libs/rb_torrent 0.16.x2013-01-26 06:22:29
420157Ebuildsnet-p2pUNCONFIRMED${AMULEHOME} do not work for amuled, amuleweb (net-p2p/amule-2.3.1)2013-01-14 23:46:38
408277Ebuildsnet-p2pUNCONFIRMEDnet-p2p/mldonkey-3.1.0: Add upnp USE flag2013-02-04 23:58:12
399115Ebuildsnet-p2pUNCONFIRMEDnet-p2p/rtorrent-0.8.9 - .../work/rtorrent-0.8.9/src/core/download.h:76:84: error: ‘class core::Down2012-04-08 10:10:28
401681Applicationsnet-p2pUNCONFIRMEDnet-misc/curl-7.24.0 with net-p2p/rtorrent-* leads to 100% CPU load.2013-01-01 14:36:36
445276Ebuildsnet-mailUNCONFIRMEDmail-client/alpine-2.10 - Version bump request.2013-01-22 08:16:27
450116Ebuildsnet-mailUNCONFIRMEDnet-mail/fetchyahoo-2.14.9 bump request2013-01-05 16:03:52
378413Applicationsnet-newsUNCONFIRMED[patch] net-news/yarssr-0.2.2-r1: URL Handler fails to launch correct URL in web browser2011-08-11 15:04:02
365501Applicationsnet-p2pUNCONFIRMEDnet-p2p/frostwire-4.20.9 should RDEPEND on dev-java/junit2011-07-31 12:15:23
377289Ebuildsnet-p2pUNCONFIRMEDnet-p2p/mldonkey: use bw_toggle in the init.d script to control bandwidth2011-08-02 11:24:05
388879Servernet-p2pUNCONFIRMEDnet-p2p/mldonkey-3.1.0: Exception setgid failed: Operation not permitted trying to set group_gid2011-11-21 00:31:52
392441Applicationsnet-p2pUNCONFIRMEDnet-p2p/mldonkey-3.1.0 - mlnet segfaults2012-08-15 15:57:27
394885Applicationsnet-p2pUNCONFIRMEDnet-p2p/rtorrent-0.8.9 fails to link because of missing lpthread for LIBS2011-12-16 02:48:12
425328Applicationsnet-mailUNCONFIRMEDmail-client/cone-{0.89,0.90} segfault on unsuccessful attempt of login to spop3 server2012-07-09 11:36:39
417743Developmentnet-mailUNCONFIRMEDnet-mail/mailbase lacks mailcap manpage2012-05-31 16:41:41
403459Applicationsnet-mailUNCONFIRMEDnet-mail/perdition-1.18 - options.h:42:14: error: conflicting types for ‘gdbm_version’2012-12-04 18:16:40
400609Unspecifiednet-mailUNCONFIRMEDnet-mail/perdition-1.18 - fails to build with errors because of a multi line macro in net-libs/vanes2012-12-04 18:16:40
387009Applicationsnet-mailUNCONFIRMEDnet-mail/fetchmail - modified initscript to allow multiple daemons AND inlined configuration2011-11-08 12:12:48
458162Applicationsnet-ircUNCONFIRMEDnet-irc/bopm init script failure2013-02-20 14:41:19
456796Keywording and Stabilizationnet-imUNCONFIRMEDnet-im/pyicq-t: sparc keyword request2013-02-11 17:00:43
403513Applicationsnet-ircUNCONFIRMEDThe HOMEPAGE for net-irc/tirc-1.2 is invalid2012-02-14 13:40:56
425634Applicationsnet-ircUNCONFIRMEDnet-irc/bitchx 1.2 - QA/security issues2013-01-29 13:33:05
428486Ebuildsnet-ircUNCONFIRMEDnet-irc/ngircd-19.2 version bump2012-07-29 05:08:33
449526Applicationsnet-imUNCONFIRMEDnet-im/pidgin-2.10.6 fails to compile with USE="eds" and gnome-extra/evolution-data-server-3.62013-02-12 16:15:52
453642Applicationsnet-imUNCONFIRMEDnet-im/empathy-2.34.0-r2 - accounts window fails to open2013-01-23 16:38:50
447034Applicationsnet-imUNCONFIRMEDnet-im/mcabber-0.10.2 - Doesn't build without USE+="crypt otr" - configure.ac: error: possibly undef2013-02-02 00:21:02
443890Applicationsnet-imUNCONFIRMEDnet-im/ejabberd - typo in /etc/init.d/ejabberd : EJABBERDCTL_OPT instead of EJABBERDCTL_OPTS2012-11-20 19:41:35
439550Applicationsnet-imUNCONFIRMEDx11-plugins/pidgin-otr-3.2.1 - configure: error: libotr 3.2.0 or newer is required.2012-10-25 15:42:02
410017Ebuildsnet-imUNCONFIRMEDnet-im/ejabberd - add patch for remote roster2013-01-24 10:41:29
419415Applicationsnet-imUNCONFIRMEDnet-im/pidgin: Freeze on startup2012-06-16 22:36:00
420819Applicationsnet-imUNCONFIRMEDnet-im/pidgin add support for mxit protocol2012-07-10 19:40:02
423801Applicationsnet-imUNCONFIRMEDnet-im/pidgin-2.10.4[gnutls] fails configure with net-libs/gnutls[nettle]2013-02-13 20:41:47
429802Ebuildsnet-imUNCONFIRMEDnet-im/sendxmpp-1.20 with 2012-08-04 16:43:36
432706Applicationsnet-imUNCONFIRMEDnet-im/pidgin 2.10.6 XMMP/IRC accounts do not connect automatically, "waiting for network connection2012-08-28 09:58:27
435238Applicationsnet-imUNCONFIRMEDnet-im/pidgin does not detect network connection after upgrading to net-misc/networkmanager-0.9.4.0-2012-09-17 11:35:16
409425Applicationsnet-imUNCONFIRMED>=net-im/ejabberd-2.1.0: add USE=mod_admin_extra2012-03-23 15:19:46
409555Applicationsnet-imUNCONFIRMEDnet-im/gg-transport-2.2.4 segmentation fault in local_translate (str=0x34eb52fbcac "\203=\365\377\062012-12-16 14:28:04
381279Servernet-imUNCONFIRMEDnet-im/jabberd2-2.2.4: error: XML parse error (not well-formed (invalid token)) in c2s log for some 2012-10-20 06:45:03
398961Ebuildsnet-imUNCONFIRMEDnet-im/pidgin-2.10.1: please separate dbus-python dependency into a USE-flag2013-01-01 23:11:04
399489Applicationsnet-imUNCONFIRMEDnet-im/pidgin XMPP/SASL authentication fail with >=dev-libs/cyrus-sasl-2.1.252012-02-07 20:53:55
399779Applicationsnet-imUNCONFIRMEDnet-im/pidgin flawed deps2012-06-02 18:36:38
381051Ebuildsnet-imUNCONFIRMEDnet-im/ekg version bump to 1.8rc22012-05-04 04:26:34
380889Applicationsnet-imUNCONFIRMEDnet-im/sendxmpp-1.20 does not work when dev-perl/XML-Stream-1.22 is installed (1.23 needed)2011-09-01 19:39:25
458110Applicationsnet-fsUNCONFIRMEDnet-fs/curlftpfs-0.9.2 fails with special characters in dir names2013-02-19 20:19:03
458024Applicationsnet-fsUNCONFIRMEDnet-nds/rpcbind with sys-libs/uclibc - security.c:23:26: fatal error: rpcsvc/mount.h: No such file o2013-02-20 11:38:41
453962Core systemnet-fsUNCONFIRMEDnet-fs/autofs-5.0.6-r5: umount automounted NFS share fails2013-02-16 13:31:29
440286Ebuildsnet-fsUNCONFIRMEDnet-nds/rpcbind - add support for warm restarts of rpcbind daemon2013-01-10 20:33:08
443636Core systemnet-fsUNCONFIRMEDnet-fs/davfs2-1.4.7 - User mount does not work, no entry for http://HOST/owncloud/files/webdav.php f2013-02-13 22:40:25
445288Ebuildsnet-fsUNCONFIRMEDnet-fs/nfs-utils-1.2.7 version bump2013-01-03 16:19:34
453880Applicationsnet-fsUNCONFIRMEDnet-fs/autofs-5.0.6-r5: fails to stop and to start:2013-02-16 13:22:48
453778Ebuildsnet-fsUNCONFIRMEDnet-fs/autofs - sandbox violation in `mount -s' touching /run/mount2013-02-16 13:20:27
453306Applicationsnet-fsUNCONFIRMEDnet-fs/nfs-utils-1.2.6: mount.nfs: Cannot allocate memory2013-01-31 15:57:57
434266Applicationsnet-fsUNCONFIRMEDnet-fs/davfs2-1.4.5-r1 man pages not Unicode-friendly2012-09-17 16:43:49
439660Ebuildsnet-fsUNCONFIRMEDnet-fs/nfs-utils nfsmount init script should drop need net2012-11-19 20:31:41
431252Ebuildsnet-fsUNCONFIRMEDnet-fs/nfs-utils unable to run nfs client only (nfs4), without server support in kernel2012-08-14 12:57:57
428008Core systemnet-fsUNCONFIRMEDnet-fs/nfs-utils-1.2.3-r1: Issues mapping uids and usernames between RHEL5 server and Gentoo client2012-07-25 15:56:19
414451Ebuildsnet-fsUNCONFIRMEDnet-fs/netatalk-2.2.2 USE=kerberos with app-crypt/heimdal - uams_gss.c:201:37: error: 'gss_nt_servic2012-05-03 16:05:11
413649Ebuildsnet-fsUNCONFIRMEDnet-fs/netatalk-2.2.1-r3 broken after upgrade2012-04-27 15:10:49
413173Applicationsnet-fsUNCONFIRMEDnet-fs/nfs-utils - /etc/init.d/nfs and /etc/init.d/nfsmount calculate their dependencies incorrectly2012-05-18 05:15:48
402343Servernet-fsUNCONFIRMEDnet-fs/netatalk /etc/init.d/afpd needs avahi-daemon even if called with -nozeroconf2012-04-08 21:14:32
406615Applicationsnet-fsUNCONFIRMEDnet-fs/ncpfs: HOMEPAGE and SRC_URI no longer available2012-03-02 18:26:34
424892Applicationsnet-dialupUNCONFIRMEDnet-dialup/capisuite-0.4.5-r6 fails to build with automake >= 1.12.12013-01-10 17:40:24
425332Ebuildsnet-dialupUNCONFIRMEDnet-dialup/capisuite-0.4.5 doesn't compile with python 3.* as active python interpreter2012-07-09 11:37:10
426398Applicationsnet-dialupUNCONFIRMEDnet-dialup/pptpclient - stability fixes2012-07-18 00:06:56
436122Ebuildsnet-dialupUNCONFIRMEDnet-dialup/ppp-2.4.5-r3 - Failed Patch: 80_all_eaptls-mppe-0.991-gentoo.patch !2012-11-09 04:09:40
448958Ebuildsnet-dialupUNCONFIRMEDnet-dialup/gtk-imonc description should say "GTK+ 2" not "GTK+-2"2012-12-28 14:39:28
449950Applicationsnet-dialupUNCONFIRMED=net-dialup/pptpd-1.3.4-r1 incorrect restart: no matching processes found2013-01-17 06:58:53
455470Applicationsnet-dialupUNCONFIRMEDnet-dialup/pptpclient-1.7.2-r2: applied patch hardcodes wrong ip path2013-02-04 18:47:35
455690Servernet-dialupUNCONFIRMEDnet-dialup/freeradius-2.2.0 pkg_postinstall() hint not working2013-02-07 16:30:11
399065Ebuildsnet-dialupUNCONFIRMEDnet-dialup/ppp-2.4.5 EAP-TLS patch update2012-10-20 10:26:24
399433Ebuildsnet-dialupUNCONFIRMEDnet-dialup/radiusclient-0.3.2 broken on amd642012-01-22 15:08:49
403631Applicationsnet-dialupUNCONFIRMEDnet-dialup/lrzsz-0.12.20-r3 doesn't honor LINGUAS for locale files2012-06-11 05:25:17
403633Applicationsnet-dialupUNCONFIRMEDnet-dialup/pppconfig-2.3.17-r1 doesn't honor LINGUAS for locale files2012-02-23 21:38:44
406139Applicationsnet-dialupUNCONFIRMEDnet-dialup/ppp-2.4.5-r2: /etc/resolv.conf gets emptied upon connection re-negotiation.2012-04-06 22:11:33
406579Ebuildsnet-dialupUNCONFIRMEDnet-dialup/ppp: pppoe-discovery don't work in ppp >=2.4.5 because of the patch pado-timeout.patch2012-09-23 14:15:04
407227baselayoutnet-dialupUNCONFIRMEDnet-dialup/ppp - /etc/init.d/net.ppp0 goes into endless loop after openvpn was stopped2012-04-22 20:16:25
373635Ebuildsnet-dialupUNCONFIRMEDnet-dialup/ppp: add postinst message for break compatibility with dependent packages2011-07-01 01:38:55
374667Applicationsnet-dialupUNCONFIRMEDnet-dialup/rp-pppoe fail to cross compile2011-07-10 18:06:14
384883Applicationsnet-dialupUNCONFIRMEDnet-dialup/ppp: with net-dns/openresolv /etc/ppp/ip-up.d/50-initd.sh stomps /etc/ppp/ip-up.d/40-dns.2011-10-01 02:49:50
396045Ebuildsnet-dialupUNCONFIRMEDnet-dialup/gnuradius should install startup files2011-12-26 23:56:22
397611Ebuildsnet-dialupUNCONFIRMEDnet-dialup/gnuradius increase RUT_IDSIZE2012-01-04 15:37:09
451978ApplicationsnaotaUNCONFIRMEDmedia-video/v4l2loopback-0.6.2 - Version bump to support kernel 3.72013-01-14 22:49:56
430406DocumentationneddyseagoonUNCONFIRMEDTypo on Foundation_news.xml2012-08-08 06:43:21
364941Ebuildsnet-dialupUNCONFIRMEDnet-dialup/rp-pppoe kernel-mode PPPoE support2011-04-26 19:48:13
373347Applicationsnet-dialupUNCONFIRMEDnet-dialup/radiusclient fail to cross-compile2011-07-01 19:11:18
373365Applicationsnet-dialupUNCONFIRMEDnet-dialup/radiusclient-ng fail to cross-compile2011-07-01 19:11:38
373369Applicationsnet-dialupUNCONFIRMEDnet-dialup/freeradius-client fail to cross-compile2011-07-03 16:45:23
442662Ebuildsmysql-bugsUNCONFIRMEDdev-db/mysql-connector-c++ - Output from mysql_config is parsed in in ugly way.2012-11-19 15:55:25
431000Applicationsmysql-bugsUNCONFIRMEDdev-db/mysql-5.1.62-r1 - make[1]: *** No rule to make target `../mysys/libmysys.la', needed by `fact2012-08-21 17:31:46
442346Applicationsmysql-bugsUNCONFIRMEDdev-db/mysql-5.5.28 - InnoDB: Assertion failure in thread 140230384047936 in file trx0rseg.c line 332012-11-08 22:04:30
370703Applicationsmysql-bugsUNCONFIRMEDdev-db/myodbc-5.1.6 - emerge --config fails: odbcinst: SQLWritePrivateProfileString failed with Gene2011-06-10 02:05:40
403051Applicationsmr_bones_UNCONFIRMEDmedia-gfx/gqview-2.1.5 - ld: pan-calendar.o: undefined reference to symbol 'sqrt@@GLIBC_2.0'2012-02-13 12:03:19
454460ApplicationsmozillaUNCONFIRMEDwww-client/firefox-18.0.1: undefined reference to `WebRtcAecm_WindowAndFFTNeon'2013-01-30 20:14:08
439148LibrarymozillaUNCONFIRMED{www-client/firefox,mail-clientthunderbird}-bin-{15,16},seamonkey-bin-2.13.2 with net-libs/libproxy-2013-01-22 19:39:26
434130ApplicationsmozillaUNCONFIRMEDdev-libs/nss-3.13.6 - /usr/lib/libnspr4.so: undefined reference to `__fdelt_chk'2012-09-24 16:48:11
409295ApplicationsmozillaUNCONFIRMEDmail-client/thunderbird-bin-10.0.2 - HTTP links cannot be opened - Failed to load native module at p2012-03-23 15:08:47
417525Ebuildsmobile-phoneUNCONFIRMEDapp-mobilephone/dfu-util-0.7 version bump2013-01-25 02:12:45
435674Applicationsmobile-phoneUNCONFIRMEDapp-mobilephone/gnome-phone-manager-0.68: phonemgr.c:47:2: error: too many arguments to function 'bl2012-12-18 08:29:47
386077ApplicationsmozillaUNCONFIRMED=mail-client/thunderbird-10.0.1 shows double entries in newly created address book contacts2012-07-06 07:46:22
388647Eclasses and ProfilesmozillaUNCONFIRMEDmozextension.eclass: Add new function for installing extensions in new standard install location2012-05-23 18:22:51
398113Ebuildsmobile-phoneUNCONFIRMEDapp-mobilephone/obexftp: disable unnecessary dev-lang/perl[-build] dependency2013-01-01 22:54:07
447240ApplicationsmlspamcbUNCONFIRMEDnet-misc/vde: bashisms in init.d script2012-12-20 11:13:30
391705Applicationsmobile-phoneUNCONFIRMEDapp-mobilephone/kannel-1.5.0 version bump2011-11-24 17:47:28
453338LibrarymlUNCONFIRMEDdev-ml/lablgl-1.04 - File "togl.mli", line 4, characters 14-29: Error: Unbound module Widget2013-02-01 06:27:17
391985ApplicationsmlUNCONFIRMEDnet-misc/unison-2.32.52 - /usr/bin/ocamlopt: don't know what to do with /usr/lib64.2012-06-07 08:32:01
414975ApplicationsmlUNCONFIRMEDnet-misc/unison-2.32.52 - hangs during file transfer2012-06-06 17:00:16
445055ApplicationsmlUNCONFIRMEDnet-misc/unison-2.40.102 version bump2012-11-28 15:44:46
456352New Servermirror-adminUNCONFIRMEDnew full mirror (Europe - Czech Republic - Prague)2013-02-09 21:13:53
457122New Servermirror-adminUNCONFIRMEDNew (full+rsync) mirror in Czech Republic2013-02-13 16:30:52
379499ApplicationsmlUNCONFIRMEDnet-misc/unison-2.27.57-r1 stack smashing detected2011-08-19 00:43:25
443958Server Problemmirror-adminUNCONFIRMEDrsync.nl.gentoo.org / 195.241.77.98 (tiscali) often reports "@ERROR: max connections (15) reached --2012-11-19 21:19:27
444310New Servermirror-adminUNCONFIRMEDNew Full mirror has been configured.2012-11-27 17:40:36
447120Server Problemmirror-adminUNCONFIRMEDrsync://mirrors.eu.kernel.org/gentoo-portage/ out of sync2012-12-13 15:39:56
439360New Servermirror-adminUNCONFIRMEDNew server in China2012-10-23 04:46:24
435162New Servermirror-adminUNCONFIRMED[full+rsync] New mirror: University of Nebraska at Omaha, College of IS&T (US)2012-09-15 20:30:25
426850New Servermirror-adminUNCONFIRMEDPlease add new rsync server.2012-07-16 15:06:40
435142New Servermirror-adminUNCONFIRMEDNew mirror ftp.plusline.de2012-09-15 18:11:35
457702ApplicationsmgornyUNCONFIRMEDeclean-kernel doesn't work w/ grub2 when /boot is FAT2013-02-20 20:51:05
427536Core systemmipsUNCONFIRMEDMIPS Kernel has a Direct IO bug2012-10-21 00:59:15
428582ApplicationsmichaelUNCONFIRMEDnet-dns/djbdns-1.05-r26: djbdns-setup should source /etc/init.d/functions.sh2013-01-06 09:35:05
409415Eclasses and ProfilesmgornyUNCONFIRMEDgit-2.eclass fails to clone bare repository into working directory using specific EGIT_REPO_URI2012-04-03 10:30:48
455048Eclasses and ProfilesmgornyUNCONFIRMED[git-2.eclass] Add support for submodules in non-bare clones.2013-02-02 21:35:22
455058Applicationsmedia-videoUNCONFIRMEDmedia-video/gxine with dev-lang/spidermonkey-1.8.8 - build fails to find mozjs2013-02-05 11:27:23
454568Librarymedia-videoUNCONFIRMEDmedia-libs/mlt-0.8.8 - luma.c:92:11: erreur interne du compilateur: dans build2_stat, à tree.c:38032013-02-01 10:14:17
452048Applicationsmedia-videoUNCONFIRMEDmedia-video/vlc-2.0.5 - drop dependency on smbclient use-flag for >=net-fs/samba-4.0.02013-02-18 07:03:10
449372Applicationsmedia-videoUNCONFIRMEDnet-misc/mediatomb - broken Samsung 2012 TV send an invalid request2013-01-24 20:18:11
445544Applicationsmedia-videoUNCONFIRMEDmedia-video/dvdstyler-2.3.4 - Fails to generate iso, consider to hard-mask this version.2012-12-03 05:50:21
446552Applicationsmedia-videoUNCONFIRMEDnet-misc/mediatomb-0.12.1-r1 - Mediatomb launches the transcoder twice for a given file.2012-12-09 08:28:14
437704Applicationsmedia-videoUNCONFIRMEDmedia-video/gpac-0.4.5-r5: wxOsmo4.o: undefined reference to symbol 'gtk_widget_get_parent_window'2012-10-09 15:40:38
418037Applicationsmedia-videoUNCONFIRMEDmedia-video/subtitlecomposer-0.5.3 USE=xine fails due to underlinking: ld: CMakeFiles/subtitlecompos2012-05-29 00:01:02
433375Applicationsmedia-videoUNCONFIRMEDmedia-video/cinelerra ignores LDFLAGS, causing multilib compile failure2012-11-20 12:23:36
411443Applicationsmedia-videoUNCONFIRMEDmedia-libs/libcaca-0.99_beta18 - java-pkg_newjar java/libjava.jar fails2012-12-30 03:36:17
405813Ebuildsmedia-videoUNCONFIRMEDmedia-libs/libvpx-1.0.0 USE=ssse3 - x86_systemdependent.c:(.text+0x263): undefined reference to `vp82013-01-15 22:37:22
405173Applicationsmedia-videoUNCONFIRMEDmedia-video/vlc-2.0.0 - /bin/sh: line 4: 2215 Segmentation fault ./vlc-cache-gen ../modules2012-09-19 13:09:28
384313Applicationsmedia-videoUNCONFIRMEDmedia-video/vlc vlc-cache-gen Segmentation fault on hardened system2012-09-19 13:08:49
383295Librarymedia-videoUNCONFIRMEDmedia-libs/libdc1394-2.1.3-r1 fails to link (undefined references to yuy2_to_yv16 and yuy2_to_yv12)2011-10-05 09:12:28
370587Applicationsmedia-videoUNCONFIRMEDmedia-video/vlc-1.1.9: vlc won't play files from ssh folder connected through gnome "Places" menu2012-09-19 13:08:20
413987Ebuildsmedia-tvUNCONFIRMEDmedia-tv/xawtv with --as-needed drops libm link2012-04-29 18:01:29
436708Ebuildsmedia-tvUNCONFIRMEDmedia-tv/xawtv-3.95-r2 - v4lctl: dlopen: /usr/lib64/xawtv/flt-disor.so: undefined symbol: atanf / po2013-02-15 14:53:00
410427Applicationsmedia-tvUNCONFIRMEDmedia-tv/freevo-1.9.0 needs dev-python/gdata for the youtube plugin2012-04-02 02:30:30
403389Applicationsmedia-tvUNCONFIRMEDmedia-tv/tvtime-1.0.2_p20110131-r3 configure error - configure: error: asound needed2012-07-09 14:32:00
446142EbuildsmattschUNCONFIRMEDnet-misc/openconnect-4.07 - after 30 minutes the VPN reconnects but only has a partially working con2013-01-09 13:33:21
384199Ebuildsmedia-opticalUNCONFIRMEDapp-cdr/qpxtool new version2011-09-23 15:02:23
433708ApplicationsmattmUNCONFIRMEDnet-analyzer/zabbix-2.0.2-r1: Makefiles are erroneously installed in /usr/share/zabbix2012-09-03 17:12:18
430894Core systemmattmUNCONFIRMEDsys-power/apcupsd-3.14.10-r1[snmp] fails to build with latest net-snmp2013-02-02 23:16:04
430690EbuildsmattmUNCONFIRMEDnet-libs/wt-3.2.2 - Aborting due to QA concerns: 4 files installed in /tmp/portage/net-libs/wt-3.2.22012-09-17 06:33:36
413681ServermattmUNCONFIRMEDnet-misc/hylafaxplus - connection refused from another machine2012-05-01 22:55:07
444936ApplicationsmatsuuUNCONFIRMEDwww-apps/redmine creates keepdir /var/run/redmine2012-12-10 13:49:46
453966ApplicationsmatsuuUNCONFIRMEDwww-apps/redmine-2.2.0 should depend on dev-ruby/fastercsv2013-01-30 10:10:19
454750UnspecifiedmaqUNCONFIRMEDnet-libs/libupnp-1.6.18 should not depend on sys-devel/automake-1.92013-01-31 04:08:04
458282Servermarko.durkovicUNCONFIRMEDnet-im/jabberd2-2.2.14 - dodoc: tools/migrate.pl does not exist2013-02-20 16:17:20
413779ApplicationsmatsuuUNCONFIRMEDwww-apps/redmine-1.4.1 without dev-ruby/ruby-net-ldap - ?2012-10-06 16:51:25
457546Ebuildsmaintainer-wantedUNCONFIRMEDNew ebuild: dev-db/torndb-0.1 - A lightweight wrapper around MySQLdb. Originally part of the Tornado2013-02-14 15:34:22
456698Ebuildsmaintainer-wantedUNCONFIRMED[ebuild] net-proxy/c-icap-modules new ebuild2013-02-11 17:28:54
455198Ebuildsmaintainer-wantedUNCONFIRMEDNew ebuild: media-gfx/ACBFViewer-0.95 - Advanced Comic Book Format Viewer2013-02-03 01:06:39
454744Ebuildsmaintainer-wantedUNCONFIRMEDnet-dns/validns should depend on new package dev-perl/Test-Command-Simple for src_test()2013-01-31 16:22:52
454724Ebuildsmaintainer-wantedUNCONFIRMEDnet-analyzer/tallow - Block hosts that attempt to bruteforce SSH using the journald API2013-01-30 19:39:56
452916Servermaintainer-wantedUNCONFIRMEDnet-misc/stargazer - Stargazer billing system for small home and office networks.2013-02-03 16:39:33
454582Ebuildsmaintainer-wantedUNCONFIRMEDnet-fs/davenport - an SMB WebDAV front end for SAMBA2013-01-29 22:57:35
454396Ebuildsmaintainer-wantedUNCONFIRMEDNew ebuild: gnome-extra/proxy_applet-0.2 - GNOME applet for changing network proxy configuration fro2013-01-28 08:58:55
454346Ebuildsmaintainer-wantedUNCONFIRMEDEbuild request: app-misc/elasticsearch - Open Source, Distributed, RESTful, Search Engine2013-01-28 18:47:24
453476Ebuildsmaintainer-wantedUNCONFIRMEDgameandwatch-0.3.ebuild - This is a generic engine for simulation of Game & Watch-like games2013-01-23 03:24:22
452850Ebuildsmaintainer-wantedUNCONFIRMEDwww-apps/snorby - Ruby on Rails application for network security monitoring2013-01-18 17:12:00
450440Core systemmaintainer-wantedUNCONFIRMEDnet-fs/xtreemfs - XtreemFS is a fault-tolerant distributed file system for all storage needs2013-01-07 02:42:31
450068Ebuildsmaintainer-wantedUNCONFIRMEDsys-apps/evemu - Tools and bindings for kernel input event device emulation, data capture and replay2013-01-03 23:06:27
447920Ebuildsmaintainer-wantedUNCONFIRMEDnet-analyzer/check_mk - Nagios / Icinga general purpose plugin to retrieve data2013-01-11 16:04:32
448016Ebuildsmaintainer-wantedUNCONFIRMEDapp-misc/hardening-wrapper - New package. - Compiler wrapper to enable security hardening flags2012-12-26 21:51:22
449034Ebuildsmaintainer-wantedUNCONFIRMEDNew package: app-backup/insync-bin-0.9.32 - Advanced cross-platform Google Drive client2012-12-28 14:36:13
448400Librarymaintainer-wantedUNCONFIRMEDdev-php/PEAR-Image_Barcode2 - generate barcode representations of given strings2012-12-24 16:11:53
447266Ebuildsmaintainer-wantedUNCONFIRMED=app-text/ghostpdl-9.06 - New package. - GhostPCL, GhostXPS, Ghostscript and GhostPDF Interpreters2012-12-14 23:49:32
447288Ebuildsmaintainer-wantedUNCONFIRMED=dev-db/sqlncli-11.0.1790.0 - New package. - Microsoft® SQL Server® ODBC Driver 1.0 for Linux2013-02-19 20:07:16
447222Applicationsmaintainer-wantedUNCONFIRMEDAdd standalone xulrunner for MonoDevelop.2013-01-15 08:03:00
446974Ebuildsmaintainer-wantedUNCONFIRMEDdev-libs/libpreludedb, app-admin/prelude-manager, net-analyzer/prewikka resurrection request2012-12-27 21:31:08
446192Ebuildsmaintainer-wantedUNCONFIRMEDdev-python/python-eventlib-0.1.1 - Coroutine-based networking library2012-12-06 08:27:46
445990Ebuildsmaintainer-wantedUNCONFIRMEDsys-apps/apt - Debian commandline package manager2012-12-05 04:14:13
445724Ebuildsmaintainer-wantedUNCONFIRMEDnet-p2p/armory - New package. - Full-featured Bitcoin client, offering a dozen innovative features..2012-12-04 14:45:46
445928Ebuildsmaintainer-wantedUNCONFIRMEDnet-misc/amazon-glacier-cmd-interface - New package. - Command line interface for Amazon Glacier.2012-12-04 15:38:06
445548Ebuildsmaintainer-wantedUNCONFIRMEDnet-analyzer/tespeed - New package. - Terminal network speed test that uses servers from Speedtest.n2012-12-04 09:31:07
445614Ebuildsmaintainer-wantedUNCONFIRMEDapp-editors/retext - New package. - Qt-based text-editor for Markdown written in Python2013-01-02 12:40:40
445298Ebuildsmaintainer-wantedUNCONFIRMEDapp-admin/kpcli-1.6.ebuild (New Package)2012-11-30 16:04:02
445106Eclasses and Profilesmaintainer-wantedUNCONFIRMEDxmlcatalog.eclass needed for managing xml catalogs in packages2012-11-29 19:33:23
445280Ebuildsmaintainer-wantedUNCONFIRMEDmedia-libs/avbin-bin - New package. - AVbin is a binary release of a cross-platform, thin wrapper ar2012-12-09 09:27:38
445296Ebuildsmaintainer-wantedUNCONFIRMEDdev-perl/File-KeePass-2.30.0.ebuild (New Package)2012-12-01 13:41:12
442516Ebuildsmaintainer-wantedUNCONFIRMEDnet-p2p/uhub-0.4.1 (New submission)2012-11-11 16:16:55
443456Ebuildsmaintainer-wantedUNCONFIRMEDNew ebuild: media-sound/oom an OpenOctave MIDI & audio sequencer2012-11-15 21:08:06
444118Ebuildsmaintainer-wantedUNCONFIRMEDnet-irc/communi - A cross-platform IRC framework written in Qt 42013-01-17 08:39:58
442342Ebuildsmaintainer-wantedUNCONFIRMEDdev-perl/Data-Diver - Simple, ad-hoc access to elements of deeply nested structures2012-12-27 11:11:38
439462Ebuildsmaintainer-wantedUNCONFIRMEDnet-nntp/spotweb - a webbased usenet binary resource indexer based on the protocol and development d2013-01-23 03:27:27
439600Ebuildsmaintainer-wantedUNCONFIRMEDnet-print/cque - drivers and PPD files of CANON printers (CLC, ColorPASS, imagePASS, imagePRESS, ima2013-01-16 08:57:19
438236Ebuildsmaintainer-wantedUNCONFIRMEDsys-kernel/xenomai-sources and sys-libs/xenomai-libs - a real-time development framework cooperating2012-10-19 15:32:10
436726Ebuildsmaintainer-wantedUNCONFIRMEDnew ebuild: dev-vcs/git-up2012-10-01 05:11:05
436920Ebuildsmaintainer-wantedUNCONFIRMEDsci-electronics/smartsim: new ebuild2012-10-03 05:26:27
436976Applicationsmaintainer-wantedUNCONFIRMEDnet-mail/geary - A lightweight email program designed around conversations and built for the GNOME d2012-10-08 16:10:46
437634Ebuildsmaintainer-wantedUNCONFIRMEDnet-dialup/qst - QT-based serial terminal program2012-10-09 06:34:10
436242Ebuildsmaintainer-wantedUNCONFIRMEDNew Package: net-libs/aslookup2012-09-26 11:52:02
436278Librarymaintainer-wantedUNCONFIRMEDnet-analyzer/nagios-afs-monitor - Nagios plugins to monitor openafs server status2012-09-26 13:37:17
435712Ebuildsmaintainer-wantedUNCONFIRMEDnet-nntp/es-f-2.6.0 - web based HTML frontend for esniper, a lightweight console application for sni2013-01-23 03:27:50
435150Ebuildsmaintainer-wantedUNCONFIRMEDsci-electronics/bitscope-meter - a frequency and voltage meter designed for use with the BitScope PC2012-09-16 15:53:47
435328Ebuildsmaintainer-wantedUNCONFIRMEDdev-db/mysql-udf-preg (New Package)2012-09-17 18:04:23
435146Ebuildsmaintainer-wantedUNCONFIRMEDsci-electronics/bitscope-chart - a frequency and voltage logger designed for use with the BitScope P2012-09-16 15:52:10
435148Ebuildsmaintainer-wantedUNCONFIRMEDsci-electronics/bitscope-logic - a logic analyzer designed for use with the BitScope PC oscilloscope2012-09-16 15:53:01
435558Applicationsmaintainer-wantedUNCONFIRMEDnet-analyzer/graphite - Enterprise scalable realtime graphing2013-02-12 17:05:51
434592Ebuildsmaintainer-wantedUNCONFIRMEDnet-misc/bubbleupnpserver - extends your existing UPnP AV Media Servers and Media Renderers on your 2012-09-11 14:16:40
433060Ebuildsmaintainer-wantedUNCONFIRMED[science overlay] sci-physics/herwig++ - High-Energy Physics event generator2013-02-08 01:03:07
431976Core systemmaintainer-wantedUNCONFIRMEDnet-fs/pup-volume-monitor - another disk mounter2012-08-20 12:03:46
431842Ebuildsmaintainer-wantedUNCONFIRMEDmedia-sound/lyvi - A simple command-line lyrics viewer for various audio players2012-08-18 16:10:35
431804Ebuildsmaintainer-wantedUNCONFIRMEDapp-text/pelican-3.0 - A tool to generate a static blog, with restructured text (or markdown) input 2012-08-18 15:39:10
431742Gamesmaintainer-wantedUNCONFIRMEDgames-misc/limbo - a puzzle platform video game (wine)2012-08-20 13:17:08
431488Ebuildsmaintainer-wantedUNCONFIRMEDnet-wireless/bluez-tools - Command line tools for Bluez2013-01-17 00:16:17
427770Ebuildsmaintainer-wantedUNCONFIRMEDNew: dev-python/django-publisher-0.0.3 - Django external publishing app2012-12-13 07:01:05
428158Ebuildsmaintainer-wantedUNCONFIRMEDnet-wireless/mbm-gpsd; net-wireless/mbm-gps-control new ebuilds2012-07-30 07:31:23
428798Ebuildsmaintainer-wantedUNCONFIRMEDNew ebuild: dev-perl/Mozilla-CA (biber dependency)2012-10-05 18:58:57
430928Ebuildsmaintainer-wantedUNCONFIRMEDnet-wireless/rtl8712-firmware: new ebuild2012-08-11 18:57:10
431358Ebuildsmaintainer-wantedUNCONFIRMEDdev-util/lttng-modules - lttng kernel modules2012-08-14 12:55:20
427728Ebuildsmaintainer-wantedUNCONFIRMEDNew: dev-python/django-classy-tags-0.3.4.1 - Class based template tags for Django2012-12-12 11:41:28
427730Ebuildsmaintainer-wantedUNCONFIRMEDNew: dev-python/django-mptt-0.4.2 - Utilities for implementing a modified pre-order traversal tree i2012-12-12 11:46:23
427734Ebuildsmaintainer-wantedUNCONFIRMEDNew: dev-python/django-sekizai-0.4.2 - Django Template Blocks with extra functionality2012-12-12 11:51:41
427738Ebuildsmaintainer-wantedUNCONFIRMEDNew: dev-python/django-cms-2.3 - A Django application for managing hierarchical pages of content2012-12-12 12:04:20
427762Ebuildsmaintainer-wantedUNCONFIRMEDNew: dev-python/django-grappelli-2.4.0 - A grid-based alternative/extension to the Django administra2012-07-24 14:52:05
427764Ebuildsmaintainer-wantedUNCONFIRMEDNew: dev-python/django-filebrowser-3.5.0 - File management in the Django admin interface2012-12-13 06:57:02
427334Ebuildsmaintainer-wantedUNCONFIRMEDmail-client/mutt-kz - a fork of mutt with added support for net-mail/notmuch2012-08-03 06:29:47
426758Ebuildsmaintainer-wantedUNCONFIRMEDluasql-2.3.0.ebuild (New Package)2012-07-16 17:45:02
426926Ebuildsmaintainer-wantedUNCONFIRMEDsys-kernel/mkinitramfs-ll-{0.10.8,9999}: consider adding this ebuild to the tree2012-07-30 15:04:36
426598Ebuildsmaintainer-wantedUNCONFIRMEDsys-boo/gummiboot-9999: new package2012-11-25 04:17:40
425202Ebuildsmaintainer-wantedUNCONFIRMEDx11-plugins/torchat - Pidgin plugin for p2p instant messaging through Tor hidden service tunnels2012-07-08 14:10:34
424832Ebuildsmaintainer-wantedUNCONFIRMEDmedia-sound?/headphones - Automatic music downloader for SABnzbd2013-01-23 03:28:15
424830Ebuildsmaintainer-wantedUNCONFIRMEDnet-p2p/couchpotatoserver - an automatic NZB and torrent downloader2012-10-07 03:34:59
424421Ebuildsmaintainer-wantedUNCONFIRMEDapp-text/xfardic: New ebuild2012-07-03 12:33:19
424818Ebuildsmaintainer-wantedUNCONFIRMEDnet-nntp/moviegrabber - a fully automated way of downloading movies from usenet2012-11-29 03:18:46
424191Gamesmaintainer-wantedUNCONFIRMEDgames-strategy/vcmi-data-0.89 - Data files for the turn based strategy game HOMM3 clone VCMI2013-01-28 21:27:50
424193Gamesmaintainer-wantedUNCONFIRMEDgames-strategy/vcmi-0.89.ebuild - a free HOMM 3 clone2013-01-28 21:26:51
421163Ebuildsmaintainer-wantedUNCONFIRMEDnew ebuild dev-java/javasqlite-201202092012-06-16 11:48:09
422883Ebuildsmaintainer-wantedUNCONFIRMEDnet-misc/phonesim-1.17 new ebuild2012-06-22 07:42:37
423405Gamesmaintainer-wantedUNCONFIRMEDM64Py (new ebuild)2012-06-26 10:59:38
424003Ebuildsmaintainer-wantedUNCONFIRMED[science overlay] sci-physics/thepeg - Toolkit for High Energy Physics Event Generation2013-02-08 01:02:18
421007Ebuildsmaintainer-wantedUNCONFIRMEDnet-misc/xupnpd - Light DLNA Media Server2012-06-13 19:03:02
420627Ebuildsmaintainer-wantedUNCONFIRMEDgames-strategy/multiwinia - new ebuild2012-06-11 07:42:45
420013Ebuildsmaintainer-wantedUNCONFIRMEDnet-dns/ndjbdns - djbdns without daemontools2012-09-17 08:34:43
419599Ebuildsmaintainer-wantedUNCONFIRMEDdev-libs/folly - Newly open-sourced C++ library from Facebook Engineering2012-06-04 10:42:01
419533Ebuildsmaintainer-wantedUNCONFIRMEDdev-java/sbt-bin (new package) a build tool for Scala2012-06-03 22:14:43
418211Ebuildsmaintainer-wantedUNCONFIRMEDsys-process/xjobs - reads job descriptions line by line and executes them in parallel2012-06-01 14:23:50
418195Ebuildsmaintainer-wantedUNCONFIRMEDsci-misc/hets - the Heterogeneous Tool Set, a parsing, static analysis and proof management tool2012-05-30 12:49:44
416355Ebuildsmaintainer-wantedUNCONFIRMEDkde-misc/kimtoy - an input method frontend for kde, alternative to kimpanel2012-05-29 03:54:14
415531Core systemmaintainer-wantedUNCONFIRMEDsys-kernel/uksm-sources - Full Linux sources including the Gentoo patchset and UKSM patch2012-05-13 02:28:39
415711Ebuildsmaintainer-wantedUNCONFIRMEDNew ebuild: x11-themes/kawoken-1.22012-09-24 09:34:44
415739Ebuildsmaintainer-wantedUNCONFIRMEDNew ebuild: x11-themes/awoken-2.42012-09-24 09:39:18
414699Ebuildsmaintainer-wantedUNCONFIRMEDnet-misc/mysecureshell-1.25 - an openssh based SFTP server2012-05-05 16:42:27
415029Applicationsmaintainer-wantedUNCONFIRMEDapp-misc/doublecmd - Double Commander is a cross platform open source file manager with two panels s2012-08-09 06:24:21
415443Ebuildsmaintainer-wantedUNCONFIRMEDnet-fs/junglediskworkgroup-3.16 - Networked storage/backup using Amazon's S3 service2012-07-28 23:06:49
412041Ebuildsmaintainer-wantedUNCONFIRMEDmedia-sound/mudita24-1.0.3 - an application controlling the digital mixer, channel gains and other h2012-04-16 10:43:36
412149Ebuildsmaintainer-wantedUNCONFIRMEDnew ebuild: x11-plugins/pidgin-window_merge2012-04-29 18:28:01
412493Ebuildsmaintainer-wantedUNCONFIRMEDmedia-tv/mumudvb - (Multi Multicast DVB) is a program for streaming TV over a network originally bas2012-04-18 17:40:58
413389Ebuildsmaintainer-wantedUNCONFIRMEDmedia-fonts/prosto-1 - New font for project of free fonts www.jovanny.ru / / Font has multilanguage 2012-04-24 19:51:59
414423Ebuildsmaintainer-wantedUNCONFIRMEDapp-antivirus/maldet-1.4.1 - Linux Malware Detect (LMD) is a malware scanner for Linux2012-08-21 13:50:57
411515Ebuildsmaintainer-wantedUNCONFIRMEDdev-util/peg - tools for generating recursive-descent parsers.2012-06-30 09:24:16
411087Core systemmaintainer-wantedUNCONFIRMEDsys-fs/ddumbfs-1.0.11 - An inline data deduplicating filesystem designed with backup in mind2012-04-07 14:35:41
410713Ebuildsmaintainer-wantedUNCONFIRMEDdev-db/cppdb - an SQL connectivity library for platform and database independent connectivity2012-06-28 17:50:44
410207Ebuildsmaintainer-wantedUNCONFIRMEDnet-analyzer/inssider - inSSIDer Wi-Fi scanner2012-10-24 20:24:38
410327Ebuildsmaintainer-wantedUNCONFIRMEDsys-power/powerpanel - Software for CyberPower Systems UPS devices2012-04-02 01:53:22
410337Ebuildsmaintainer-wantedUNCONFIRMEDnew ebuild: dev-libs/libuv2012-12-20 09:45:48
410339Ebuildsmaintainer-wantedUNCONFIRMEDnew ebuild: net-libs/http-parser2012-12-20 09:45:17
409915Ebuildsmaintainer-wantedUNCONFIRMEDx11-themes/dmz-cursor-theme-0.4.3 - Style neutral, scalable cursor theme2012-03-28 00:20:23
410079Ebuildsmaintainer-wantedUNCONFIRMEDnew ebuild: app-office/pyroom2012-03-29 01:31:21
410083Ebuildsmaintainer-wantedUNCONFIRMEDnew ebuilds: x11-misc/spacefm-plugins x11-misc/spacefm-cdemu-plugin x11-misc/spacefm-trash-plugin x12012-03-31 18:20:44
408419Ebuildsmaintainer-wantedUNCONFIRMEDdev-ml/typerex-1.0.1 - An OCaml development environment for emacs (new package)2012-03-16 19:24:58
409759Ebuildsmaintainer-wantedUNCONFIRMEDx11-themes/gtk-engines-clearlooks-compact-1.5 - Theme for Clearlooks GTK+ engine, optimized for smal2012-07-12 11:32:18
408215Ebuildsmaintainer-wantedUNCONFIRMEDdev-util/line_profiler-1.0_beta3: Profile individual lines (not only function calls) of python sourc2012-03-15 01:28:00
408037Ebuildsmaintainer-wantedUNCONFIRMEDNew ebuild: net-mail/maildirarc - Maildirarc is a tool for archiving a given set of Maildir folders2012-03-13 16:00:30
408013Ebuildsmaintainer-wantedUNCONFIRMEDdev-python/netzob - Network protocol modelization by reverse engineering2012-05-09 15:21:42
407471Applicationsmaintainer-wantedUNCONFIRMEDsys-cluster/blcr: a checkpoint and restart kernel support2012-03-09 15:14:37
402211Applicationsmaintainer-wantedUNCONFIRMEDapp-misc/freeplane (app-misc/freemind replacement) - software to support thinking, sharing informati2012-10-16 14:54:19
402431Ebuildsmaintainer-wantedUNCONFIRMEDnet-analyzer/dirb-2.0.3 - a Web Content Scanner2012-02-06 21:00:14
402627Ebuildsmaintainer-wantedUNCONFIRMEDnet-mail/iredmail ebuild request2012-02-08 06:54:28
402767Ebuildsmaintainer-wantedUNCONFIRMEDagner - a rebar-friendly Erlang package index and package manager inspired by Clojars and Homebrew2012-03-09 08:30:12
404143Ebuildsmaintainer-wantedUNCONFIRMEDapp-misc/kirikoo-upload-0.5.1 - CLI script for uploading images to http://kirikoo.net (French)2012-02-16 21:00:50
404273Ebuildsmaintainer-wantedUNCONFIRMEDx11-misc/dunst-9999 - (new ebuild) lightweight notification system with the looks of dmenu2012-07-02 10:02:30
404477Ebuildsmaintainer-wantedUNCONFIRMEDNew Ebuild: x11-misc/unagi-0.3 Unagi Compositing Manager2012-02-22 05:09:14
405407Ebuildsmaintainer-wantedUNCONFIRMEDwww-misc/ppastats - a command line tool which retrieve statistics of a PPA and generates HTML pages.2012-02-23 22:08:20
405643Ebuildsmaintainer-wantedUNCONFIRMEDapp-misc/stackapplet-1.5.1 - a small application that uses the new AppIndicator framework to display2012-02-26 17:22:22
405847Ebuildsmaintainer-wantedUNCONFIRMEDmail-client/ner-9999 - Notmuch based email client (currently read-only)2012-02-27 01:05:27
405945Ebuildsmaintainer-wantedUNCONFIRMEDNew ebuild: app-misc/pycarddav - a simple way of accessing a CardDAV resource, mainly for use with m2012-10-14 18:19:44
406673Ebuildsmaintainer-wantedUNCONFIRMEDnew ebuild: x11-misc/ideskconfig2012-03-06 19:23:59
402067Ebuildsmaintainer-wantedUNCONFIRMEDdev-utils/statifier - creates one file from dynamically linked executables and all its libraries2012-04-09 15:46:20
401409Ebuildsmaintainer-wantedUNCONFIRMEDsys-auth/oath-toolkit - Toolkit for using one-time password authentication with HOTP/TOTP algorithms2012-02-01 20:03:54
401073Ebuildsmaintainer-wantedUNCONFIRMEDnet-wireless/b43-openfwwf - Open FirmWare for WiFi networks2012-01-28 16:34:42
400997Ebuildsmaintainer-wantedUNCONFIRMEDnet-analyzer/httest - Http Test Tool2012-10-25 13:52:31
399869Ebuildsmaintainer-wantedUNCONFIRMEDmedia-gfx/brscan4 media-gfx/brother-skan-key-tool - Brothers brscan4 scanner driver2012-01-25 13:40:02
396383Ebuildsmaintainer-wantedUNCONFIRMED[sunrise] app-office/writerscafe (new ebuild)2012-01-11 18:13:18
396411Ebuildsmaintainer-wantedUNCONFIRMEDsys-apps/ataidle ( New package )2011-12-29 14:37:43
396557Ebuildsmaintainer-wantedUNCONFIRMEDsys-power/upsmon-usb (new package)2011-12-31 09:27:47
396725Ebuildsmaintainer-wantedUNCONFIRMEDsikuli-1.0_rc3.ebuild (New package)2012-07-02 18:33:41
398115Ebuildsmaintainer-wantedUNCONFIRMEDNew ebuild for net-irc/xchat-randex2012-01-10 00:58:13
398183Ebuildsmaintainer-wantedUNCONFIRMEDOooFBTools-2.1.1 (new package )2012-05-09 16:37:19
398731Ebuildsmaintainer-wantedUNCONFIRMEDnet-analyzer/slowhttptest-1.3.ebuild Application Layer DoS attack simulator2012-01-13 14:35:35
399009Ebuildsmaintainer-wantedUNCONFIRMEDnet-im/myagent-im - Instant messenger that implements Mail.ru protocol2012-01-17 03:58:52
399003Ebuildsmaintainer-wantedUNCONFIRMEDNew Ebuild: sci-electronics/cdmm-0.3 - a console program to read data from RS232 Digital MultiMeters2012-01-18 17:43:32
398733Ebuildsmaintainer-wantedUNCONFIRMEDnet-fs/unfs3-0.9.22 A portable user-space implementation of the NFSv3 server specification2012-01-15 19:29:12
396151Ebuildsmaintainer-wantedUNCONFIRMEDx11-misc/xinequery-0.3 - utility to view information regarding active Xinerama screens2012-01-06 21:16:00
396131Ebuildsmaintainer-wantedUNCONFIRMEDEbuild Request: sys-apps/tuned2011-12-26 22:41:41
396033Ebuildsmaintainer-wantedUNCONFIRMEDfreeocl-0.1.0 (new package)2011-12-26 11:57:24
396007Ebuildsmaintainer-wantedUNCONFIRMEDapp-admin/cpu-g-0.9.0 : New package2012-01-13 09:40:27
395887Ebuildsmaintainer-wantedUNCONFIRMEDgames-puzzle/nightsky ( New package )2012-06-11 05:17:19
395417Ebuildsmaintainer-wantedUNCONFIRMED[sunrise] x11-misc/obmenugen-0.5_p72 (new package)2012-01-11 18:10:50
395595Ebuildsmaintainer-wantedUNCONFIRMEDvolnoti-0.1.ebuild (New package)2011-12-21 22:48:27
395171Ebuildsmaintainer-wantedUNCONFIRMEDNew ebuild for roccat-tools2012-12-12 00:33:36
395069Ebuildsmaintainer-wantedUNCONFIRMEDx11-misc/qtpanel ebuild - Yet another desktop panel written in Qt2011-12-19 17:06:11
394761Ebuildsmaintainer-wantedUNCONFIRMEDnew ebuild: net-print/gnome-manual-duplex2012-04-06 10:37:09
393275Ebuildsmaintainer-wantedUNCONFIRMEDdev-php/phpqrcode-1.1.4 - Generate QR Code 2-dimensional barcode with PHP2011-12-05 20:22:15
392975Ebuildsmaintainer-wantedUNCONFIRMED[science overlay] sci-mathematics/pulp - a Python wrapper for linear programming solvers2011-12-04 05:05:24
392737Ebuildsmaintainer-wantedUNCONFIRMEDnet-misc/turpial-1.6.6 - Lightweigth and featurefull microblogging client2012-10-03 15:56:13
392417Ebuildsmaintainer-wantedUNCONFIRMEDNew package: dmt-ux-0.178.ebuild2011-11-29 16:51:06
392473Ebuildsmaintainer-wantedUNCONFIRMED[new ebuild] PyBrain 0.3.12011-11-29 22:49:34
390957Ebuildsmaintainer-wantedUNCONFIRMEDdev-util/numdiff: new package2012-05-24 07:28:44
390967Ebuildsmaintainer-wantedUNCONFIRMEDnew ebuild arename-4.02011-11-19 00:09:40
391057Ebuildsmaintainer-wantedUNCONFIRMEDnet-misc/neubot-0.4.4 (new package)2011-11-22 01:00:52
392191Ebuildsmaintainer-wantedUNCONFIRMEDmedia-libs/unicap ( New package )2011-11-27 12:57:04
392253Ebuildsmaintainer-wantedUNCONFIRMEDx11-misc/neap ( new package )2011-12-30 21:11:19
392271Ebuildsmaintainer-wantedUNCONFIRMEDbup : ( new package )2012-02-14 05:15:47
390561Applicationsmaintainer-wantedUNCONFIRMEDapp-admin[?]/dmapd - Serve DAAP (iTunes) and DPAP (iPhoto) shares from Linux2011-11-15 15:39:23
390225Core systemmaintainer-wantedUNCONFIRMEDAll kernels missing cbfw_fc.bin file.2011-11-13 04:58:26
389873Applicationsmaintainer-wantedUNCONFIRMEDnet-mail/mb2md - convert mbox to maildir2011-11-08 21:32:58
389837Ebuildsmaintainer-wantedUNCONFIRMEDebuild request x86_energy_perf_policy(8)2011-11-08 21:27:01
389055Ebuildsmaintainer-wantedUNCONFIRMEDapp-admin/gpw - Trigraph Password Generator2011-11-13 06:59:34
389151Ebuildsmaintainer-wantedUNCONFIRMEDnet-misc/justwifiindicator-0.1 - Simple WiFi signal strength tray indicator2011-11-20 12:10:03
389027Ebuildsmaintainer-wantedUNCONFIRMEDnet-misc/qpid-cpp - cross-platform Enterprise Messaging system which implements the Advanced Message2012-08-31 06:30:43
388645Applicationsmaintainer-wantedUNCONFIRMEDapp-office/moneyguru - a personal finance management application2011-10-27 17:51:06
388899Ebuildsmaintainer-wantedUNCONFIRMED[science-overlay] dev-ml/lacaml-7.0.3 new package2012-08-04 16:48:36
389011Ebuildsmaintainer-wantedUNCONFIRMEDnew ebuild : app-admin/sigar2011-10-30 23:49:09
389017Ebuildsmaintainer-wantedUNCONFIRMEDdev-python/acutil - Tool for setting up authentication from network services ( Python2 library )2011-11-01 15:34:30
389021Ebuildsmaintainer-wantedUNCONFIRMED[net-misc?]/dlan-linux - Find and configure your devolo (Ethernet via existing electrical wiring) dL2012-01-12 10:14:40
387595Ebuildsmaintainer-wantedUNCONFIRMEDNew Ebuild: app-admin/ajenti2011-10-21 07:15:46
388447Ebuildsmaintainer-wantedUNCONFIRMEDnew ebuild: mail-mta/masqmail-0.3.32012-01-24 22:12:42
388575Ebuildsmaintainer-wantedUNCONFIRMEDatem-0.3.2.ebuild - Fast command line tool that converts MetaStock financial binary data to CSV/text2011-11-03 18:46:04
387377Ebuildsmaintainer-wantedUNCONFIRMEDdev-python/configglue (new ebuild)2011-10-21 19:24:20
387345Ebuildsmaintainer-wantedUNCONFIRMEDnet-misc/gateone - an HTML5 web-based terminal emulator and SSH client.2011-10-18 18:27:36
387113Ebuildsmaintainer-wantedUNCONFIRMEDNew ebuild: dev-python/lazr-uri2011-10-21 07:13:52
387111Ebuildsmaintainer-wantedUNCONFIRMEDNew Ebuild: dev-python/wadllib2011-10-21 07:14:36
387109Ebuildsmaintainer-wantedUNCONFIRMEDNew Ebuild: dev-python/lazr-restfulclient2011-10-21 07:15:05
386971Ebuildsmaintainer-wantedUNCONFIRMEDNew Ebuild: app-crypt/yyyRSA2011-10-21 07:13:09
386909Applicationsmaintainer-wantedUNCONFIRMEDmedia-libs/libshairport: new package (used by xbmc + --enable-airtunes)2013-02-21 14:38:48
382631Ebuildsmaintainer-wantedUNCONFIRMEDNew ebuild: dev-perl/HTML-StripScripts-Parser2011-09-13 20:33:24
382635Ebuildsmaintainer-wantedUNCONFIRMEDNew ebuild: dev-perl/MIME-Lite-HTML2011-09-13 20:33:06
383097Ebuildsmaintainer-wantedUNCONFIRMEDsys-kernel/libre-sources with Freedo logo new request2011-09-16 14:42:35
383169Ebuildsmaintainer-wantedUNCONFIRMEDwww-apps/statusnet ebuild request2012-06-19 10:49:02
383279Ebuildsmaintainer-wantedUNCONFIRMEDmedia-fonts/openfontlibrary-20110916: new ebuild for fonts from OpenFontLibrary2011-09-16 22:47:58
383299Ebuildsmaintainer-wantedUNCONFIRMED[ebuild request] degate - IC digital logic reverse engineering tool2011-09-17 10:44:18
383369Ebuildsmaintainer-wantedUNCONFIRMEDNew ebuild (media-sound/groovewalrus)2011-09-17 16:21:47
383455Ebuildsmaintainer-wantedUNCONFIRMEDapp-misc/openplacos/openplacos-0.3.0.ebuild New ebuild, latest stable releases on x86 and amd642012-10-11 17:25:44
384425Ebuildsmaintainer-wantedUNCONFIRMEDqxmlrpc : New package ( ebuild included )2011-09-25 14:44:20
384747Ebuildsmaintainer-wantedUNCONFIRMEDsci-electronics/usbpicprog-0.4.2.ebuild (New Package)2011-11-03 16:48:41
385483Ebuildsmaintainer-wantedUNCONFIRMEDnew ebuild: app-editors/x22012-05-04 15:36:31
385713Ebuildsmaintainer-wantedUNCONFIRMEDdev-util/smartgit-2.0.6: new package2012-07-07 13:08:49
386557Ebuildsmaintainer-wantedUNCONFIRMEDOctopussy log aggregator (new package)2011-10-11 01:05:58
386811Ebuildsmaintainer-wantedUNCONFIRMEDNew ebuild: dev-perl/Text-BibTeX (biber dependency)2013-02-02 09:27:25
382627Ebuildsmaintainer-wantedUNCONFIRMEDNew ebuild: dev-perl/Crypt-CipherSaber2011-09-13 20:37:05
382629Ebuildsmaintainer-wantedUNCONFIRMEDNew ebuild: dev-perl/HTML-StripScripts2011-09-13 20:32:49
382437Ebuildsmaintainer-wantedUNCONFIRMEDx11-themes/rosa-icons-1.0.6.ebuild (new package)2011-09-10 00:52:03
382625Ebuildsmaintainer-wantedUNCONFIRMEDNew ebuild: dev-perl/Unicode-LineBreak2011-09-13 20:36:33
381969Ebuildsmaintainer-wantedUNCONFIRMEDAsus Notebook keyboard/backlight support kernel modules package2011-09-08 16:02:28
381927Ebuildsmaintainer-wantedUNCONFIRMEDapp-i18n/libgooglepinyin (new ebuild)2011-09-06 16:21:11
381679Ebuildsmaintainer-wantedUNCONFIRMEDPlease provide an ebuild for net-misc/lifenet2011-09-03 10:28:32
381563Librarymaintainer-wantedUNCONFIRMEDSISL - "The SINTEF Spline Library", a comprehensive NURBS library for the modeling and interrogation2011-10-07 01:01:21
380943Ebuildsmaintainer-wantedUNCONFIRMEDsys-apps/udev-discover: Sysfs browsing tool focused on helping udev users and developers (new packag2011-08-28 18:11:10
380451Ebuildsmaintainer-wantedUNCONFIRMEDEbuild request ganeti-webmgr2012-01-24 21:40:14
380407Ebuildsmaintainer-wantedUNCONFIRMEDtelldus-core (New Package)2012-02-13 22:42:52
380313Ebuildsmaintainer-wantedUNCONFIRMEDmedia-gfx/ttfautohint (new ebuild)2011-09-09 18:31:28
380021Ebuildsmaintainer-wantedUNCONFIRMEDNew ebuild: app-emulation/pearpc-0.52012-02-09 22:23:37
380015Ebuildsmaintainer-wantedUNCONFIRMEDrequesting an ebuild for ubuntuone-client2012-07-27 12:59:34
379701Ebuildsmaintainer-wantedUNCONFIRMEDfeedgenerator-1.2.1.ebuild(New Package)2011-09-16 05:46:30
379805Ebuildsmaintainer-wantedUNCONFIRMEDx11-themes/mint-x-icons (new ebuild)2011-08-19 10:01:04
379811Ebuildsmaintainer-wantedUNCONFIRMEDx11-themes/mint-x-theme (new ebuild)2011-08-19 13:35:42
379531Ebuildsmaintainer-wantedUNCONFIRMEDbibdb-0.1.2_pre.ebuild(New Package)2011-08-21 17:30:12
379429Ebuildsmaintainer-wantedUNCONFIRMEDnew ebuild for CProwl, a command-line utility to generate Prowl notifications2011-08-21 15:21:44
379211Ebuildsmaintainer-wantedUNCONFIRMED[ebuild] net-misc/kyototycoon-0.9.55 (New Package)2012-05-20 14:31:21
377831Ebuildsmaintainer-wantedUNCONFIRMEDsys-kernel/rtai-sources - Real Time Application Interface kernel sources2011-08-12 14:51:57
377833Ebuildsmaintainer-wantedUNCONFIRMEDNew ebuild for RTAI-lib modules for RTAI2011-08-05 22:24:39
377859Ebuildsmaintainer-wantedUNCONFIRMEDapp-misc/libspnav - A free, compatible alternative for 3Dconnexion's 3D input SDK2011-09-22 19:29:47
377461Ebuildsmaintainer-wantedUNCONFIRMEDnew ebuild for AeroFS2013-02-07 05:50:11
377517Ebuildsmaintainer-wantedUNCONFIRMEDapp-admin/openark-kit (new package)2011-11-16 00:59:20
376155Applicationsmaintainer-wantedUNCONFIRMEDnet-firewall/rtsp-conntrack: new ebuild for 2.6.26 and 2.6.362011-07-25 09:17:08
375589Ebuildsmaintainer-wantedUNCONFIRMEDcdp-tools-1.0.ebuild (New Package)2011-07-22 12:06:13
375673Ebuildsmaintainer-wantedUNCONFIRMED[ebuild] dev-db/mydumper-{0.2.3,0.5.1} (New Package)2011-11-02 16:48:35
377137Ebuildsmaintainer-wantedUNCONFIRMEDNew Ebuild: net-im/poezio2011-07-31 16:42:35
377265Ebuildsmaintainer-wantedUNCONFIRMEDClonezilla ebuild request2011-08-02 11:26:50
376869Ebuildsmaintainer-wantedUNCONFIRMEDnew ebuild - dev-util/motor-3.4.2 IDE2011-07-29 10:10:39
376123Ebuildsmaintainer-wantedUNCONFIRMEDCppUTest-2.3.ebuild (New Package)2011-07-25 09:15:02
375791Ebuildsmaintainer-wantedUNCONFIRMEDdev-python/svgwrite (New Package)2011-07-21 12:06:51
375555Ebuildsmaintainer-wantedUNCONFIRMEDnew ebuild app-office/wxbanker (version 0.8.2)2011-07-22 12:04:17
375259Ebuildsmaintainer-wantedUNCONFIRMED[new ebuild] net-im/oneteam2011-07-16 12:35:07
372187Ebuildsmaintainer-wantedUNCONFIRMEDeid-viewer(-bin) new ebuild2012-03-28 09:24:08
372729Ebuildsmaintainer-wantedUNCONFIRMEDNew ebuild for gedit-source-code-browser2011-07-24 10:48:48
373217Applicationsmaintainer-wantedUNCONFIRMEDmedia-sound/audacious-mplayer plugin: new package2012-02-03 02:38:51
373607Ebuildsmaintainer-wantedUNCONFIRMEDsys-apps/likwid: new package for Lightweight performance tools2012-04-07 13:13:49
373671Ebuildsmaintainer-wantedUNCONFIRMEDbmin: new package2011-07-03 16:46:54
373845Librarymaintainer-wantedUNCONFIRMEDdev-perl/PAR-Packer: new package2011-07-03 16:26:29
374789Ebuildsmaintainer-wantedUNCONFIRMEDebuild request: chiliproject - a community fork of redmine2013-02-13 20:47:13
374849Ebuildsmaintainer-wantedUNCONFIRMEDnet-wireless/kismon ebuild request2011-07-11 15:49:17
375127Ebuildsmaintainer-wantedUNCONFIRMEDscratchbox-devkit-hashutils-squeeze-sdk (new ebuild)2011-07-14 09:46:58
375249Ebuildsmaintainer-wantedUNCONFIRMEDapp-misc/xmind-portable (new package)2011-07-17 07:03:26
371775Ebuildsmaintainer-wantedUNCONFIRMEDprotobuf-c-0.15.ebuild (New Package) - C bindings for Google's Protocol Buffers2012-06-03 20:47:25
371627Ebuildsmaintainer-wantedUNCONFIRMEDnet-libs/libmapi-0.10 ebuild2011-06-20 09:11:51
371373Ebuildsmaintainer-wantedUNCONFIRMEDapp-i18n/wordforge-0.8_rc1 - Offline translation and localization program working internally with XL2011-06-13 22:39:51
370965Ebuildsmaintainer-wantedUNCONFIRMEDdev-tex/eqexam: new ebuild2011-06-10 14:52:45
370741Ebuildsmaintainer-wantedUNCONFIRMEDnet-im/gtmess-0.96 - An excellent terminal MSN client2011-06-10 02:30:49
370315Ebuildsmaintainer-wantedUNCONFIRMEDdev-tcltk/tcl-snmptools-1.0.ebuild (new ebuild)2011-09-03 04:27:14
370151Javamaintainer-wantedUNCONFIRMEDNew package: dev-java/stax2-api2011-06-07 21:13:04
370149GNOMEmaintainer-wantedUNCONFIRMEDNew ebuild for GNOME Video Arcade2011-06-07 21:13:52
369865Ebuildsmaintainer-wantedUNCONFIRMEDx11-plugins/pidgin-mra (new ebuild)2011-06-08 17:12:20
369977Javamaintainer-wantedUNCONFIRMEDNew package: dev-java/htmlcleaner2011-06-07 21:13:31
369489Ebuildsmaintainer-wantedUNCONFIRMEDsys-fs/boxfs-0.7.ebuild - A FUSE filesystem to access files on box.net accounts2011-06-06 00:29:16
369487Ebuildsmaintainer-wantedUNCONFIRMEDdev-libs/libapp-9999.ebuild (new ebuild)2011-06-06 00:21:52
369375Ebuildsmaintainer-wantedUNCONFIRMEDdev-utils/pycharm (new package)2013-01-13 10:52:43
368985Ebuildsmaintainer-wantedUNCONFIRMEDgames-kids/scratch: New ebuild for MIT's "scratch" programming environment for young people2012-11-21 10:11:11
368053Ebuildsmaintainer-wantedUNCONFIRMEDnew ebuild : net-dns/yaddns - ddns is a small ddns client with multiple ddns server supports and a h2011-05-19 20:48:37
368855Ebuildsmaintainer-wantedUNCONFIRMEDx11-plugins/gnome-shell-extensions-pidgin (new ebuild)2013-01-23 09:30:59
368847Ebuildsmaintainer-wantedUNCONFIRMEDnet-proxy/andiparos ebuild request2011-05-27 08:47:21
368845Ebuildsmaintainer-wantedUNCONFIRMEDnet-proxy/ZAP ebuild request2011-05-27 08:47:55
368823Ebuildsmaintainer-wantedUNCONFIRMEDx11-misc/dispad-0.1 (new package)2011-05-27 15:58:00
368819Ebuildsmaintainer-wantedUNCONFIRMEDapp-emacs/sepia - perl+emacs integration (New Package)2011-06-08 06:30:23
368091Ebuildsmaintainer-wantedUNCONFIRMED[new package] sci-libs/sprng-2.02011-06-01 04:39:17
367003Ebuildsmaintainer-wantedUNCONFIRMEDnet-wireless/urfkill (new package) - Handler for rfkill events in userspace2011-06-12 07:58:43
367027Ebuildsmaintainer-wantedUNCONFIRMEDnet-analyzer/amun - Low-interaction honeypot, capture autonomous spreading malware in an automated f2012-03-08 02:09:36
367427Ebuildsmaintainer-wantedUNCONFIRMEDmedia-sound/qjackmmc-4 - a Qt based program that can connect to a device or program that emits MIDI 2011-05-18 11:04:44
367429Ebuildsmaintainer-wantedUNCONFIRMEDmedia-sound/jackctlmmc-4 - JackCtlMMC is a slightly simpler command-line version of QJackMMC2011-05-17 11:44:37
367977Ebuildsmaintainer-wantedUNCONFIRMEDNew Ebuild - GNUBik2011-05-20 03:26:48
366259Ebuildsmaintainer-wantedUNCONFIRMEDx11-themes/gtk-engines-equinox - Equinox GTK+2 Engine based on Aurora2012-08-16 21:03:11
365933Ebuildsmaintainer-wantedUNCONFIRMEDNew Ebuild, plug-0.7: Linux software for Fender Mustang amplifiers2011-05-07 04:30:11
366017Ebuildsmaintainer-wantedUNCONFIRMEDnew ebuild sys-apps/samefile2011-05-05 10:16:31
365621Ebuildsmaintainer-wantedUNCONFIRMEDdupx-0.1.ebuild (New Package)2011-05-02 06:08:01
365345Ebuildsmaintainer-wantedUNCONFIRMEDgxsm-2.0 (New Package Gnome X Scanning Microscopy)2011-05-02 01:45:44
360975Ebuildsmaintainer-wantedUNCONFIRMEDNew package: app-misc/endeavour2011-11-04 23:48:42
365131Ebuildsmaintainer-wantedUNCONFIRMED[ebuild request] net-voip/blink2012-12-16 23:52:01
427030Applicationsmaintainer-neededUNCONFIRMEDnet-misc/sks version bump (and it should install an init.d script along with a uid/gid)2013-01-05 21:37:02
434926Applicationsmaintainer-neededUNCONFIRMED>=net-im/skype-4.0.0.7 - login failure, stuck at "signing in" with JFS filesystem2013-01-03 19:31:41
437898Core systemmaintainer-neededUNCONFIRMEDnet-wireless/broadcom-sta-5.100.82.112-r2 with gentoo-sources-3.6.x - general protection fault in wl2013-02-03 13:08:44
438622Ebuildsmaintainer-neededUNCONFIRMEDnet-wireless/broadcom-sta-6.20.55.19 version bump2013-02-07 12:05:08
440512Applicationsmaintainer-neededUNCONFIRMEDnet-im/skype-4.0.0.8-r1: some elog messages should only be shown for the first install.2013-01-03 19:31:53
446968Applicationsmaintainer-neededUNCONFIRMEDnet-misc/netkit-telnetd-0.17-r10 - Use native gcc instead of CC (cross compile issue)2013-02-16 13:35:19
447352Unspecifiedmaintainer-neededUNCONFIRMEDapp-laptop/tp_smapi-0.41 with kernel 3.7 - modprobe: FATAL: Error inserting tp_smapi (/lib/modules/32013-01-02 20:30:53
413307Servermaintainer-neededUNCONFIRMEDnet-dns/sheerdns - default responses2012-04-24 16:05:51
410343Ebuildsmaintainer-neededUNCONFIRMEDnet-wireless/broadcom-sta - modprobe wl: ERROR: could not insert 'wl': No such file or directory2013-02-03 13:03:43
407667Ebuildsmaintainer-neededUNCONFIRMEDnet-wireless/broadcom-sta-5.100.82.112-r2 has broken multicast patch2013-02-03 13:03:15
406255Sandboxmaintainer-neededUNCONFIRMEDdev-libs/apr-1.4.6 failed test: testlfs : \/bin/bash: line 2: 3428 Segmentation fault (core d2012-12-29 17:08:08
400905Applicationsmaintainer-neededUNCONFIRMEDnet-libs/udns please add filter-flags -fpeel-loops used with -03 or -0s2013-02-16 13:22:28
399747Ebuildsmaintainer-neededUNCONFIRMEDnet-wireless/broadcom-sta floods logs with "could not get rate/rssi"2013-02-03 13:03:07
399217Librarymaintainer-neededUNCONFIRMEDnet-libs/udns - please add building of rblcheck, dnsget binaries2013-02-16 14:13:07
381751Ebuildsmaintainer-neededUNCONFIRMEDnet-misc/plowshare-9999 ebuild sumbit2012-06-16 07:57:43
385155Ebuildsmaintainer-neededUNCONFIRMEDnet-misc/axel-9999: please add live ebuild2012-07-06 15:17:03
375777Applicationsmaintainer-neededUNCONFIRMEDapp-admin/ulogd-2.0.0_beta4 should warn about needed config changes2012-12-04 17:37:14
456784ApplicationslxnayUNCONFIRMED[sabayon overlay] net-wireless/blueman-1.23-r2: Failed Patch: blueman-1.21-fix-segfault-startup.patc2013-02-12 15:10:18
456696ApplicationslxnayUNCONFIRMED[sabayon overlay] app-text/gimagereader-0.9: complains: Could not load sane or twain, scanning will 2013-02-13 13:59:47
445484SELinuxlxnayUNCONFIRMEDnet-nds/389-ds-base-1.2.11.15 fails to build in hardened selinux profile2012-12-04 19:58:35
433002ApplicationslxnayUNCONFIRMEDnet-libs/libgrss-0.3.0 fails to build without gnome-doc-utils2012-12-19 08:18:58
405127UnspecifiedlxnayUNCONFIRMEDnet-nds/389-ds-base-1.2.10.0 version bump2012-10-02 20:26:41
417239ApplicationslxdeUNCONFIRMEDIf LXDE session is running the kbd input on tty1 is broken (need to press keys twice)2012-06-14 13:17:06
424529ApplicationsljakabUNCONFIRMEDvpnc init script does not wait for network connectivity (NetworkManager)2012-11-23 08:13:55
406141ApplicationsljakabUNCONFIRMEDnet-misc/vpnc-0.5.3_p514: vpnc-script does not backup /etc/resolv.conf nor anticipate /etc/ppp/resol2013-02-06 15:31:36
380399ApplicationsljakabUNCONFIRMEDnet-misc/vpnc-0.5.3: couldn't set up connection to remote server ...2013-02-07 15:22:30
450528Serverldap-bugsUNCONFIRMEDnet-nds/openldap-2.4.30: configure: error: crossing compiling: use --with-yielding_select=yes|no|man2013-01-07 11:32:59
450948Serverldap-bugsUNCONFIRMEDnet-nds/openldap-2.4.33-r1: smbkrb5passwd use flag ignores kerberos and samba use flags2013-01-09 12:33:02
456862Libraryldap-bugsUNCONFIRMEDnet-nds/openldap-2.4.30[gnutls] is crashing2013-02-13 18:54:36
449940Core systemldap-bugsUNCONFIRMEDsys-auth/nss_ldap misses entries with nss_connect_policy oneshot2013-01-03 09:05:50
449776Serverldap-bugsUNCONFIRMEDnet-nds/openldap - add support for slapd-mdb backend2013-01-03 00:24:21
447996Applicationsldap-bugsUNCONFIRMEDnet-nds/openldap tries to start before net.eth0 and fails2012-12-22 13:00:56
444896Applicationsldap-bugsUNCONFIRMEDnet-nds/openldap-2.4.30 USE="overlays" - ld: cannot find -lldap_r2012-11-27 16:06:20
440470Applicationsldap-bugsUNCONFIRMEDnet-nds/openldap-2.4.30: some elog messages should only be shown for the first install.2012-10-31 16:17:07
438890Serverldap-bugsUNCONFIRMEDnet-nds/openldap USE="gnutls ssl" cannot find gcrypt.h2013-01-13 07:41:57
451246ApplicationslackUNCONFIRMEDnet-misc/pymazon should RDEPEND on qt4? ( dev-python/PyQt4[X] )2013-01-11 16:25:43
440614ApplicationslackUNCONFIRMEDnet-dns/openresolv-3.4.1-r1: order of entries is not consistent with resolvconf -u on interface wake2012-10-31 16:01:39
449340ApplicationslackUNCONFIRMEDwww-client/firefox-17.0.1 crashed while watching movie online2013-01-02 22:09:55
366535EbuildslackUNCONFIRMEDnet-dns/openresolv-3.5.3 - stabilize2013-02-08 20:29:01
445110Eclasses and Profileskernel-miscUNCONFIRMEDkernel-2.eclass v1.277 - Default DESCRIPTION incorrectly built.2012-11-28 23:37:02
444238Ebuildskernel-miscUNCONFIRMEDsys-kernel/linux-headers: Out of kernel builds seems not supported2012-11-23 04:59:46
438784Eclasses and Profileskernel-miscUNCONFIRMEDlinux-mod.eclass - kernel modules packages are incompatible with using multiple kernels2012-10-18 14:18:50
438734Eclasses and Profileskernel-miscUNCONFIRMEDlinux-mod.eclass - KERNEL_DIR/KBUILD_OUTPUT version mismatch is not detected, KERNEL_DIR is not infe2012-10-18 07:40:38
438730Core systemkernel-miscUNCONFIRMEDSandbox violations when emerging kernel modules from /etc/kernel/postinst.d hook against a kernel bu2012-11-05 03:29:40
436402Eclasses and Profileskernel-miscUNCONFIRMEDkernel-2.eclass - Print the value of PATCH_DEPTH actually used for patching rather than it's initial2012-09-28 14:33:19
436442Eclasses and Profileskernel-miscUNCONFIRMEDkernel-2.eclass - Offer a mean to install the kernel distribution under a tunable directory name2012-09-28 14:34:11
434710Eclasses and Profileskernel-miscUNCONFIRMEDlinux-mod.eclass should set KERNEL_DIR and KBUILD_OUTPUT if not present2012-09-12 21:59:45
428728Core systemkernel-miscUNCONFIRMEDsys-kernel/ksymoops-2.4.11-r1 - In file included from ksymoops.h:9:0, from ksymoops.c:14: /usr/inclu2012-12-17 16:12:54
427052Eclasses and Profileskernel-miscUNCONFIRMEDlinux-mod.eclass needs a fix for ABI x322012-08-08 15:24:14
410923Core systemkernel-miscUNCONFIRMEDsys-kernel/module-rebuild - command line options are consistent (should be "module-rebuild --action"2012-04-06 14:44:25
386235Applicationskernel-miscUNCONFIRMEDsys-kernel/gentoo-sources-3.x will not boot encrypted /2011-12-26 13:34:01
392247Core systemkernel-miscUNCONFIRMEDsys-kernel/module-rebuild-0.7 doesn't respect EMERGE_DEFAULT_OPTS variable2011-12-04 02:58:30
402967Applicationskernel-miscUNCONFIRMEDsys-fs/fuse-2.8.7 - ld.gold: error: symbol fuse_new has undefined version2012-12-25 21:39:12
458384Core systemkernelUNCONFIRMEDsys-kernel/gentoo-sources 3.5.7.6 version bump?2013-02-20 02:12:47
458426EbuildskernelUNCONFIRMED=sys-kernel/gentoo-sources-3.8.0 fails to compile: invalid operands to binary == (have ‘kuid_t’ and 2013-02-20 11:26:46
366733Eclasses and Profileskernel-miscUNCONFIRMEDkernel-2.eclass enhancement proposal: removing unnecessary arch directories to save space2012-04-16 11:29:25
458116Core systemkernelUNCONFIRMEDkernel 3.7.5 - BUG related to skb when sysctl net.ipv4.tcp_mtu_probing!=02013-02-21 02:44:06
444742ApplicationskernelUNCONFIRMEDnet-fs/autofs-5.0.6-r3 unable to mount NFS on HPPA: do_mount_indirect: path to be mounted is to long2013-02-06 04:36:10
445022Core systemkernelUNCONFIRMED=sys-kernel/gentoo-sources-3.5.7/3.6.6 - Firmware missing for Broadcome NetXtreme II2012-11-30 15:26:00
445222Core systemkernelUNCONFIRMEDsys-kernel/vanilla-sources uli526x module incompatible with GART_IOMMU2012-12-11 12:37:18
454730Core systemkernelUNCONFIRMEDsys-kernel/gentoo-sources-3.6.11-3.7.5 - kexec doesn't work on laptop with i915 gpu2013-02-05 13:48:06
455356Core systemkernelUNCONFIRMEDsys-kernel/gentoo-sources-3.6.11 panic in smp.c2013-02-03 22:52:48
455880Core systemkernelUNCONFIRMEDCONFIG_DEVTMPFS default value in kernel configuration (gentoo-sources and potentially others)2013-02-17 19:40:19
456118Core systemkernelUNCONFIRMEDsys-kernel/gentoo-sources-3.7.4 - memory exhaustion in AS firmware//lib/firmware/.gen.o2013-02-12 03:36:33
456198Core systemkernelUNCONFIRMEDsys-kernel/gentoo-sources-3.7.4 - /proc/vmcore missing?2013-02-09 19:16:36
458028Core systemkernelUNCONFIRMEDKernel:3.7.8 BUG: unable to handle kernel paging request in radeon_mmap()2013-02-21 02:43:20
457498KDEkdeUNCONFIRMEDkrunner ("Run Command") window stays "stuck"2013-02-14 08:09:40
456026KDEkdeUNCONFIRMEDnet-misc/csync and net-misc/mirall crash with net-libs/neon[kerberos] -2013-02-14 15:48:38
455234KDEkdeUNCONFIRMEDkmix: dbuscontrolwrapper.cpp:(.text+0x169): undefined reference to `vtable for DBusControlWrapper'2013-02-03 07:06:26
449742ApplicationskdeUNCONFIRMEDnet-im/ktp-call-ui-0.5.1 does not build with net-libs/telepathy-farstream-0.6.02013-02-19 21:49:10
449296KDEkdeUNCONFIRMEDnet-im/ktp-call-ui-0.5.1: gsttaglist.h:152:28: error: conflicting declaration ‘typedef struct _GstTa2013-01-18 10:50:15
433070KDEkdeUNCONFIRMEDapp-editors/kile-2.1.2-r1 - index.docbook:124: parser error : Entity 'ged.vertaald' not defined2013-02-17 22:53:14
430938KDEkdeUNCONFIRMEDkde-base/plasma-workspace-4.8.5 fails with parallel build: fatal error: ui_killrunner_config.h: No s2012-10-24 16:55:05
432976KDEkdeUNCONFIRMEDnet-libs/telepathy-logger-qt-0.5.0: fails to build with >=dev-libs/boost-1.50.0-r22013-01-18 10:48:33
421231GNOMEkdeUNCONFIRMEDkde-misc/plasma-widget-menubar needs appmenu-gtk2013-02-14 21:21:05
395397KDEkdeUNCONFIRMEDkde-base/systemsettings-4.7.3: kdm settings->Theme "Get new theme" button doesn't work2012-04-14 08:21:23
458034ApplicationsjsbronderUNCONFIRMEDnet-nntp/sabnzbd-0.7.11 initscript always reports crashed status2013-02-19 20:05:09
453644Core systemjsbronderUNCONFIRMEDsys-cluster/torque-2.5.12 - qstat-qstat.o: In function `tcl_run': qstat.c:(.text+0x1ac5): undefined 2013-02-06 16:34:18
452676ServerjsbronderUNCONFIRMEDsys-cluster/torque - new HOMEPAGE2013-01-17 15:39:49
451056DevelopmentjsbronderUNCONFIRMEDsys-cluster/mpich2-1.2.1_p1-r1 fails to crosscompile: configure: error: Unable to determine Fortran 2013-01-09 15:17:48
415701Core systemjsbronderUNCONFIRMEDsys-cluster/torque-3.x[cpusets] fails on 3.2.x kernels2012-11-02 17:51:04
407155UnspecifiedjsbronderUNCONFIRMEDsys-cluster/openmpi - Rmpi fails to install under dev-lang/R-2.14.2 due to undefined symbol: mca_bas2012-05-11 12:13:24
457810Core systemjlecUNCONFIRMEDsys-fs/aufs3-3_p20130207 with USE="inotify" and sys-kernel/hardened-sources-3.7.5 doesn't compile - 2013-02-17 09:10:21
372703UnspecifiedjmbsvicettoUNCONFIRMEDnet-misc/vde service script unloads module when it is still needed2012-06-08 13:14:11
409867EbuildsjmbsvicettoUNCONFIRMEDnet-misc/vde-2.3.2 version bump including Python support2012-06-08 13:16:39
456186ApplicationsjmbsvicettoUNCONFIRMEDmedia-sound/amarok-2.6.0 - make[2]: *** No rule to make target `/usr/lib64/libGLU.so', needed by `li2013-02-13 19:21:15
434242DevelopmentjohnnyUNCONFIRMEDdev-vcs/monotone-1.0-r3 with dev-lang/lua-5.2.1: src/lua.hh:41:23: error: ‘LUA_GLOBALSINDEX’ was not2013-01-29 06:21:50
403021ApplicationsjokerUNCONFIRMEDnet-misc/r8168 CONFIG_CHECK="!R8169" is not neccesary2012-05-19 06:10:37
406907Core systemjosejxUNCONFIRMEDsys-fs/diskdev_cmds - fsck.hfsplus segfaults on amd64/hardened2012-10-06 12:32:11
433481LibraryjlecUNCONFIRMEDsci-libs/vtk bundles the following netcdf, ftgl, sqlite3 and exodusii2012-12-13 12:38:46
456832ApplicationsjerUNCONFIRMEDnet-misc/putty and net-misc/pssh - File collision: /usr/bin/pscp2013-02-11 19:20:34
455086ApplicationsjerUNCONFIRMEDnet-misc/chrony-1.27 - Version bump2013-02-02 08:13:18
399353ApplicationsjerUNCONFIRMEDapp-admin/sysstat-10.0.3 generated daily report file will be truncated by cron.daily (sys-process/vi2012-05-10 14:40:15
381333ApplicationsjerUNCONFIRMEDx11-terms/rxvt-unicode feature request (disable underline and cursor behaviour)2012-02-26 18:39:51
456932JavajavaUNCONFIRMEDERROR: dev-java/netbeans-javafx-7.2 failed (compile phase)2013-02-13 20:19:37
450986JavajavaUNCONFIRMEDNew Tomcat init script does not respect catalina.properties2013-02-04 16:01:01
430184JavajavaUNCONFIRMEDdev-java/jansi and dev-java/jansi-native: Version bump (+ new dependency)2012-08-06 14:27:16
430186JavajavaUNCONFIRMEDdev-java/hawtjni-runtime: New package2012-08-06 14:27:16
426294JavajavaUNCONFIRMEDnet-nds/jxplorer-3.3 - version bump request2013-01-28 15:25:13
426382JavajavaUNCONFIRMEDdev-java/nekohtml-1.9.16 version bump2012-08-07 21:02:08
413123JavajavaUNCONFIRMEDdev-java/lucene-2.9.4 and dev-java/lucene-analyzers-2.3.2 builds broken2012-04-22 21:15:07
416439JavajavaUNCONFIRMEDdev-java/rxtx cannot connect to serial port2012-07-30 18:07:11
420451JavajavaUNCONFIRMEDdev-java/jnr-netdb:0: Use dev-java/jnr-ffi:0.5 instead of dev-java/jaffl2012-06-10 00:57:49
420605DevelopmentjavaUNCONFIRMEDdev-util/eclipse-sdk-3.5.1-r1 No more handles [MOZILLA_FIVE_HOME='/usr/lib64/xulrunner-devel-1.9.2']2013-02-04 12:41:42
421677JavajavaUNCONFIRMEDdev-java/ant-commons-net-1.8.4 - *** Semantic Error: The abstract method "int compareTo(java.lang.Ob2012-06-19 02:39:45
391171JavajavaUNCONFIRMEDNew package: dev-java/gson2012-08-06 14:29:01
396225JavajavaUNCONFIRMEDUpdate dev-java/lucene-analyzers for slots 2.4, 2.9, 3.0, 3.1, 3.2, 3.3, 3.4, 3.5, 3.6 of dev-java/l2012-06-04 21:47:55
391165JavajavaUNCONFIRMEDNew package: dev-java/sqlite-jdbc2011-11-20 22:16:24
383013JavajavaUNCONFIRMEDOnline bank security apple refuses to work unless I create a '/etc/.java' folder2011-09-15 18:53:28
382807ApplicationsjavaUNCONFIRMED[java-overlay] app-text/languagetool-0.9.8 needs >=virtual/ooo-3.02011-12-09 23:13:42
372097JavajavaUNCONFIRMEDdev-java/jpfcodegen-0.4 needs jdom-jaxen to build2011-06-17 20:35:53
374839Mailing Listsinfra-bugsUNCONFIRMEDList-Id: is not very fine configured2011-07-11 12:05:40
450406Applicationsidl0rUNCONFIRMEDnet-dns/bind-9.9.2_p1: /etc/bind/named.conf now points to /var/bind/root.cache (symlink) instead to 2013-01-07 03:35:32
456136Libraryidl0rUNCONFIRMEDnet-dns/bind-tools with dev-libs/openssl-1.0.1c - nslookup: error: [...] /usr/lib64/engines/libgost.2013-02-11 12:12:54
456396Serveridl0rUNCONFIRMEDnet-dns/bind-9.9.2_p1: old named.cache2013-02-10 15:09:02
445760Applicationsidl0rUNCONFIRMEDmedia-plugins/vdr-xineliboutput-9999 CVS-Server: Connection reset by peer2012-12-04 15:07:50
447102Applicationsidl0rUNCONFIRMEDnet-analyzer/nagstamon-0.9.9 throws glib.GError: Couldn't recognize the image file format for file '2012-12-13 14:34:59
443086Ebuildsidl0rUNCONFIRMEDmedia-plugins/vdr-xineliboutput-9999 change actual CVS from 9999 to 999999992012-12-02 22:03:17
417131Applicationsidl0rUNCONFIRMEDnet-dns/bind-tools-9.8.1[idn] use prefix (/usr) for idnkit library LDFLAGS when ROOT != /2012-05-23 14:13:56
430316Ebuildsidl0rUNCONFIRMEDFeature request: Add a check for sane folder/file permission in net-dns/bind2012-08-07 16:19:51
417129Applicationsidl0rUNCONFIRMEDnet-dns/bind-tools-9.8.1[ssl] hardcodes OpenSSL path checks which breaks cross-compiling/etc...2013-02-08 06:12:18
403473Applicationsidl0rUNCONFIRMEDmedia-plugins/vdr-xineliboutput-1.0.5-r1 - xine_post_audiochannel.c:97:7: error: ‘post_audio_port_t’2012-09-27 15:47:31
377599Applicationsidl0rUNCONFIRMEDVersion bump: media-plugins/vdr-xineliboutput-1.0.72012-11-13 16:04:32
382719Ebuildsidl0rUNCONFIRMEDmedia-video/nvidia-settings hangs with three connected displays [patch]2012-02-17 05:16:12
376315Ebuildsidl0rUNCONFIRMEDnet-dns/bind: config-file split2012-05-22 00:07:14
431984Core systemia64UNCONFIRMEDsys-boot/efibootmgr - arch must match kernel arch to work correctly2012-08-22 00:02:20
450536ServerhwoarangUNCONFIRMEDnet-ftp/vsftpd-3.0.2 prints warning: `vsftpd' uses 32-bit capabilities (legacy support in use) in ke2013-01-15 23:14:17
439796EbuildshwoarangUNCONFIRMEDnet-misc/dibbler - /etc/init.d/dibbler-client stop doesn't stop client gracefully2012-11-04 10:57:39
443898ServerhwoarangUNCONFIRMED>=net-ftp/vsftpd-3.0.0: 500 OOPS: priv_sock_get_cmd with seccomp_sandbox=YES (default)2012-11-19 10:55:09
430866ApplicationshwoarangUNCONFIRMEDx11-misc/lightdm-1.3.2: both password and ssh passphrase need to be entered at login2013-01-24 22:40:09
406757ApplicationshwoarangUNCONFIRMEDmedia-video/rtmpdump crashes with gnutls[nettle]2012-03-24 09:19:49
446734EbuildshollowUNCONFIRMEDwww-servers/nginx - init script changes owner and mode of /var/log/nginx on each startup/restart2013-01-21 03:28:06
454476ApplicationshasufellUNCONFIRMEDnet-misc/badvpn-1.999.127 version bump2013-01-29 13:32:19
456694LibraryhaubiUNCONFIRMEDdev-db/oracle-instantclient-sqlplus-11.2.0.3: sqlpus binary needs paxctl -c on hardened ~amd642013-02-19 20:33:27
453492Hardenedhardened-kernelUNCONFIRMEDsys-kernel/hardened-sources-3.7.3: kernel panic when loading modules2013-01-28 14:15:36
456970Applicationshardened-kernelUNCONFIRMEDapp-editors/emacs-24.2 failed to emerge with a segmentation fault on hardened-sources-3.7.4-r12013-02-12 22:17:52
457708Core systemhardened-kernelUNCONFIRMEDapp-emulation/virtualbox-4.{1.22,2.6}-r1 on sys-kernel/hardened-sources - Can't start virtual machin2013-02-16 21:53:53
447754Core systemhardened-kernelUNCONFIRMEDsys-kernel/vanilla-sources with sys-devel/gcc-4.6+ creates unbootable kernel images on ia642013-02-21 02:19:12
447682Core systemhardened-kernelUNCONFIRMEDsys-kernel/hardened-sources-3.7.0 on ia64 - drivers/built-in.o: In function `show_yoffset': bgrt.c:(2012-12-19 09:12:02
447702Core systemhardened-kernelUNCONFIRMEDsys-kernel/hardened-sources-3.7.0 fails to crosscompile for Ski-Simulator: include/linux/gfp.h:295:22012-12-19 09:10:48
437722Core systemhardened-kernelUNCONFIRMEDsys-kernel/hardened-sources-3.4.5, 3.5.4-r1: BUG: unable to handle kernel NULL pointer dereference2013-01-22 13:36:29
444892Hardenedhardened-kernelUNCONFIRMEDNetwork failure with >sys-kernel/hardened-sources-3.4.5 tulip driver (DECchip 21140)2013-01-24 14:11:59
446326Core systemhardened-kernelUNCONFIRMED=sys-kernel/hardened-sources-3.6.8 - unable to handle kernel NULL pointer dereference - vsftpd copy_2013-01-22 13:36:00
417409Core systemhardened-kernelUNCONFIRMEDsys-kernel/hardened-sources-3.2.11 - beam: page allocation failure: order:1, mode:0x20 or swapper: p2012-05-28 10:16:10
412551Applicationshardened-kernelUNCONFIRMEDsys-kernel/hardened-sources-3.2.12 + qemu-kvm: rcu_shed detected stall on CPU2012-08-06 00:30:12
390363Core systemhardened-kernelUNCONFIRMEDsys-kernel/hardened-sources-2.6.32-r42/r68/r73 - Problem with support OCFS2 filesystems2011-12-24 02:47:23
401669Core systemhardened-kernelUNCONFIRMEDsys-kernel/hardened-sources-2.6.32-r89: Compilation broken on ia642012-02-27 01:07:20
457962Core systemhardenedUNCONFIRMEDsys-kernel/gentoo-source-3.6.11: lockd_init_net - kernel NULL pointer dereference2013-02-19 17:11:52
457192HardenedhardenedUNCONFIRMEDnet-misc/quagga-0.99.21 with sys-devel/gcc-4.5.3 sometimes gives PAX: terminating task /usr/sbin/osp2013-02-21 02:32:42
456364HardenedhardenedUNCONFIRMEDsys-kernel/hardened-sources-3.7.5 ppc64 xics-common.c fails with "assignment of member 'cause_ipi' i2013-02-10 01:31:44
456922UnspecifiedhardenedUNCONFIRMEDUnable to start any java-vm on hardened gentoo icedtea-bin-6.1.11.5: Could not reserve enough space 2013-02-13 15:13:44
455472HardenedhardenedUNCONFIRMEDsys-kernel/hardened-sources-3.2.37-r2: File "/usr/src/linux-3.2.35-hardened-r1/arch/ia64/scripts/unw2013-02-04 17:45:58
450776HardenedhardenedUNCONFIRMEDapp-emulation/wine-1.5.21 - configure: checking for -lGL... ./conftest: error while loading shared l2013-02-11 21:23:57
448322HardenedhardenedUNCONFIRMEDmake fails on kernel/sched/core.o when trying to build sys-kernel/hardened-sources-3.5.4-r12013-01-18 21:53:13
443296HardenedhardenedUNCONFIRMEDcrashes lvm&mkfs.xfs on mdraid10 with sys-kernel/hardened-sources > 3.22012-11-15 18:45:28
446328HardenedhardenedUNCONFIRMEDnet-misc/busybox-ntpd add selinux USE and depency on sec-policy/selinux-ntp2012-12-07 07:51:57
434922HardenedhardenedUNCONFIRMEDnet-fs/openafs-1.6.1 doesn't built with sys-kernel/hardened-sources with grsecurity/PaX enabled2013-02-10 14:52:43
428682HardenedhardenedUNCONFIRMEDSystem.map has an incorrect kernel version reported when grsec enabled2012-08-03 15:29:25
415951ApplicationshardenedUNCONFIRMEDnet-analyzer/p0f-3.05_beta "p0f -L" throws segfault on hardened-sources2012-05-14 18:51:41
402475HardenedhardenedUNCONFIRMEDXen DomU hardened kernel 3.1.8 and later crashes on boot2013-01-31 18:12:48
400951HardenedhardenedUNCONFIRMEDJava does not run properly on non-root with Grsecurity Hardened Gentoo [workstation] level2012-01-26 19:28:36
401667EbuildshardenedUNCONFIRMEDnet-libs/libproxy-0.4.7 - Segmentation fault /usr/bin/gmcs /nologo /target:library /out:/var/tmp/por2012-02-03 21:57:47
386647HardenedhardenedUNCONFIRMEDdev-java/jamvm-1.5.4-r1 segfaults with hardened gcc-4.5.3-r1 (any profile), unless -Xnoinlining is s2012-07-11 11:36:26
375439HardenedhardenedUNCONFIRMEDmedia-gfx/hugin-2011.0.0 needs paxctl -m2011-09-21 16:42:22
374289ApplicationshardenedUNCONFIRMEDwww-clients/firefox-5.0-r2 mmap loog on PaX&hardened system2012-01-21 01:27:05
435656EbuildshannoUNCONFIRMEDnet-analyzer/greenbone-security-assistant-2.0.1 - ld: CMakeFiles/gsad.dir/gsad.c.o: undefined refere2012-09-24 10:44:47
436102EbuildshannoUNCONFIRMEDnet-analyzer/greenbone-security-desktop-1.2.2: version bump2012-09-24 22:50:20
434472ApplicationshannoUNCONFIRMEDnet-analyzer/openvas-scanner-3.2.4 - ld: CMakeFiles/openvassd.dir/preferences.c.o: undefined referen2013-01-01 12:37:32
434722UnspecifiedhannoUNCONFIRMEDnet-mail/mailman-2.1.14 uses python_mod_cleanup() incorrectly2012-09-11 15:14:21
430870ApplicationshannoUNCONFIRMEDnet-analyzer/openvas-administrator - .../work/openvas-administrator-1.1.1/src/admin.c:877:3: error: 2012-08-12 14:12:23
416387ApplicationshannoUNCONFIRMEDnet-analyzer/openvas-scanner - openvassd: serving 127.0.0.1: Libgcrypt warning: missing initializati2012-05-18 14:57:06
411271ApplicationshannoUNCONFIRMEDnet-im/python-otr-0.2.1.1 SRC_URI has changed2012-04-10 13:34:22
411275EbuildshannoUNCONFIRMEDnet-im/python-otr-1.0.0_beta6 version bump2012-10-27 11:06:09
414697EbuildshannoUNCONFIRMEDnet-analyzer/greenbone-security-assistant-3.0.3 version bump2012-10-10 19:39:05
407729LibraryhannoUNCONFIRMEDnet-analyzer/openvas-libraries-4.0.5 fails with gnutls 3.x - work/openvas-libraries-4.0.5/misc/netwo2013-02-04 18:28:58
402379EbuildshannoUNCONFIRMEDnet-analyzer/openvas-* version bumps2013-02-17 13:47:30
396561ServerhannoUNCONFIRMEDnet-mail/mailman-2.1.14 installs CGIs non-world-readable, breaks under lighttpd2011-12-31 09:30:28
396525ApplicationshannoUNCONFIRMEDmail-mta/courier-0.66.3: wrong file ownership on /usr/share/courier/esmtpd2012-06-23 19:03:26
394417ApplicationshannoUNCONFIRMEDmail-mta/courier - wrong ownership/permissions on /etc/courier/ldapaliasrc2012-09-27 07:54:34
392261UnspecifiedhannoUNCONFIRMEDapp-emulation/dosemu -fno-pic causes build failure when using hardened compiler with PIE2012-12-23 17:38:30
390843ApplicationshannoUNCONFIRMEDnet-mail/mailman-2.1.14 doesn't work with hardened with TPE2011-11-17 16:39:35
389453Keywording and StabilizationhannoUNCONFIRMEDnet-analyzer/openvas ebuilds missing arm keyword2013-02-04 18:26:13
377817EbuildshannoUNCONFIRMED[hanno overlay] net-im/gajim-9999 Please split crypt USE to otr, gpg and new for E2E2011-08-05 08:55:52
436702ApplicationsgurligebisUNCONFIRMEDnet-wireless/wpa_supplicant - systemd unit does not configure ctrl_interface2012-11-18 13:03:00
454084ApplicationsgurligebisUNCONFIRMEDnet-wireless/hostapd USE=-debug prints no messages2013-01-26 15:49:39
372893EbuildshannoUNCONFIRMED[hanno-overlay] net-im/gajim-9999 don't install all necessary packages2012-02-21 16:39:03
384311ApplicationsgregkhUNCONFIRMEDnet-misc/bti add patch to allow compilation on non-GNU systems2012-09-23 09:36:41
389701ApplicationsgregkhUNCONFIRMEDsys-kernel/linux-firmware missing Adaptec aic94xx firmware2011-11-08 10:22:58
453728ApplicationsgregkhUNCONFIRMEDmedia-gfx/colorhug-client- new homepage?2013-02-06 21:12:00
417995EbuildsgraphicsUNCONFIRMEDmedia-gfx/gimageview-0.2.27-r3: 'pow@@GLIBC_2.0' is defined in DSO /lib/libm.so.2012-05-28 16:32:51
404227ApplicationsgraphicsUNCONFIRMEDmedia-gfx/hugin-2011.4.0 - ../hugin_base/libhuginbase.so.0.0: undefined reference to `sgesvd_'2012-02-17 15:08:27
374337ApplicationsgraphicsUNCONFIRMEDmedia-gfx/hugin-2011.0.0 : ebuild need a debug USE flag2012-01-30 07:37:54
413489ApplicationsgnustepUNCONFIRMEDgnustep-base/gnustep-gui-0.22.0 - ld: warning: libicuuc.so.48, needed by /usr/lib64/libgnustep-gui.s2012-05-05 21:04:42
457022GNOMEgnomeUNCONFIRMEDnet-libs/webkit-gtk-1.10.2-r300: WebSockets do not work2013-02-13 19:39:56
456760GNOMEgnomeUNCONFIRMEDgnome-base/gvfs-1.14.2: segfault in gvfsd-obexftp when trying to browse cell phone via bluetooth2013-02-15 20:53:06
455386GNOMEgnomeUNCONFIRMEDnet-misc/vinagre-3.6.2: No toolbar in fullscreen mode after upgrading to gnome 3.6 for RDP2013-02-05 02:29:22
454808LibrarygnomeUNCONFIRMEDnet-libs/webkit-gtk-1.10.2-r300 - File "./Tools/Scripts/run-gtk-tests", line 168: Could not start ac2013-02-08 00:08:40
455222GNOMEgnomeUNCONFIRMEDnet-libs/webkit-gtk - add support for XT PaX marking2013-02-09 20:41:04
454474GNOMEgnomeUNCONFIRMEDnet-im/empathy-3.6.3: history uses wrong encoding to show utf8 logs2013-01-28 22:49:52
453562GNOMEgnomeUNCONFIRMEDx11-libs/gtk+-3.6.3-r2 USE="wayland" - ./.libs/libgdk-3.so: undefined reference to `wl_egl_pixmap_cr2013-01-24 09:23:22
452648GNOMEgnomeUNCONFIRMEDgnome-base/gnome-panel-3.4.2.1: dconf-client.h: No such file or directory2013-01-21 13:53:08
452464GNOMEgnomeUNCONFIRMEDmedia-video/totem-3.6.x: nautilus warning: libtotem-properties-page.so: undefined symbol: bacon_vide2013-01-16 18:49:29
451318GNOMEgnomeUNCONFIRMEDgnome-extra/nemo: "Open in Terminal" does not open a terminal2013-01-11 16:28:05
451532GNOMEgnomeUNCONFIRMEDnet-libs/webkit-gtk-1.10.2 - ALT parameter is not shown instead of the image2013-01-13 09:53:12
452050GNOMEgnomeUNCONFIRMEDgnome-base/gvfs-1.14.2: drop dependency on smbclient use-flag for >=net-fs/samba-4.0.02013-02-18 22:17:40
450260GNOMEgnomeUNCONFIRMEDnet-im/empathy-3.6.2-r2 fails to compile2013-01-04 21:31:54
449496GNOMEgnomeUNCONFIRMEDgnome-base/gnome-shell-3.6.2-r1: on non-gdm systems needs new dependency on gnome-screensaver2013-02-01 16:55:53
449274GNOMEgnomeUNCONFIRMEDnet-im/empathy-3.6.2-r2 main menu doesn't function properly2012-12-30 13:23:21
447500GNOMEgnomeUNCONFIRMEDnet-libs/webkit-gtk-1.8.3 USE=spell - bad utf8 data is being passed to enchant_dict_check2012-12-17 19:41:30
448894DevelopmentgnomeUNCONFIRMEDapp-mobilephone/gnome-phone-manager-0.68 : Only should be included directly2012-12-27 23:08:41
448342GNOMEgnomeUNCONFIRMED[gnome-overlay] =app-admin/gnome-system-tools-3.0.0: undefined reference to `g_thread_init'2012-12-23 23:45:59
436052GNOMEgnomeUNCONFIRMEDgnome-base/gnome-shell-3.4.2 QA Notice: This package installs one or more .desktop files that do not2012-11-21 18:48:32
436054GNOMEgnomeUNCONFIRMEDgnome-base/gnome-control-center-3.4.2-r1 QA Notice: This package installs one or more .desktop files2012-11-25 09:53:38
437226GNOMEgnomeUNCONFIRMEDnet-misc/rygel - provide init scripts2012-11-02 12:37:17
434842GNOMEgnomeUNCONFIRMEDmedia-video/cheese-3.4.2 This package installs one or more .desktop files that do not pass validati2012-11-21 18:48:25
427042GNOMEgnomeUNCONFIRMEDnet-libs/webkit-gtk-1.8.1-r301 ABI=x32 - (?fails to build?)2013-01-16 09:49:18
426452GNOMEgnomeUNCONFIRMED[gnome-overlay] net-libs/webkit-gtk-1.9.4-r300 - Source/WebCore/platform/graphics/texmap/TextureMapp2012-07-29 17:48:32
423993GNOMEgnomeUNCONFIRMEDgnome-base/gnome-keyring: unable to create a new keyring due general protection2013-02-01 20:57:07
422909ApplicationsgnomeUNCONFIRMEDmail-client/evolution-3.2.3-r1 lost configuration information - (evolution:11395): evolution-network2012-06-23 07:38:20
455266genkernelgenkernelUNCONFIRMED=sys-kernel/genkernel-3.4.45 inoperable --disklabel option2013-02-05 11:27:40
455518genkernelgenkernelUNCONFIRMEDsys-kernel/genkernel does not suppert hex numbers in root= kernel commandline2013-02-05 12:30:20
455796genkernelgenkernelUNCONFIRMEDDetect version of building kernel from CALLBACK2013-02-06 05:53:05
453742genkernelgenkernelUNCONFIRMEDgenkernel 3.4.24_p2 cannot build UVC driver for USB webcam - In function `usbvision_write_reg_irq': 2013-01-28 04:52:09
454780Core systemgenkernelUNCONFIRMEDsys-kernel/genkernel-3.4.45 - initramfs unable to switch on real-root on /dev/sdax2013-02-01 22:15:24
452746genkernelgenkernelUNCONFIRMEDgenkernel(8) ramdisk options text2013-01-17 22:52:13
448624genkernelgenkernelUNCONFIRMEDlast step of compile_kernel() does not respect ${KERNEL_OUTPUTDIR} in genkernel-3.4.452012-12-26 01:26:22
448248genkernelgenkernelUNCONFIRMEDsys-kernel/genkernel-3.4.45 does not update /etc/genkernel.conf2012-12-26 11:40:15
401149genkernelgenkernelUNCONFIRMEDcomputer hangs before shutdown with genkernel config when trying suspend to ram2012-01-28 10:25:48
418463genkernelgenkernelUNCONFIRMEDlinuxrc in genkernel's initramfs does not properly deal with bind mounts2012-07-21 17:31:55
420949genkernelgenkernelUNCONFIRMEDGenkernel fails to build busybox for non-default linker ABI2012-11-11 20:22:02
426338genkernelgenkernelUNCONFIRMEDgenkernel 3.4.24_p2: missing separator between old and new kernel version2012-12-03 20:03:30
435358genkernelgenkernelUNCONFIRMEDProvide better semantics for oldconfig, add some new kernel configuration options2012-09-17 20:26:30
439214genkernelgenkernelUNCONFIRMEDsys-kernel/genkernel-3.4.44.2 and sys-fs/mdadm-3.2.3-r2; no auto-detection even with mdadm.conf?2013-01-04 19:27:33
442078genkernelgenkernelUNCONFIRMEDsys-kernel/genkernel-3.4.45 - wrong lvm.static usage2013-01-04 17:15:11
442102genkernelgenkernelUNCONFIRMEDAdd bepo keymap support to genkernel2012-11-06 20:57:30
444574genkernelgenkernelUNCONFIRMEDsys-kernel/genkernel-3.4.45: genkernel/defaults/linuxrc does not handle spaces right2012-11-24 18:40:17
444932genkernelgenkernelUNCONFIRMEDsys-kernel/genkernel-3.4.45: no rtc support with newer kernels2013-02-20 03:36:21
444934genkernelgenkernelUNCONFIRMEDsys-kernel/genkernel-3.4.45: no support for iptables target LOG with gentoo-sources-3.5.72012-12-13 12:03:26
446916genkernelgenkernelUNCONFIRMEDsys-kernel/genkernel-3.4.45 produces bad volume names with --dmraid option2012-12-12 01:41:14
447100genkernelgenkernelUNCONFIRMEDsys-kernel/genkernel should have an option to avoid firmware installation at all2013-02-17 11:31:29
447328genkernelgenkernelUNCONFIRMEDsys-kernel/genkernel-3.4.45: encrypted filesystems from initramfs.mounts cannot be mounted2012-12-15 11:14:42
448156Core systemgenkernelUNCONFIRMEDGenkernel creates broken initramfs image - wrong lvm links blocks booting to a LVM rootfs2013-02-17 02:24:54
458530GamesgamesUNCONFIRMEDsuggest new package: games-rpg/deliantra2013-02-21 03:19:42
373903genkernelgenkernelUNCONFIRMEDsys-kernel/genkernel: initramfs does not open luks container if gpg-encrypted passphases are used2011-07-08 17:41:51
389361Core systemgenkernelUNCONFIRMEDsys-kernel/genkernel-3.4.16 dmraid advises user to install obsolete device-mapper package2012-01-31 02:42:48
389775Core systemgenkernelUNCONFIRMEDsys-kernel/gentoo-sources: install fails with FIRMWARE_IN_KERNEL = y2012-10-27 18:39:39
391443genkernelgenkernelUNCONFIRMEDsys-kernel/genkernel doesnt autodetect the key device if at other address than specified2012-05-12 20:33:06
395095genkernelgenkernelUNCONFIRMEDgenkernel add support for custom location of boot config file2011-12-17 22:26:49
398473genkernelgenkernelUNCONFIRMED[patch] sys-kernel/genkernel v86d support2012-01-12 17:13:07
398477genkernelgenkernelUNCONFIRMED[patch] sys-kernel/genkernel tuxonice-userui support2012-01-12 17:15:12
398601genkernelgenkernelUNCONFIRMED[patch] sys-kernel/genkernel few fixes to splash handling2012-01-12 17:17:06
399265genkernelgenkernelUNCONFIRMEDgenkernel should use menu.lst as default for GRUB_CONF2012-04-13 05:44:28
458456GamesgamesUNCONFIRMEDlxdream needs pax-marking2013-02-20 13:03:54
453466GamesgamesUNCONFIRMEDgames-puzzle/closure - new ebuild2013-01-22 03:19:53
453280GamesgamesUNCONFIRMEDgames-strategy/atom-zombie-smasher - new ebuild2013-01-21 17:58:47
452352GamesgamesUNCONFIRMEDgames-fps/quake2-icculus uses wrong library name on x86(-32) with 64-bit kernel2013-01-15 15:02:35
436730GamesgamesUNCONFIRMEDgames-arcade/wizorb - new ebuild2012-10-17 22:54:48
436600GamesgamesUNCONFIRMEDgames-simulation/fgrun-1.6.0 fails to find dev-games/openscenegraph libs during linking2012-11-08 21:11:12
435818GamesgamesUNCONFIRMEDgames-roguelike/dungeons-of-dredmor-1.1.2.ebuild - new ebuild2012-09-22 08:12:03
435830GamesgamesUNCONFIRMEDgames-action/psychonauts - new ebuild2013-01-20 23:18:02
436272GamesgamesUNCONFIRMEDgames-arcade/bittrip-runner - new ebuild2012-09-29 19:50:54
435362GamesgamesUNCONFIRMEDNew package: games-fps/quake2-aprq22012-09-18 13:55:56
423031GamesgamesUNCONFIRMEDgames-puzzle/mindless-1.6 crash in generating sealed deck2012-08-27 12:45:23
421309GamesgamesUNCONFIRMEDgames-emulation/jpcsp-bin - new ebuild2012-06-16 23:31:27
420755GamesgamesUNCONFIRMEDgames-puzzle/machinarium - new ebuild2012-06-12 02:12:24
420603GamesgamesUNCONFIRMEDgames-roguelike/dungeons-of-dreadmore - new ebuild2012-06-10 23:28:34
420611GamesgamesUNCONFIRMEDgames-strategy/gratuitous-space-battles - new ebuild2012-06-11 00:31:04
420625GamesgamesUNCONFIRMEDgames-arcade/jaspers-journeys - new ebuild2012-06-11 03:58:51
415913GamesgamesUNCONFIRMEDgames-sports/speed-dreams new version 2.0 available - please update2013-01-28 08:07:00
419557GamesgamesUNCONFIRMEDgames-action/cortex-command-0.25 new ebuild2012-06-06 20:46:34
419545GamesgamesUNCONFIRMEDgames-puzzle/chocolate-castle new ebuild2012-06-04 19:50:10
417561GamesgamesUNCONFIRMEDgames-rpg/monsterrpg2: new ebuild2012-10-19 04:48:30
411715GamesgamesUNCONFIRMEDgames-fps/etxreal-0.30 - a heavily improved Quake 3 Arena engine2012-04-30 19:06:16
411295EbuildsgamesUNCONFIRMEDnew ebuild: games-engines/openmw2012-10-14 16:02:59
411385EbuildsgamesUNCONFIRMEDgames-arcade/clonekeenplus2012-04-09 21:43:13
399867GamesgamesUNCONFIRMEDnew ebuilds: games-action/minetest games-action/minetest_game2013-02-20 16:12:41
402741GamesgamesUNCONFIRMEDNew ebuild: games-rpg/analogue-demo - Analogue: A Hate Story2012-02-08 19:14:06
403599GamesgamesUNCONFIRMEDgames-puzzle/gtetrinet-0.7.11-r1 doesn't honor LINGUAS for locale files2012-10-03 10:09:20
404589GamesgamesUNCONFIRMEDgames-arcade/jamestown: new ebuild2012-05-01 02:25:47
406621GamesgamesUNCONFIRMEDgames-board/pioneers better with optional deps2012-03-05 12:53:20
398167GamesgamesUNCONFIRMEDNew ebuild - games-arcade/steelstorm-br2012-06-07 01:47:17
396545GamesgamesUNCONFIRMEDgames-action/supermeatboy - Super Meat Boy (new ebuild)2012-06-19 19:22:13
394625GamesgamesUNCONFIRMEDgames-action/cavestory+ (new ebuild)2013-01-03 05:34:18
389435GamesgamesUNCONFIRMEDgames-puzzle/blocks-that-matter-1.0.0.6 - drill blocks of matter one by one, collect them, and recyc2012-04-30 19:21:22
383829GamesgamesUNCONFIRMEDgames-arcade/diamond-girl (new ebuild)2012-02-07 14:45:53
385557GamesgamesUNCONFIRMEDgames-strategy/frozensynapse - New ebuild for Frozen Synapse2012-06-18 04:40:37
385873GamesgamesUNCONFIRMEDgames-action/survivor: new game, ebuilds provided (1.0.1, 9999)2012-04-30 19:22:26
377321EbuildsgamesUNCONFIRMEDgames-action/hammerfight - New package2012-06-06 20:44:34
378837GamesgamesUNCONFIRMEDgames-puzzle/crayon - new ebuild for Crayon Physics Deluxe: a 2D physics puzzle2012-06-06 20:45:27
378861GamesgamesUNCONFIRMEDandyetitmoves - New Ebuild for And Yet It Moves2012-04-30 19:23:10
379729EbuildsgamesUNCONFIRMEDgames-action/shadowgrounds: new game, ebuilds provided (1.0.1, 9999)2012-02-01 15:26:15
380887GamesgamesUNCONFIRMEDgames-emulation/ssnes (plus libsnes) - SNES emulator based on bsnes (new ebuild)2012-09-04 21:28:30
377307EbuildsgamesUNCONFIRMEDgames-puzzle/cogs - New Ebuild for Cogs2012-06-10 15:31:29
375691GamesgamesUNCONFIRMEDNew Ebuild for sdlhana-0.34, an SDL based hanafuda card game2011-07-22 12:18:47
375237GamesgamesUNCONFIRMEDgames-strategy/netpanzer-0.8.4: version bump request2012-01-24 03:19:29
374475GamesgamesUNCONFIRMEDnwn-data downloads 1.5GB of files only to tell me i need USE=cdinstall in order to proceed2012-10-07 11:42:43
371427GamesgamesUNCONFIRMEDswars-0.3 [new package]2011-06-13 14:57:39
372501GamesgamesUNCONFIRMEDNew ebuilds for Lips Of Suna (lipsofsuna-0.4.0 and git), a dungeon crawl game. Server and Client.2011-08-11 20:35:23
370045GamesgamesUNCONFIRMEDgames-action/gct (new package) - a GTA 2 clone2012-04-30 19:23:48
368413GamesgamesUNCONFIRMED(new package) for the games-fps/enemy-territory-cqb2012-04-30 19:23:59
442052Applicationsfreedesktop-bugsUNCONFIRMEDsys-power/pm-utils-1.4.1-r2 uses deprecated kernel option CONFIG_WIRELESS_EXT_SYSFS2012-11-06 16:06:47
400919Unspecifiedfreedesktop-bugsUNCONFIRMEDnet-libs/libproxy-0.4.7 is linking against gnome-base/gconf2012-01-30 07:57:00
385147Applicationsfreedesktop-bugsUNCONFIRMEDsys-apps/dbus-* crash via xfce4-panel2011-10-16 11:54:02
394875Applicationsford_prefectUNCONFIRMEDmedia-sound/pulseaudio - module-tunnel-sink is unreliable2012-12-15 12:50:15
448998JavafordfrogUNCONFIRMEDdev-util/netbeans UI design view broken2013-02-16 08:41:00
455318LibraryfontsUNCONFIRMEDmedia-libs/freetype[X,-utils] needlessly depends on X libraries2013-02-05 11:37:35
448926EbuildsfontsUNCONFIRMEDmedia-libs/freetype needs a local description of bindist USE-flag2012-12-27 20:19:55
440598Eclasses and ProfilesfontsUNCONFIRMEDfont.eclass outputs elog messages that shoud only be displayed for new installs2012-10-31 16:05:11
431430LibraryfontsUNCONFIRMEDmedia-fonts/libertine-ttf-5.3.0.20120702 version bump2013-01-01 22:02:26
435848ApplicationsfloppymUNCONFIRMEDx11-misc/x11vnc-0.9.13 with net-libs/libvncserver-0.9.9 - buffer overflow detected in /usr/lib/libvn2013-01-20 19:18:24
442814ApplicationsfloppymUNCONFIRMEDnet-misc/freerdp-1.1.0_pre20121004-r1 CMake Error at cunit/CMakeLists.txt:28 (add_executable): Canno2012-11-13 07:00:04
443924ApplicationsfloppymUNCONFIRMEDnet-misc/remmina-1.0.0_p20121004 - When connecting to a RDP server, the icons appear white.2013-02-11 19:16:17
457010ApplicationsfloppymUNCONFIRMEDnet-misc/flexget-1.0.3344: BUG: Unhandled error in plugin --series: Only '='/'!=' operators can be u2013-02-17 18:32:40
406085ServerfloppymUNCONFIRMEDnet-misc/openswan-2.6.37 with USE +caps fails to find cacert (X.509)2012-04-06 22:44:01
453330ApplicationsflameeyesUNCONFIRMEDnet-proxy/squidclamav-6.10: redirection on virus detection does not work2013-01-21 20:20:05
453894ApplicationsflameeyesUNCONFIRMEDnet-misc/lksctp-tools-1.0.12 - src/apps/sctp_darn.c:1870: undefined reference to `sctp_connectx'2013-01-26 01:40:32
453540ApplicationsevermindUNCONFIRMED[pro-audio overlay] media-sound/jack-audio-connection-kit-1.9.9.5: TypeError: 'list' object is not c2013-02-09 17:14:49
368251EbuildsevermindUNCONFIRMED[pro-audio overlay] media-libs/armstrong-9999 ebuild needs updating: distutils.eclass2011-05-23 08:42:25
413581ApplicationsevaUNCONFIRMEDnet-voip/telepathy-salut-0.8.0 - .../work/telepathy-salut-0.8.0/src/.libs/libsalut-plugins.so: file 2013-02-11 14:04:35
408663EselecteselectUNCONFIRMEDAlias 'eselect news read unread' for 'eselect news read new'2012-03-20 20:33:24
376153EselecteselectUNCONFIRMEDRequest: eselect module for managing /etc/init.d/net.* symlinks2011-07-26 10:41:35
419685ServererasUNCONFIRMED=net-proxy/squid-3.1.19: eautoreconf in src_prepare() fails in libltdl/2013-01-08 02:24:49
433171ApplicationserasUNCONFIRMEDnet-proxy/squid - add epatch_user support2012-09-02 18:19:17
414829Applicationseric.joshua.martinUNCONFIRMEDwww-apps/rt-4.0.5: Generated.pm configured directories point to /usr/share/webapps instaed of webapp2012-05-06 22:45:45
415571ServererasUNCONFIRMEDnet-mail/dovecot-2.0.19: crashes every now then when a user tries to login2013-01-04 06:55:59
458354Eclasses and ProfilesembeddedUNCONFIRMEDvideo_cards_geode is masked in profile hardened/linux/uclibc/x862013-02-20 15:30:48
372707EbuildsenlightenmentUNCONFIRMED[enlightenment-overlay] x11-plugins/e_modules-comp-scale: new ebuild2012-12-22 20:35:46
410065ServererasUNCONFIRMEDnet-mail/dovecot-2.1.3 fails at parallel make: fatal error: ../../../src/plugins/quota/rquota.h: No 2012-07-12 15:51:16
446422Eclasses and ProfilesemacsUNCONFIRMEDbzr.eclass might need to use bzr pull’s --overwrite flag2013-01-29 14:59:44
445328DevelopmentdotnetUNCONFIRMEDdev-dotnet/glib-sharp-2.12.10 - libtool: Version mismatch error. This is libtool 2.4.2, but the libt2012-11-30 12:34:52
381073EbuildselvanorUNCONFIRMEDversion bump net-print/xerox-drivers2012-10-09 13:57:57
406503EbuildselvanorUNCONFIRMEDapp-office/openerp-server-6.0.3 version bump2012-03-02 17:28:05
408157ApplicationselvanorUNCONFIRMEDnet-voip/sflphone-1.0.1 should install addressbook plugin2012-03-14 18:10:03
417003ApplicationselvanorUNCONFIRMEDnet-voip/sflphone can be build without pulseaudio2012-11-15 01:07:54
425128EbuildselvanorUNCONFIRMEDnet-voip/sflphone-99992012-07-08 14:12:12
432588EbuildselvanorUNCONFIRMEDnet-voip/sflphone-1.0.1-r1 with net-libs/pjsip-1.8.10 (too old): sipaccount.cpp:612:17: error: ‘pjsi2012-08-24 13:48:14
431916ApplicationsdotnetUNCONFIRMEDdev-dotnet/libgdiplus-2.10.9 - Variable 'libjpeg_prefix' not defined in '/usr/lib64/pkgconfig/libgdi2012-11-09 14:13:30
437122EbuildsdotnetUNCONFIRMEDdev-dotnet/xsp-9999 - live ebuild request2012-10-04 03:37:28
443604LibrarydotnetUNCONFIRMEDdev-dotnet/libgdiplus-2.10 - ../src/.libs/libgdiplus.so: error: undefined reference to 'atan' /// (m2012-11-19 10:30:17
426640EbuildsdotnetUNCONFIRMEDdev-dotnet/smartirc4net-0.4.5.1: fails to build2012-07-21 10:25:06
372453EbuildsdotnetUNCONFIRMEDapp-portage/eclass-manpages - Documentation for mono.eclass is awfull (one line)2011-06-29 10:17:45
449512Third-Party ToolsdolsenUNCONFIRMEDapp-portage/porthole with python3 - File "/usr/lib/portage/pym/portage/__init__.py", line 224, in __2013-02-10 22:16:25
457670Otherdocs-teamUNCONFIRMED[fa] handbook/hb-net-start.xml2013-02-15 08:34:05
457672Otherdocs-teamUNCONFIRMED[FA] handbook/hb-net-wireless.xml2013-02-15 08:37:25
457668Otherdocs-teamUNCONFIRMED[fa] handbook/hb-net-modules.xml2013-02-15 08:30:33
454368Otherdocs-teamUNCONFIRMED[fa] handbook/hb-net-functions.xml2013-01-28 03:07:00
454370Otherdocs-teamUNCONFIRMED[fa] handbook/hb-net-management.xml2013-01-28 03:11:50
454394Other documentsdocs-teamUNCONFIRMED2.6 kernel --> 3.x kernel2013-01-28 07:16:30
445626Installation Handbookdocs-teamUNCONFIRMEDSwap amount in handbook needs a discussion2012-12-02 15:31:04
445186Installation Handbookdocs-teamUNCONFIRMEDA link to the online list of local USE flags is missing in the installation handbook2012-11-29 12:18:57
377179[FR]docs-teamUNCONFIRMEDUpdate need on the French documentation of Xen2012-07-21 15:05:04
382121Otherdocs-teamUNCONFIRMEDThe Suggestion of the new Korean translation for the related documentation2011-09-07 07:25:44
392743Other documentsdocs-teamUNCONFIRMEDImplicit assumptions -> confusion when trying to use printer on a Win7 machine2011-12-29 01:31:50
451574ApplicationsdjcUNCONFIRMEDnet-misc/openvpn-2.2.2: cannot open ifconfig-pool-persist file on startup2013-01-13 10:36:53
442162ApplicationsdjcUNCONFIRMEDnet-misc/openvpn-2.1.4 - src_install: rmdir: failed to remove ‘/var/tmp/portage/net-misc/openvpn-2.12012-11-07 14:09:59
442616DevelopmentdjcUNCONFIRMEDdev-db/couchdb - /usr/lib/couchdb/bin/couchjs needs pax-mark mr on PaX-enabled systems.2013-01-12 18:34:44
397863EbuildsdjcUNCONFIRMEDnet-misc/openvpn: add /var/run/openvpn to be ok with selinux and openvpn-status.log file2012-01-29 16:29:33
456094Ebuildsdev-zeroUNCONFIRMEDnet-misc/aria2-1.16.3 - version bump request2013-02-07 20:55:51
399845Applicationsdev-zeroUNCONFIRMEDnet-nds/gosa-core - wrong apache group in gosa-encrypt-passwords script2012-01-25 13:25:43
455320Applicationsdev-zeroUNCONFIRMEDnet-wireless/blueman-1.23-r2 - blueman crashes when theme misses icon gtk-missing-image2013-02-05 11:38:08
447630Unspecifieddev-zeroUNCONFIRMED=net-misc/openvswitch-1.6.1-r2 - /etc/init.d/ovs-controller: ERROR: ovs-controller needs service(s) 2013-02-12 08:26:14
445966Ebuildsdev-zeroUNCONFIRMEDnet-wireless/blueman should unconditionally depend on x11-themes/gnome-icon-theme?2012-12-04 22:59:24
370985Ebuildsdev-zeroUNCONFIRMEDnet-nds/gosa-core should depend on php[nls] rather when gettext.2011-06-10 15:16:59
458148Unclassifieddev-portageUNCONFIRMEDdev-libs/cyrus-sasl-2.1.25-r4: gzip: stdout: Broken pipe - phase-helpers.sh, line 312: Called __as2013-02-20 22:52:41
438816Coredev-portageUNCONFIRMEDsys-apps/portage-2.1.11.9 : /var/tmp/portage/._unmerge_/ directory not cleaned up2012-10-18 17:51:53
446498Core - Configurationdev-portageUNCONFIRMEDsys-apps/portage should handle typos in make.conf like those at the command line2012-12-08 17:10:05
430132Core - Dependenciesdev-portageUNCONFIRMEDVersioned virtuals cause slot conflict when weak block dependencies could resolve with uninstall2012-08-08 07:44:32
415911Enhancement/Feature Requestsdev-portageUNCONFIRMED/var/log/portage/ not owned by an ebuild2012-05-15 15:24:41
416635Enhancement/Feature Requestsdev-portageUNCONFIRMEDPlease add new var EMERGE_INFO_OPTS for emerge --info2012-05-19 18:57:47
416907Core systemdev-portageUNCONFIRMEDOption to remove orphaned dependencies when using emerge -C2012-12-25 21:12:35
396439Enhancement/Feature Requestsdev-portageUNCONFIRMEDKeep track of packages that need the kernel sources2011-12-30 00:46:36
394419Enhancement/Feature Requestsdev-portageUNCONFIRMEDportage: provide a make.conf option for changing to cgroups (configuring them if needed) on package 2011-12-19 18:43:41
383323Javadev-portageUNCONFIRMEDsys-apps/portage: emerges pulls in older jdk slot when newer slot is masked (newer masked slot remai2012-09-06 19:32:08
453426Developmentdev-embeddedUNCONFIRMEDdev-embedded/avrdude-9999: new ebuild2013-01-22 10:32:13
443154Ebuildsdesktop-wmUNCONFIRMEDx11-wm/pekwm-0.1.15 - Doesn't create xsession attributes, new revision for the ebuild proposed.2013-01-24 16:59:23
436448Applicationsdesktop-miscUNCONFIRMEDx11-misc/parcellite-1.0.2_rc5 generates too many interrupts (as seen in powertop)2012-10-08 19:44:07
449116EbuildsdanielpiUNCONFIRMEDapp-accessibility/julius::sunrise and sci-libs/fplll::sage-on-gentoo both install /usr/bin/generate2012-12-29 11:48:00
447782LibrarycppUNCONFIRMEDdev-libs/boost-1.52.0-r5 - .../temp/environment: line 964: 31328 Segmentation fault b2 "$@"2012-12-19 13:37:44
449266LibrarycppUNCONFIRMEDdev-libs/Ice-3.4.2-r1 - /usr/lib64/libIceGrid.so.34: undefined reference to `IceInternal::upCast(Ice2012-12-31 15:31:18
432980Applicationscommon-lispUNCONFIRMEDdev-lisp/sbcl-1.0.55-r1 fails to compile with "The value 18446744073 is not of type (UNSIGNED-BYTE 32012-08-29 09:14:51
389783Ebuildscommon-lispUNCONFIRMEDdev-lisp/clozurecl-1.7 fails to build (unquoted SVN_REVISION in generated compiler commands)2011-11-08 19:59:04
455516Core systemclusterUNCONFIRMEDsys-fs/gfs2-utils with sys-kernel/hardened-sources-3.7.3 - In file included from conftest.c:84: /usr2013-02-08 16:35:19
455582ServerclusterUNCONFIRMEDsys-cluster/ceph should be started before netmount2013-02-05 12:25:27
436218EbuildsclusterUNCONFIRMEDnet-misc/pssh with dev-lang/python-3.2 - pssh --help: ImportError: No module named version2013-01-04 06:31:50
392681Core systemclusterUNCONFIRMEDsys-devel/distcc[avahi] init script needs to depend on dbus for zeroconf2013-02-03 13:13:16
400771EbuildsclusterUNCONFIRMEDsys-cluster/onesis-2.0.3 version bump2012-01-25 19:13:16
411687ApplicationscjkUNCONFIRMEDapp-i18n/ibus-mozc: support uim-mozc (Mozc engine for app-i18n/uim)2012-04-12 23:00:50
412165EbuildschutzpahUNCONFIRMEDnet-mail/courier-imap-4.10.0 version bump2012-12-17 18:47:08
398151ApplicationschutzpahUNCONFIRMEDnet-mail/courier-imap-4.5.0 error in man page mkpop3dcert2012-01-08 16:37:08
389511EbuildschutzpahUNCONFIRMEDnet-mailcourier-imap-4.9.3 version bump2011-12-06 23:34:54
384031ApplicationschutzpahUNCONFIRMEDnet-analyzer/pchar[pcap] fails to build (possibly glibc version related)2012-08-20 03:39:32
456328ApplicationschithanhUNCONFIRMEDwww-plugins/gnash-08.10-r2 with dev-libs/boost-1.52.0-r5 - ld: sdl_gnash-gnash.o: undefined referenc2013-02-12 14:38:36
432462ApplicationschainsawUNCONFIRMEDnet-im/jabber-base should not provide /var/run/jabber directory2012-08-24 13:26:45
438142ApplicationschainsawUNCONFIRMEDnet-misc/connman-1.4 init script should "provide net"2012-10-12 16:23:51
384617EbuildschainsawUNCONFIRMEDapp-emulation/dynamips fails to compile (w/ can't find a register in class 'GENERAL_REGS')2011-10-31 10:29:49
451316ApplicationscedkUNCONFIRMEDnet-firewall/conntrack-tools-0.9.14 - parse.c:230:34: error: ‘NULL’ undeclared (first use in this fu2013-01-11 16:17:24
418461ApplicationscedkUNCONFIRMEDnet-im/bitlbee initscript should check pidfile2012-09-02 19:44:59
429584EbuildscedkUNCONFIRMEDnet-firewall/nufw - new project name (ufwi), new HOMEPAGE2012-09-23 16:42:15
390365EbuildscedkUNCONFIRMEDEbuild proposal: net-im/bitlbee-99992011-11-13 11:36:31
454560LibrarycardoeUNCONFIRMEDx11-drivers/nvidia-drivers-313.18 with kernel 3.7.4 - NVRM: This PCI I/O region assigned to your NVI2013-02-05 19:04:08
439656EbuildscardoeUNCONFIRMEDmedia-tv/mythtv mythbackend init script should drop need net2012-10-28 04:57:08
428746ApplicationscardoeUNCONFIRMEDnet-misc/netcf-0.1.9 - drv_initscripts.c:1083:15: error: ‘NETCF_TRANSACTION’ undeclared (first use i2012-08-01 04:17:19
433102Core systemcardoeUNCONFIRMEDx11-drivers/nvidia-drivers - CONFIG_AMD_IOMMU causes kernel module to fail?2012-11-13 09:49:39
438248ApplicationscalchanUNCONFIRMEDmedia-video/kino-1.3.4 generates XML DVD indices incompatible with media-video/dvdauthor-0.7.02012-10-15 10:52:33
454384BugzillabugzillaUNCONFIRMEDExtend "My Bugs" list with RESOLVED NEEDINFO and RESOLVED TEST-REQUEST states2013-01-28 15:27:34
426450BugzillabugzillaUNCONFIRMEDUsing "File a new bug" on the bugzilla search result page leads to a different bug entry form than "2012-07-13 13:41:26
380107BugzillabugzillaUNCONFIRMEDBugzilla should have 'need ebuild' field.2011-10-30 23:16:56
374949BugzillabugzillaUNCONFIRMEDSubmitting bugs with attachments without method to determine content type causes error but still cre2011-10-30 23:16:37
373653BugzillabugzillaUNCONFIRMEDUnspecified component kills entered bugdescription2011-10-30 23:17:02
458582Ebuildsbug-wranglersUNCONFIRMED[qt overlay] ebuild for x11-libs/qt-designer-5.0.12013-02-21 12:40:44
458594Applicationsbug-wranglersUNCONFIRMEDlibreoffice-bin: plain text files are opened by default using libreoffice writer, not gedit2013-02-21 14:20:01
458524Librarybug-wranglersUNCONFIRMEDnet-libs/webkit-gtk-1.10.2-r300 - ?2013-02-21 03:09:47
458568Applicationsbug-wranglersUNCONFIRMEDUdisks2 fails to mount flash drive when ACL isn't supported in kernel2013-02-21 13:23:05
458572Applicationsbug-wranglersUNCONFIRMEDnet-im/gajim-0.15.2-r2: can't connect to some servers2013-02-21 11:46:54
458578Applicationsbug-wranglersUNCONFIRMEDapp-misc/geneweb-5.02: Fatal error: OCaml and preprocessor have incompatible versions2013-02-21 12:27:58
458580Ebuildsbug-wranglersUNCONFIRMEDmedia-gfx/sane-backends-1.0.23 unnecessary linking to libnetsnmp.so2013-02-21 12:38:16
458200Core systembug-wranglersUNCONFIRMEDkernel 3.6.11 - ath9k cannot connect to WPA2-PSK network2013-02-21 02:48:39
421017FreeBSDbsdUNCONFIRMEDnet-nds/openldap-2.4.31 links with /lib/libcom_err.so.22012-06-13 18:25:22
454228HardenedbluenessUNCONFIRMEDsys-kernel/hardened-sources-3.2.37-r2 fails to build for ia64: mm/mmap.c:1689:4: error: too few argu2013-02-21 02:26:58
453902HardenedbluenessUNCONFIRMEDsys-kernel/hardened-sources-3.7.0 kernel panic or something like this2013-01-26 15:33:28
437416LibrarybluenessUNCONFIRMEDnet-libs/libmicrohttpd-0.9.21 fails tests with USE="ssl"2012-12-26 13:26:06
438508Core systembluenessUNCONFIRMEDhardened kernel 3.4.9 with ZFS patch - Recursive fault on unsuspending (resuming from RAM) laptop wi2012-10-17 03:55:19
440460ApplicationsbluenessUNCONFIRMEDnet-dns/avahi-0.6.30-r3: some elog messages should only be shown for the first install.2013-01-19 17:29:00
442254EbuildsbluenessUNCONFIRMEDnet-misc/cgminer-2.9.1 version bump2012-12-20 16:37:50
443020ApplicationsbluenessUNCONFIRMEDnet-misc/tor-0.2.4.5_alpha USE=bufferevents [err] channel_closed(): Bug: src/or/channel.c:1315: chan2012-12-12 03:45:35
445578ApplicationsbluenessUNCONFIRMEDnet-p2p/bitcoind - Hardcoded paths (/var/run/bitcoind.pid, /usr/bin/bitcoind, var directory) in init2013-02-12 03:34:41
447826Core systembluenessUNCONFIRMEDsys-kernel/hardened-sources-2.6.32-r143 fails to compile for ia64: include/linux/random.h:91:19: err2013-01-18 23:15:20
434914ApplicationsbluenessUNCONFIRMEDapp-admin/webapp-config: Manage recursive server-owned dirs independently2012-11-01 08:18:58
436680ApplicationsbluenessUNCONFIRMEDapp-admin/webapp-config wrong permissions for vhost_perms_defaultowned_dir2012-10-01 00:54:40
434916ApplicationsbluenessUNCONFIRMEDapp-admin/webapp-config, SELinux support: set 'server-owned' file as rw content2012-09-21 18:37:35
434894ApplicationsbluenessUNCONFIRMEDapp-admin/webapp-config: Bad permissions for server-owned dirs (umask 022)2012-09-13 14:23:46
432206ApplicationsbluenessUNCONFIRMEDnet-misc/arm with dev-lang/python:3.2 - SyntaxError: invalid syntax in print "TorCtl successfully in2013-01-15 13:00:59
431048Core systembluenessUNCONFIRMEDsys-kernel/hardened-sources-3.4.7 panic on UP->SMP transition when putting CPU core online - BUG: un2013-01-18 20:53:51
410477ApplicationsbluenessUNCONFIRMEDnet-p2p/bitcoind-0.5* - init.d script's stop action fails to stop daemon2013-01-25 18:58:34
401317ApplicationsbluenessUNCONFIRMEDnet-misc/curl-7.24.0: test cases failed: 1007 1009 1049 1093 1094 10992012-03-24 18:04:32
453500ApplicationsbircophUNCONFIRMEDapp-doc/root-docs-5.34.03 - Error: Function Open(filename,"RECREATE") is not defined in current scop2013-02-19 19:12:58
374505ApplicationsbluenessUNCONFIRMEDdev-util/gperf-3.0.4: compile error collect2: ld returned 1 exit status2012-02-04 01:23:02
427972PrintingbillieUNCONFIRMEDnet-print/hplip - Scanning with hplip fails: Invalid argument2012-11-13 18:44:02
434830PrintingbillieUNCONFIRMEDnet-print/hplip-3.12.6-r1 - checks for updates when configured not to (default)2012-11-18 13:42:03
449272PrintingbillieUNCONFIRMEDnet-print/hplip-3.12.11 may remove user from all groups except lp2013-02-01 09:18:39
371083ApplicationsbilllUNCONFIRMEDmedia-video/ogmrip - add support for ogg container2012-03-26 09:37:04
403455ApplicationsbilllUNCONFIRMEDmedia-video/ogmrip-0.13.7 - configure.in:132: error: possibly undefined macro: AM_GCONF_SOURCE_22012-02-15 17:31:54
374699ApplicationsbinkiUNCONFIRMEDdev-libs/lzo need LDFLAGS -no-undefined to build DLL for CHOST *-*-mingw322011-12-02 03:19:46
458290Core systembase-systemUNCONFIRMEDsys-apps/groff-1.21, sys-apps/man-1.6g: Japanese manpages illegible2013-02-21 02:51:56
458518Core systembase-systemUNCONFIRMED=net-misc/iputils-20121221-r1 needs sys-libs/libcap in pkg_postinst()2013-02-21 10:14:40
457558Librarybase-systemUNCONFIRMEDsys-libs/readline-6.2_p4 fails with ncurses[tinfo]2013-02-14 18:20:16
457026Core systembase-systemUNCONFIRMEDnet-misc/openssh: no host keys generated on systemd based system2013-02-20 18:21:40
455524Core systembase-systemUNCONFIRMEDnet-misc/openssh-6.1: update HPN patchset2013-02-05 23:49:53
454248Core systembase-systemUNCONFIRMEDnet-misc/openssh-6.1_p1-r1: ssh login with key hangs2013-01-28 12:38:04
453098Core systembase-systemUNCONFIRMEDsys-devel/patch-2.7.1-r1: fails tests crlf-handling and need-filename2013-01-21 11:54:50
448906Miscbase-systemUNCONFIRMEDnet-firewall/iptables-1.4.16.3 upgrade does not preserve state matches2013-01-02 20:09:23
447530Ebuildsbase-systemUNCONFIRMEDnet-firewall/iptables[netlink] - please add support for loading fingerprint definitions from pf.os f2013-02-16 14:09:37
444232Core systembase-systemUNCONFIRMEDsys-apps/coreutils: Add USE=hostname for those who do not want net-tools2012-11-27 05:09:49
441970Core systembase-systemUNCONFIRMEDnet-misc/dhcp: Fedora patches should be considered for inclusion2012-11-14 18:55:55
440438Core systembase-systemUNCONFIRMEDnet-misc/ntp-4.2.6_p5-r1: some elog messages should only be shown for the first install.2012-11-06 21:40:35
439728Core systembase-systemUNCONFIRMEDnet-misc/ntp with sys-libs/glibc-2.15-r3 - ntpq -p: Request timed out2012-10-26 16:32:10
439504Core systembase-systemUNCONFIRMEDnet-misc/ethercard-diag - command is called ether-wake but man page is called etherwake2012-10-24 15:15:54
437114Core systembase-systemUNCONFIRMEDnet-misc/dhcp does not work on virtual machines that use virtio2012-10-04 03:36:06
432652Applicationsbase-systemUNCONFIRMEDnet-misc/dhcp - dhclient (ipv6) not enabled for ppp devices2012-12-02 10:22:16
431054Applicationsbase-systemUNCONFIRMEDnet-misc/icecast-2.3.3 USE=yp - libtool linker mangles CFLAGS ( x86_64-pc-linux-gnu-gcc: error: l1-c2012-08-12 20:10:16
429462Core systembase-systemUNCONFIRMEDnet-misc/rsync - add --copy-devices support2012-08-02 11:50:17
426986Core systembase-systemUNCONFIRMEDsys-fs/cryptsetup-1.4.1: initscript ignores last line of conf. file2013-01-18 11:31:09
423593Core systembase-systemUNCONFIRMEDnet-misc/openssh-6.0_p1-r1: ssh hangs with 100% cpu connecting to HPUX sshd2012-11-12 12:36:02
423591Core systembase-systemUNCONFIRMEDsys-block/open-iscsi does not work on 32bit userland and 64bit kernel2012-10-22 16:10:55
422877Core systembase-systemUNCONFIRMEDnet-firewall/iptables: ip6tables "state" test fails; will not jump to ACCEPT on ESTABLISHED,RELATED 2013-02-16 13:31:38
418287Core systembase-systemUNCONFIRMEDsys-boot/grub-0.97-r11 - Failed Running autoconf ! - configure.ac:59: error: possibly undefined macr2012-10-09 04:21:54
418181Ebuildsbase-systemUNCONFIRMEDmedia-video/vlc 2.0.1 or newer should depend on gettext 0.18.1 or newer2012-09-19 13:10:58
412579Core systembase-systemUNCONFIRMEDnet-misc/wget-1.13.4-r1 - Add libproxy support2012-04-21 05:34:30
414857Core systembase-systemUNCONFIRMEDnet-firewall/iptables-1.4.12.1-r1 and -1.4.13: hack to use saner kernel-headers should be replaced b2013-02-16 14:07:42
405581Core systembase-systemUNCONFIRMEDapp-admin/sudo with net-nds/openldap-1.8.4_p1 - sudo: sudo_ldap_build_pass1 allocation mismatch2012-02-24 16:05:21
403119Core systembase-systemUNCONFIRMEDReplace sys-apps/microcode-data with a separate sys-kernel/intel-ucode2013-01-01 21:57:37
401501Core systembase-systemUNCONFIRMEDapp-admin/sysklogd-1.5-r2: syslogd: /var/log/news/news.crit: No such file or directory2012-02-05 15:19:16
394535Core systembase-systemUNCONFIRMEDall netkit packages: ftp.uk.linux.org is dead2011-12-21 00:03:17
389487Core systembase-systemUNCONFIRMEDnet-misc/keychain - keychain matches all (too many) processes with "ssh-agent" in cmdline2012-09-19 20:23:16
384731Core systembase-systemUNCONFIRMEDsys-devel/libtool-2.4-r3 fails tests 42, 84, 112 on hardened2011-11-21 22:32:49
383339Applicationsbase-systemUNCONFIRMEDapp-admin/syslog-ng-3.2.4: init script fails to start with ethernet bonding2011-09-19 10:38:08
382451Core systembase-systemUNCONFIRMEDapp-misc/ca-certificates-20110502: older verisign cert breaks with newer verisign cert2011-10-08 19:36:05
376125Applicationsbase-systemUNCONFIRMEDnet-misc/keychain-2.7.1 does not store gpg keys2012-09-19 20:23:16
367553Core systembase-systemUNCONFIRMEDnet-misc/openssh - sshd sessions don't get killed when system goes down or reboots2013-02-11 16:00:41
446736Applicationsarmin76UNCONFIRMEDnet-misc/tigervnc-1.2.0 - vncviewer segfaults when dismissing context menu2012-12-11 15:16:48
381123Applicationsarmin76UNCONFIRMEDx11-drivers/xf86-video-intel[sna] CPU load very high when remotely connecting to a local X-Server us2012-09-16 18:39:43
368997Ebuildsarmin76UNCONFIRMEDnet-misc/tightvnc: /etc/ini.d/vnc failes to start when media-fonts/font-misc-misc is installed with 2012-06-23 17:45:55
409641DevelopmentaraujoUNCONFIRMEDdev-lang/io-2009.01.02-r2: Uncomment the IO_USE_SIMD define to turn on SIMD acceleration2012-12-24 08:55:55
386059Libraryarfrever.ftaUNCONFIRMEDnet-libs/neon uses deprecated function gnutls_certificate_verify_peers() of gnutls2012-04-01 12:04:01
456362Libraryarfrever.ftaUNCONFIRMEDnet-libs/neon with >=dev-libs/openssl-1.0.1 - net-fs/davfs2 and net-misc/cadaver fail to connect to 2013-02-12 22:59:56
439894Applicationsapp-dictsUNCONFIRMEDapp-text/stardict - configure.ac:310: error: possibly undefined macro: AM_GCONF_SOURCE_22012-10-27 18:48:47
451400Applicationsapp-dictsUNCONFIRMEDapp-dicts/wordnet with dev-lang/tcl-8.6.0 - replace interp -> result by call to Tcl_SetResult() rout2013-02-01 06:55:10
411861Ebuildsapp-backupUNCONFIRMEDapp-backup/backuppc-3.2.1-r1 needs several apache modules: ebuild should enforce that2012-04-14 05:51:11
458416ApplicationsangelosUNCONFIRMEDnet-wireless/ndiswrapper-1.58_rc1 with sys-kernel/vanilla-sources-3.8.0 - [...]/work/ndiswrapper-1.52013-02-20 14:35:53
436598Applicationsandrej.filipcicUNCONFIRMEDnet-fs/openafs-1.6.1-r1 USE=doc - dodoc: doc/txt/winnotes is a directory2012-11-19 13:16:17
454242Core systemandrej.filipcicUNCONFIRMEDnet-fs/openafs-1.6.2_pre3 USE=doc - !!! dodoc: doc/txt/winnotes is a directory2013-02-06 16:08:22
436596Applicationsandrej.filipcicUNCONFIRMEDnet-fs/openafs-1.6.1-r1: parallel build failure - In file included from db_dump.c:31:0: database.h:12012-09-29 15:38:55
412119Ebuildsandrej.filipcicUNCONFIRMEDnet-fs/openafs-1.6.1 should install user-friendly docs (and not docbook files)2012-09-24 06:59:46
398253Applicationsandrej.filipcicUNCONFIRMEDnet-fs/openafs-1.6.1_pre1/1.6.1 does not build against 3.1.6/3.2.0-r1 kernel and heimdal-1.5.1-r1/12012-10-29 15:36:44
458060Applicationsandreis.vinogradovsUNCONFIRMEDdev-libs/xmlrpc-c-1.28.03-r1 - xmlrpc crashes when trying to connect to an XMLRPC server2013-02-19 20:25:14
446682Applicationsamd64UNCONFIRMEDapp-emulation/emul-linux-x86* - new libraries for steam platform2013-02-20 22:44:38
417191Ebuildsamd64UNCONFIRMEDapp-emulation/emul-linux-x86-gtklibs-20120520 needs pax marking - gtk-query-immodules-2.0-32: error 2012-12-12 16:42:02
380957OtheraltUNCONFIRMEDdev-libs/newt: failed to compile on Mac OSX2011-09-13 15:59:04
456114Applicationsalsa-bugsUNCONFIRMEDmedia-sound/alsa-tools[ALSA_CARDS="indigoio"] - echomixer needs media-fonts/font-misc-misc2013-02-09 16:24:29
447578Unspecifiedalsa-bugsUNCONFIRMEDmedia-sound/alsa-utils-? with kernel 3.7.0 - alsactl: set_control:1464: Cannot write control '3:3:0:2013-01-25 17:23:47
438844Applicationsalsa-bugsUNCONFIRMEDmedia-sound/alsa-utils[pulseaudio]: alsasound init.d script generates pulse state files in /2012-12-16 03:05:14
432890Applicationsalsa-bugsUNCONFIRMEDmedia-libs/alsa-lib w/ net-im/skype: snd_pcm_avail_update() returned a value that is exceptionally l2012-09-09 08:42:31
450248ApplicationsalonblUNCONFIRMEDapp-laptop/laptop-mode-tools-1.62: /usr/sbin/laptop_mode: line 239: .: /etc/laptop-mode/conf.d/board2013-02-10 19:55:43
431988EbuildsalexxyUNCONFIRMEDnet-wireless/wimax-1.5.2-r1 should not RDEPEND on sys-kernel/linux-headers2013-01-01 21:48:39
431990EbuildsalexxyUNCONFIRMEDnet-wireless/wimax-tools-1.4.5-r1 should have dev-libs/libnl in RDEPEND2013-01-01 21:47:54
427496ApplicationsalexxyUNCONFIRMEDnet-wireless/wimax-1.5.2-r1 with net-wireless/wpa_supplicant-1.0 USE=wimax - undefined reference to 2013-01-05 12:47:50
431920EbuildsalexxyUNCONFIRMEDnet-wireless/wimax-1.5.2-r1 installs /var/log/wimax with mode 7772013-01-01 21:49:31
390231EbuildsalexxyUNCONFIRMEDsys-fs/ocfs2-tools-1.6.4 init scripts not working on kernel 3.X2012-12-25 18:46:59
402493ApplicationsadaUNCONFIRMEDdev-ada/adasockets-1.8.4.7 - gnatmake: "listener.adb" compilation error2012-02-07 17:45:08
449716ApplicationsaballierUNCONFIRMEDnet-nntp/hellanzb.0.13-r8 - hellanzb.py: ImportError: cannot import name _NO_FILENO2013-01-02 10:57:50
408191EbuildsaballierUNCONFIRMEDnet-nntp/hellanzb uses deprecated opts in init script2012-06-07 16:11:26
431774LibraryaballierUNCONFIRMEDdev-ml/lwt-2.4.0 USE=doc - File "src/text/lwt_text.mli", line 48, characters 41-51: Error: Unbound m2012-08-18 15:06:00
331685Prefix SupportsysadminUNCONFIRMEDnet-analyzer/nrpe, net-analyzer/nagios-plugins: Gentoo Prefix support2012-08-24 13:27:59
456292OthertenUNCONFIRMEDLiveDVD 20121221: Kernel cannot detect BIOS RAID array2013-02-10 06:48:14
283819VulnerabilitiessecurityUNCONFIRMEDnet-p2p/bittorrent: Web interface DoS (CVE-2008-7166)2011-09-15 07:37:49
436080PrintingprintingUNCONFIRMEDnet-print/cups-1.6.1 - overlays characters in output to printer2012-09-24 14:54:55
298753EbuildsnetmonUNCONFIRMEDnet-analyzer/rrdtool - src_configure() hangs at: configure:19935: checking if msync with MS_ASYNC up2011-06-01 15:21:23
258018Applicationsnet-mailUNCONFIRMEDmail-mta/ssmtp-2.62-r8: blank password sent if ssmtp.conf defines password containing '#'2012-12-21 12:48:02
446696Applicationsnet-fsUNCONFIRMEDrevdep-rebuild selectes net-fs/ncpfs - QA Notice: Missing soname symlink(s): usr/lib/libncp.so.2.3 2012-12-10 20:02:00
366875Ebuildsmaintainer-wantedUNCONFIRMED[new package] sys-fs/gdatafs - Gdatafs is a FUSE implemtation that mount picassa web and youtube to 2011-12-08 06:16:16
366051Ebuildsmaintainer-wantedUNCONFIRMEDAdd ebuild for NOC, Operation Support System (OSS) and Enterprise Network Operation Centers.2012-09-01 12:24:51
338768Ebuildsmaintainer-wantedUNCONFIRMEDdev-dotnet/nlucene (new package)2011-06-24 16:22:12
109031Ebuildsmaintainer-wantedUNCONFIRMEDccscript3-0.8.1.ebuild (New Package)2011-05-16 11:28:07
370099Ebuildsmaintainer-neededUNCONFIRMEDmedia-sound/line6usb kernel sources accessed through /lib/modules/`uname -r`2012-12-01 08:18:42
350685Unspecifiedmaintainer-neededUNCONFIRMEDnet-misc/htpdate-1.0.4 segfaults with -b command line option2012-03-04 09:21:29
312161GNOMEgnomeUNCONFIRMEDgnome-base/libbonobo-2.24.2 fails to build on hardened with2013-02-19 13:28:21
369923GamesgamesUNCONFIRMEDgames-action/trine-bin Filesize does not match recorded size2011-06-03 17:20:29
381925Applicationsc1pherUNCONFIRMEDnet-ftp/yafc-1.1.2 debug and ls does not work2011-09-20 19:38:06
383363UnspecifiedbilllUNCONFIRMEDmedia-video/ogmrip-0.13.6 needs threads patch to enable multithreading2011-09-19 18:57:43
436916Keywording and Stabilizationbase-systemUNCONFIRMEDsys-boot/lilo-22.8-r2: Fatal: Setup length exceeds 31 maximum; kernel setup will overwrite boot load2013-01-27 14:59:32
146951Core systemalphaUNCONFIRMEDsys-fs/quota - value too large for defined data type on Alpha systems2011-12-02 19:03:44
339725EbuildsaballierUNCONFIRMEDmedia-sound/lmms fails to build remote_vst_plugin: winebuild: as --32 failed with status 12011-04-19 16:10:52


back
Please read "Why adblockers are bad".



other Ads
Trace My Cash
Wenn Sie sich schon immer mal gefragt haben, wo eigentlich Ihr geliebtes Bargeld geblieben ist, finden Sie hier vielleicht die Antwort.
www.tracemycash.com
Other free services
toURL.org
Shorten long
URLs to short
links like
http://tourl.org/2
tourl.org
.
Reverse DNS lookup
Find out which hostname(s)
resolve to a
given IP or other hostnames for the server
www.reversednslookup.org

New Packages

- as rdf newsfeed
- as rss newsfeed
- as Atom newsfeed
2017-07-21
clion - 2017.2
Ebuild name:

dev-util/clion-2017.2

Description

A complete toolset for C and C++ development

Added to portage

2017-07-21

ctags - 20170704
Ebuild name:

dev-util/ctags-20170704

Description

Exuberant Ctags creates tags files for code browsing in editors

Added to portage

2017-07-21

cython - 0.26
Ebuild name:

dev-python/cython-0.26

Description

A Python to C compiler

Added to portage

2017-07-21

geany-plugins - 1.31
Ebuild name:

dev-util/geany-plugins-1.31

Description

A collection of different plugins for Geany

Added to portage

2017-07-21

gf2x - 1.2
Ebuild name:

dev-libs/gf2x-1.2

Description

C/C++ routines for fast arithmetic in GF(2)[x]

Added to portage

2017-07-21

java-sdk-docs - 1.8.0.141
Ebuild name:

dev-java/java-sdk-docs-1.8.0.141

Description

Oracle's documentation bundle (including API) for Java SE

Added to portage

2017-07-21

llvmlite - 0.19.0
Ebuild name:

dev-python/llvmlite-0.19.0

Description

Python wrapper around the llvm C++ library

Added to portage

2017-07-21

lutris - 0.3.8
Ebuild name:

games-util/lutris-0.3.8

Description

Gaming platform for GNU/Linux

Added to portage

2017-07-21

ntl - 10.5.0
Ebuild name:

dev-libs/ntl-10.5.0

Description

High-performance and portable Number Theory C++ library

Added to portage

2017-07-21

numba - 0.34.0
Ebuild name:

dev-python/numba-0.34.0

Description

NumPy aware dynamic Python compiler using LLVM

Added to portage

2017-07-21

opera-beta - 47.0.2631.28
Ebuild name:

www-client/opera-beta-47.0.2631.28

Description

A fast and secure web browser

Added to portage

2017-07-21

oracle-jdk-bin - 1.8.0.141
Ebuild name:

dev-java/oracle-jdk-bin-1.8.0.141

Description

Oracle's Java SE Development Kit

Added to portage

2017-07-21

oracle-jre-bin - 1.8.0.141
Ebuild name:

dev-java/oracle-jre-bin-1.8.0.141

Description

Oracle's Java SE Runtime Environment

Added to portage

2017-07-21

pillow - 4.2.1-r1
Ebuild name:

dev-python/pillow-4.2.1-r1

Description

Python Imaging Library (fork)

Added to portage

2017-07-21

skypeforlinux - 5.4.0.1
Ebuild name:

net-im/skypeforlinux-5.4.0.1

Description

P2P Internet Telephony (VoiceIP) client

Added to portage

2017-07-21

snappy - 0.5.1
Ebuild name:

dev-python/snappy-0.5.1

Description

Python library for the snappy compression library from Google

Added to portage

2017-07-21

sphinx_rtd_theme - 0.2.4
Ebuild name:

dev-python/sphinx_rtd_theme-0.2.4

Description

ReadTheDocs.org theme for Sphinx

Added to portage

2017-07-21

strictures - 2.0.3
Ebuild name:

dev-perl/strictures-2.0.3

Description

Turn on strict and make most warnings fatal

Added to portage

2017-07-21

vulkan-loader - 1.0.54.0
Ebuild name:

media-libs/vulkan-loader-1.0.54.0

Description

Vulkan Installable Client Driver (ICD) Loader

Added to portage

2017-07-21

2017-07-20
biniou - 1.2.0
Ebuild name:

dev-ml/biniou-1.2.0

Description

A binary data serialization format inspired by JSON for OCaml

Added to portage

2017-07-20

cacti - 1.1.13
Ebuild name:

net-analyzer/cacti-1.1.13

Description

Cacti is a complete frontend to rrdtool

Added to portage

2017-07-20

cacti-spine - 1.1.13
Ebuild name:

net-analyzer/cacti-spine-1.1.13

Description

Spine is a fast poller for Cacti (formerly known as Cactid)

Added to portage

2017-07-20

chrome-binary-plugins - 60.0.3112.72_beta
Ebuild name:

www-plugins/chrome-binary-plugins-60.0.3112.72_beta

Description

Binary plugins from Google Chrome for use in Ch

Added to portage

2017-07-20

chrome-binary-plugins - 61.0.3159.5_alpha
Ebuild name:

www-plugins/chrome-binary-plugins-61.0.3159.5_alpha

Description

Binary plugins from Google Chrome for use in Ch

Added to portage

2017-07-20

chromium - 61.0.3159.5
Ebuild name:

www-client/chromium-61.0.3159.5

Description

Open-source version of Google Chrome web browser

Added to portage

2017-07-20

cmake - 3.9.0
Ebuild name:

dev-util/cmake-3.9.0

Description

Cross platform Make

Added to portage

2017-07-20

deltup - 0.4.6-r1
Ebuild name:

app-portage/deltup-0.4.6-r1

Description

Delta-Update - patch system for updating source-archives.

Added to portage

2017-07-20

faac - 1.29.2
Ebuild name:

media-libs/faac-1.29.2

Description

Free MPEG-4 audio codecs by AudioCoding.com

Added to portage

2017-07-20

faad2 - 2.8.1
Ebuild name:

media-libs/faad2-2.8.1

Description

AAC audio decoding library

Added to portage

2017-07-20

facter - 3.7.1
Ebuild name:

dev-ruby/facter-3.7.1

Description

A cross-platform ruby library for retrieving facts from operating systems

Added to portage

2017-07-20

fontconfig - 2.12.4
Ebuild name:

media-libs/fontconfig-2.12.4

Description

A library for configuring and customizing font access

Added to portage

2017-07-20

git-lfs - 2.2.1
Ebuild name:

dev-vcs/git-lfs-2.2.1

Description

command line extension and specification for managing large files with Git

Added to portage

2017-07-20

google-chrome-beta - 60.0.3112.72
Ebuild name:

www-client/google-chrome-beta-60.0.3112.72

Description

The web browser from Google

Added to portage

2017-07-20

google-chrome-unstable - 61.0.3159.5
Ebuild name:

www-client/google-chrome-unstable-61.0.3159.5

Description

The web browser from Google

Added to portage

2017-07-20

grip - 3.4.3
Ebuild name:

media-sound/grip-3.4.3

Description

GTK+ based Audio CD Player/Ripper

Added to portage

2017-07-20

gsoap - 2.8.49
Ebuild name:

net-libs/gsoap-2.8.49

Description

A cross-platform open source C and C++ SDK for SOAP/XML Web services

Added to portage

2017-07-20

gtk+ - 3.22.17
Ebuild name:

x11-libs/gtk+-3.22.17

Description

Gimp ToolKit +

Added to portage

2017-07-20

habitat - 0.26.1
Ebuild name:

sys-apps/habitat-0.26.1

Description

Application automation framework

Added to portage

2017-07-20

harfbuzz - 1.4.7
Ebuild name:

media-libs/harfbuzz-1.4.7

Description

An OpenType text shaping engine

Added to portage

2017-07-20

labltk - 8.06.3
Ebuild name:

dev-ml/labltk-8.06.3

Description

OCaml interface to the Tcl/Tk GUI framework

Added to portage

2017-07-20

libbsd - 0.8.6
Ebuild name:

dev-libs/libbsd-0.8.6

Description

An library to provide useful functions commonly found on BSD systems

Added to portage

2017-07-20

libgcrypt - 1.8.0-r1
Ebuild name:

dev-libs/libgcrypt-1.8.0-r1

Description

General purpose crypto library based on the code used in GnuPG

Added to portage

2017-07-20

libguestfs - 1.28.5-r3
Ebuild name:

app-emulation/libguestfs-1.28.5-r3

Description

Tools for accessing, inspect and modifying virtual machine (VM)

Added to portage

2017-07-20

libjpeg-turbo - 1.5.2
Ebuild name:

media-libs/libjpeg-turbo-1.5.2

Description

MMX, SSE, and SSE2 SIMD accelerated JPEG library

Added to portage

2017-07-20

lumina - 1.2.0_p1
Ebuild name:

x11-wm/lumina-1.2.0_p1

Description

Lumina desktop environment

Added to portage

2017-07-20

lumina - 1.3.0_p1
Ebuild name:

x11-wm/lumina-1.3.0_p1

Description

Lumina desktop environment

Added to portage

2017-07-20

lyx - 2.2.3-r1
Ebuild name:

app-office/lyx-2.2.3-r1

Description

WYSIWYM frontend for LaTeX, DocBook, etc.

Added to portage

2017-07-20

mariadb - 10.2.7
Ebuild name:

dev-db/mariadb-10.2.7

Description

An enhanced, drop-in replacement for MySQL

Added to portage

2017-07-20

mariadb - 5.5.57
Ebuild name:

dev-db/mariadb-5.5.57

Description

Added to portage

2017-07-20

mcollective - 2.11.1
Ebuild name:

app-admin/mcollective-2.11.1

Description

Framework to build server orchestration or parallel job execution syst

Added to portage

2017-07-20

mgba - 0.6.0
Ebuild name:

games-emulation/mgba-0.6.0

Description

A new Game Boy Advance emulator written in C.

Added to portage

2017-07-20

mosquitto - 1.4.14
Ebuild name:

app-misc/mosquitto-1.4.14

Description

An Open Source MQTT v3 Broker

Added to portage

2017-07-20

mpv - 0.26.0
Ebuild name:

media-video/mpv-0.26.0

Description

Media player based on MPlayer and mplayer2

Added to portage

2017-07-20

mysql - 5.5.57
Ebuild name:

dev-db/mysql-5.5.57

Description

Added to portage

2017-07-20

net-http-persistent - 3.0.0
Ebuild name:

dev-ruby/net-http-persistent-3.0.0

Description

Manages persistent connections using Net plus a speed fix for Ru

Added to portage

2017-07-20

nokogumbo - 1.4.13
Ebuild name:

dev-ruby/nokogumbo-1.4.13

Description

A Nokogiri interface to the Gumbo HTML5 parser

Added to portage

2017-07-20

oniguruma - 5.9.6_p1-r1
Ebuild name:

dev-libs/oniguruma-5.9.6_p1-r1

Description

a regular expression library for different character encodings

Added to portage

2017-07-20

oniguruma - 6.4.0
Ebuild name:

dev-libs/oniguruma-6.4.0

Description

a regular expression library for different character encodings

Added to portage

2017-07-20

opera - 46.0.2597.57
Ebuild name:

www-client/opera-46.0.2597.57

Description

A fast and secure web browser

Added to portage

2017-07-20

parted - 2.4-r1
Ebuild name:

sys-block/parted-2.4-r1

Description

Create, destroy, resize, check, copy partitions and file systems

Added to portage

2017-07-20

parted - 3.1-r2
Ebuild name:

sys-block/parted-3.1-r2

Description

Create, destroy, resize, check, copy partitions and file systems

Added to portage

2017-07-20

parted - 3.2-r2
Ebuild name:

sys-block/parted-3.2-r2

Description

Create, destroy, resize, check, copy partitions and file systems

Added to portage

2017-07-20

path_expander - 1.0.2
Ebuild name:

dev-ruby/path_expander-1.0.2

Description

Pre-process CLI arguments expanding directories into their constituent

Added to portage

2017-07-20

pygments_rb - 1.1.2
Ebuild name:

dev-ruby/pygments_rb-1.1.2

Description

Pygments syntax highlighting in ruby

Added to portage

2017-07-20

rack-attack - 5.0.1
Ebuild name:

dev-ruby/rack-attack-5.0.1

Description

A DSL for blocking & throttling abusive clients

Added to portage

2017-07-20

salt - 2016.11.6
Ebuild name:

app-admin/salt-2016.11.6

Description

Salt is a remote execution and configuration manager

Added to portage

2017-07-20

scanmem - 0.16.1
Ebuild name:

dev-util/scanmem-0.16.1

Description

Locate and modify variables in executing processes

Added to portage

2017-07-20

sedutil - 1.15
Ebuild name:

sys-block/sedutil-1.15

Description

The Drive Trust Alliance Self Encrypting Drive Utility

Added to portage

2017-07-20

spidermonkey - 52.2.0_pre20170719
Ebuild name:

dev-lang/spidermonkey-52.2.0_pre20170719

Description

Stand-alone JavaScript C++ library

Added to portage

2017-07-20

swi-prolog - 7.5.4
Ebuild name:

dev-lang/swi-prolog-7.5.4

Description

free, small, and standard compliant Prolog compiler

Added to portage

2017-07-20

tcpflow - 1.4.5_p4-r1
Ebuild name:

net-analyzer/tcpflow-1.4.5_p4-r1

Description

A tool for monitoring, capturing and storing TCP connections flows

Added to portage

2017-07-20

texmaker - 5.0
Ebuild name:

app-office/texmaker-5.0

Description

A nice LaTeX-IDE

Added to portage

2017-07-20

tortoisehg - 4.2.2
Ebuild name:

dev-vcs/tortoisehg-4.2.2

Description

Set of graphical tools for Mercurial

Added to portage

2017-07-20

wireshark - 2.2.8
Ebuild name:

net-analyzer/wireshark-2.2.8

Description

A network protocol analyzer formerly known as ethereal

Added to portage

2017-07-20

wireshark - 2.4.0
Ebuild name:

net-analyzer/wireshark-2.4.0

Description

A network protocol analyzer formerly known as ethereal

Added to portage

2017-07-20

xlockmore - 5.55_alpha
Ebuild name:

x11-misc/xlockmore-5.55_alpha

Description

Just another screensaver application for X

Added to portage

2017-07-20

xpra - 2.0.3
Ebuild name:

x11-wm/xpra-2.0.3

Description

X Persistent Remote Apps (xpra) and Partitioning WM (parti) based on wimpiggy

Added to portage

2017-07-20

yc - 5.2.1
Ebuild name:

app-emacs/yc-5.2.1

Description

Yet another Canna client on Emacsen

Added to portage

2017-07-20

yojson - 1.4.0
Ebuild name:

dev-ml/yojson-1.4.0

Description

JSON parsing and pretty-printing library for OCaml

Added to portage

2017-07-20

rdf newsfeed | rss newsfeed | Atom newsfeed
- Powered by LeopardCMS - Running on Gentoo -
Copyright 2004-2017 Sascha Nitsch Unternehmensberatung UG(haftungsbeschänkt)
Valid XHTML1.1 : Valid CSS : buttonmaker
- Level Triple-A Conformance to Web Content Accessibility Guidelines 1.0 -
- Copyright and legal notices -
Time to create this page: 13.4 ms
system status display