from small one page howto to huge articles all in one place
 

search text in:




Other .linuxhowtos.org sites: www.linuxhowtos.org
toolsntoys.linuxhowtos.org



Last additions:
How to make X listen on port 6000

How to make X listen on port 6000

words:

34

views:

38582

userrating:

average rating: 1.5 (4 votes) (1=very good 6=terrible)


May, 25th 2007:
April, 26th 2007:
Apr, 10th. 2007:
Druckversion . pdf icon
You are here: Portage


Details of app-editors/le:

Description: Terminal text editor
Homepage:
http://lav.yar.ru/programs.html

available versions:

releasesalphaamd64armhppaia64mipsppcppc64ppc macoss390shsparcx86USE-Flagsdependenciesebuild warnings
le-1.16.3 -+----+-----+noneshow
show
le-1.16.1 -~----~-----~noneshow
show
le-1.14.3 -+----+-----+
show
show
Legend:
+ stable
~ testing
- not available
some ebuild warning depend on specific use-flags or architectures, all ebuild-warnings are shown.

Known bugs:
bug IDcomponentassigned tostatusdescriptionlast change
458570FreeBSDbsdUNCONFIRMEDfreebsd.eclass: please add svn ebuild support2013-02-21 11:37:52
440380Core systembase-systemUNCONFIRMEDsys-boot/lilo: unmerging when /boot isn't mounted cleans /boot2012-11-02 08:21:22
434702ApplicationsspingUNCONFIRMEDmedia-sound/mp3splt-gtk-0.7.3: QA Notice: This package installs one or more .desktop files that do n2012-11-21 18:48:15
386037DevelopmentqtUNCONFIRMEDapp-crypt/qca-ossl-2.0.0_beta3-r2: fails to build x86-abi with portage-multilib enabled2013-01-12 22:18:36
441720PrintingprintingUNCONFIRMEDnet-print/cups-1.6.1: QA Notice: This package installs one or more .desktop files that do not pass v2012-11-27 16:02:55
434900Ebuildspavel.stratil-junUNCONFIRMEDsys-apps/timer_entropyd-0.2 silently changed behavior2012-09-13 14:16:28
438304Applicationsmedia-videoUNCONFIRMEDmedia-video/gtk-recordmydesktop-0.3.8-r2 - QA Notice: .desktop file do not pass validation2012-11-21 18:48:47
426472Ebuildsmedia-videoUNCONFIRMEDmedia-plugins/live-2012.06.26: QA: compile: please use append-cppflags for preprocessor flags2012-07-18 15:11:05
378013Applicationsmaintainer-wantedUNCONFIRMEDapp-crypt/pvk - Converts PVK files to PEM files and back again2011-08-07 13:57:30
450340GNOMEgnomeUNCONFIRMEDgnome-extra/hamster-applet-2.32.1 possibly has wrong RESTRICT_PYTHON_ABIS2013-01-06 22:38:36
458280GNOMEgnomeUNCONFIRMEDdev-python/pygtk-2.24.0-r3 installing postrm warning: Unable to establish symlink2013-02-21 03:06:11
434704ApplicationsgpeUNCONFIRMEDx11-misc/matchbox-keyboard-0.1: QA Notice: This package installs one or more .desktop files that do 2012-11-21 18:48:19
436406ServergrobianUNCONFIRMEDmail-mta/exim please install headers files (aka please add "dlfunc" use flag)2013-02-04 09:35:04
437056LibraryyngwinUNCONFIRMEDapp-admin/eselect-infinality - after setting to nyx, 43-repl-terminus.conf cannot be load2012-10-17 12:12:28
453964ApplicationsyngwinUNCONFIRMEDapp-admin/eselect-lcdfilter fails to remove symlink /etc/env.d/99lcdfilter@ upon removal.2013-01-26 15:34:37
458184Keywording and StabilizationyngwinUNCONFIRMEDapp-arch/lrzip-0.614 stable request2013-02-19 16:17:49
458478LibraryyngwinUNCONFIRMEDx11-libs/cairo-9999 failed because cairo-1.10.2-qt-surface.patch outdated2013-02-20 21:19:46
396571ApplicationsziapannocchiaUNCONFIRMEDapp-misc/cwiid - udev-rule for uinput use non exitsting group plugdev2012-08-14 23:26:07
457768Core systembase-systemUNCONFIRMEDeselect-sh should be pulled in by @system or virtual/shell or app-shells/* or (...)2013-02-18 05:52:51
441718GNOMEgnomeUNCONFIRMEDgnome-base/libbonoboui-2.24.5: QA Notice: This package installs one or more .desktop files that do n2012-11-21 18:48:50
452578DevelopmentyamakuzureUNCONFIRMED[seden overlay] dev-util/eclipse-sdk-3.7.1-r9 fails to start when 2013-01-17 09:24:25
455076LibraryxmwUNCONFIRMEDmedia-gfx/zbar - In file included from from /usr/include/stdio.h:937:0, from zbar/debug.h:60, zbar/s2013-02-10 16:49:05
455098ApplicationsxmwUNCONFIRMEDx11-wm/xpra-0.8.0 tries to remove non-existing files and fails2013-02-05 08:03:17
432954EbuildsxmwUNCONFIRMEDx11-misc/simpleswitcher - (new ebuild) simple EWMH window switcher2012-08-28 14:33:26
457588ApplicationsxboxUNCONFIRMEDmedia-tv/xbmc-11.0 with a PaX kernel - xbmc.bin: LLVM ERROR: Allocation failed when allocating new m2013-02-15 15:39:36
409015DevelopmentxarthisiusUNCONFIRMEDdev-util/intel-ocl-sdk: libOpenCL.so uses incompatible SONAME without SOVERSION2012-10-02 16:31:38
458182Libraryx11UNCONFIRMEDdev-libs/wayland-1.0.4 - No rule to make target `wl_display_connect.xml', needed by `wl_display_conn2013-02-20 15:50:05
457528Applicationsx11UNCONFIRMED[x11 overlay] x11-libs/xpyb-9999 with python3 - checking for python include dir... File ""2013-02-15 15:34:34
458130Libraryx11UNCONFIRMEDmedia-libs/mesa-9.0.1 files contain writable and executable sections2013-02-18 22:24:29
456220Applicationsx11UNCONFIRMEDx11-base/xorg-server on hardened - X exits fatally upon failure to enable sys_iopl2013-02-12 14:40:15
444566Unspecifiedx11UNCONFIRMEDx11-drivers/ati-drivers-12.11_beta: fglrx(0): unable to query kernel module!2012-11-24 15:58:50
447862Applicationsx11UNCONFIRMEDx11-drivers/xf86-video-ati, x11-base/xorg-server or related components memory leak2013-01-03 13:26:06
443534Applicationsx11UNCONFIRMEDx11-apps/xconsole-1.0.4 eats 100% CPU if -file option is used2012-11-16 18:57:33
444064Ebuildsx11UNCONFIRMEDvirtual/glu - sys-apps/paludis' cave fails to resolve a usable depset2012-11-20 18:00:08
428650Libraryx11UNCONFIRMEDmedia-libs/mesa-8.1_rc1_pre20120724 - libGL error: failed to authenticate magic 5 // libGL error: fa2012-11-18 08:31:42
430000Applicationsx11UNCONFIRMED>=x11-drivers/ati-drivers-12.6 incompatible with >=x11-drivers/xf86-video-intel-2.20.32013-02-19 19:10:05
434526Applicationsx11UNCONFIRMEDx11-base/xorg-server message should be updated since sets are in stable portage2012-10-26 06:41:59
437590Libraryx11UNCONFIRMEDmedia-libs/mesa-9.0_pre20120918: libGL error: failed to load driver: nouveau with a ATI graphic cont2012-10-24 20:57:35
439840Applicationsx11UNCONFIRMEDx11-drivers/xf86-video-savage - EXA acceleration problems2012-11-04 09:55:04
428174Libraryx11UNCONFIRMEDmedia-libs/mesa-8.1_rc1_pre20120724 USE=r600-llvm-compiler - R600RegisterInfo.td:4762:27997: error: 2012-12-08 03:34:08
428460Applicationsx11UNCONFIRMEDmedia-libs/mesa-8.1_rc1_pre20120724 files swrast_dri.so and i915_dri.so contains insecure RUNPATHs2013-01-31 18:48:44
420733Applicationsx11UNCONFIRMEDx11-drivers/ati-drivers-12.4 - fgrlx module crash on startx2012-06-13 09:46:44
426550Ebuildsx11UNCONFIRMEDx11-misc/transset-1.0.0: incomplete man page2012-07-18 19:20:30
407711Unspecifiedx11UNCONFIRMEDx11-drivers/ati-drivers-12.2: amdcccle segfaults when changing desktop settings2012-03-12 19:29:06
408643Unspecifiedx11UNCONFIRMEDapp-admin/eselect-mesa needs update for r600 changes in mesa2012-07-11 11:14:47
401779Developmentx11UNCONFIRMEDx11-base/xorg-server-1.11.4 - XIO: fatal IO error 11 (Resource temporarily unavailable) on X server2012-02-01 17:35:48
401413Applicationsx11UNCONFIRMEDx11-apps/xdm-1.1.11-r1: elibtoolize called repeatedly2012-01-30 13:03:27
379827Ebuildsx11UNCONFIRMEDx11-base/xorg-server Patch for Hotkey Release Layout Switching (unofficial solution to bug on freed2012-06-06 06:40:18
385219Applicationsx11UNCONFIRMED[x11 overlay] x11-drivers/xf86-input-synaptics-9999 compile fails2011-10-02 18:49:08
390455Applicationsx11UNCONFIRMEDx11-misc/xcompmgr doesn't handle shape change2011-11-14 04:06:05
377395Libraryx11UNCONFIRMED[drm:radeon_crtc_page_flip] *ERROR* failed to reserve new rbo buffer before flip2011-08-03 08:59:16
377727GNOMEx11UNCONFIRMEDx11-drivers/xf86-input-evdev-2.6.0: X crashes after suspend due USB keyboard problem2011-08-06 15:32:29
379441Applicationsx11UNCONFIRMEDx11-apps/xinit: startx leaks .serverauth.???? files2011-10-27 13:53:49
369207Unspecifiedx11UNCONFIRMEDnum lock LED off after changing from VT to X112011-06-07 15:33:07
455080Core systemwschlichUNCONFIRMEDsys-process/fcron-3.1.1 - Files were moved without updating default selinux file context policies, p2013-02-02 17:38:34
370001EbuildswrobelUNCONFIRMED[kolab overlay] ERROR: net-mail/kolab-resource-handlers-2.1 failed (depend phase): * php-lib.ecla2011-12-31 17:37:47
453208ApplicationswiredUNCONFIRMEDwww-client/uzbl-9999 - src/uzbl-core.h:16:25: fatal error: glib/gstdio.h: No such file or directory2013-01-21 19:18:42
451174DevelopmentwltUNCONFIRMEDdev-db/firebird-2.1.3.18185.0 - Unable to complete network request to host "localhost". Error readin2013-01-10 12:51:53
453802Keywording and StabilizationwineUNCONFIRMEDapp-emulation/winetricks stable request2013-01-24 15:05:15
448062ApplicationswilliamhUNCONFIRMEDapp-accessibility/speech-dispatcher-0.7.1-r1 src_compile(): mv: cannot stat '.deps/spd_audio.Tpo': N2013-01-01 12:02:28
447882Keywording and Stabilizationweb-appsUNCONFIRMEDKeyword request: Please add the sparc keyword to www-apps/gallery2012-12-20 14:52:24
454572Applicationsweb-appsUNCONFIRMEDwww-apps/phpsysinfo-3.1.0: .htaccess file syntax error for apache-2.4.32013-01-30 05:35:22
440216ApplicationswilliamhUNCONFIRMEDnet-misc/dhcpcd-5.6.2 outputs emerge messages only relevant when upgrading from <5.02012-10-30 15:25:24
440410Core systemwilliamhUNCONFIRMEDnet-misc/dhcpcd-5.6.2: some elog messages should only be shown right after the relevant use flag is 2012-11-01 21:27:02
438086Applicationsweb-appsUNCONFIRMEDwww-apps/gallery-2.3.1 - "Begin Installation" fails with "The requested URL /gallery/install/
<
2012-10-12 16:43:46
424053Keywording and Stabilizationweb-appsUNCONFIRMEDPlease stabilize =www-apps/collectd-web-0.4.02012-06-29 15:11:21
414621Keywording and Stabilizationweb-appsUNCONFIRMEDPlease stabilize >=www-apps/bugzilla-3.6.92012-10-09 19:32:34
413443Serverweb-appsUNCONFIRMEDwww-apps/bugzilla-4.2.1 - missing excutable bit for scripts2012-04-25 15:32:38
407791Applicationsweb-appsUNCONFIRMEDwww-apps/drupal-7.12 Shows "Illegal string offset" Warning2012-03-13 11:22:43
385655Eclasses and Profilesweb-appsUNCONFIRMEDwebapp - allow multiple messages2011-10-10 14:38:20
377105Applicationsweb-appsUNCONFIRMEDapp-admin/webapp-config-1.50.18: self.mkfile() dies while trying to delete a path to be created2011-08-04 02:04:41
439822Applicationsvserver-devsUNCONFIRMEDapp-backup/vzdump use "--rsyncable" gzip option2013-01-20 19:35:42
370191Serverweb-appsUNCONFIRMED=www-apps/viewvc-1.1.11 problem with =webapp-config-1.50.182012-02-21 14:00:57
453788Core systemvoyageurUNCONFIRMEDsys-devel/llvm & sys-devel/clang: dependency trouble for build subprojects of llvm2013-02-02 21:37:08
458574Keywording and StabilizationvoyageurUNCONFIRMEDPlease stabilize net-ftp/filezilla-3.6.0.22013-02-21 12:14:55
450772DevelopmentvoyageurUNCONFIRMEDsys-devel/llvm-9999 - subversion: can't fetch to /var/portage/distfiles/svn-src/llvm/trunk from http2013-01-09 19:43:43
447408DevelopmentvoyageurUNCONFIRMEDsys-devel/llvm-3.1r2 - X86ELFWriterInfo.cpp:85:1: interner Compiler-Fehler: Speicherzugriffsfehler2012-12-22 12:30:47
427808EbuildsvoyageurUNCONFIRMEDx11-base/xorg-server-1.12.3 crashing at start-up when compiled with sys-devel/clang2012-12-31 12:32:19
427830Core systemvoyageurUNCONFIRMEDsys-devel/clang-3.1-r4 - clang: error: unable to execute command: Illegal instruction (in .../work/l2012-07-25 14:59:26
439676UnspecifiedvoyageurUNCONFIRMEDapp-i18n/ibus-qt-1.3.1 with clang 3.1 - qibusserializable.h:94:59: error: non-const lvalue reference2012-10-26 16:33:42
442958DevelopmentvoyageurUNCONFIRMEDsys-devel/llvm fails to cross compile2012-11-13 16:20:28
441778DevelopmentvoyageurUNCONFIRMEDsys-devel/clang-3.1 ICE's when a type with multiple copy-ctors is in a union2012-11-04 23:13:59
400547DevelopmentvoyageurUNCONFIRMEDdev-libs/STLport-5.2.1 does not compile using clang++ due to error in stlport/stl/_locale.h2012-01-25 13:51:23
403637ApplicationsvoyageurUNCONFIRMEDnet-ftp/filezilla-3.5.3 doesn't honor LINGUAS for locale files2012-02-23 21:38:44
416691KDEvoyageurUNCONFIRMEDkde-base/nepomuk-4.8.3 fails with undefined references (dragonegg problem)2012-09-28 13:05:52
416827EbuildsvoyageurUNCONFIRMEDdev-libs/glib - CFLAGS="-fplugin=/usr/lib64/llvm/dragonegg.so" - gbitlock.c:210:3: sorry, unimplemen2012-09-28 13:05:51
393389KDEvoyageurUNCONFIRMED[kde overlay] kde-base/kdelibs-9999 fails to compile with sys-devel/dragonegg-3.02012-09-28 13:05:51
393489EbuildsvoyageurUNCONFIRMEDapp-office/libreoffice-3.5.0.0 fails to compile with sys-devel/dragonegg-3.02012-09-28 13:05:51
393391KDEvoyageurUNCONFIRMED[kde overlay] kde-base/katepart-9999 fails to compile with sys-devel/dragonegg-3.02012-09-28 13:05:52
393385EbuildsvoyageurUNCONFIRMEDmedia-libs/phonon-vlc-0.4.1 fails to compile with sys-devel/dragonegg-3.02012-09-28 13:05:51
393373UnspecifiedvoyageurUNCONFIRMEDx11-libs/qt-gui-4.7.4-r1 fails to compile with sys-devel/dragonegg-3.02012-09-28 13:05:52
393377UnspecifiedvoyageurUNCONFIRMEDx11-libs/pixman-0.24.0 fails to compile with sys-devel/dragonegg-3.02012-09-28 13:05:51
393383EbuildsvoyageurUNCONFIRMEDsys-devel/llvm-3.0 fails to compile with sys-devel/dragonegg-3.02012-09-28 13:05:52
393381EbuildsvoyageurUNCONFIRMEDx11-libs/qt-webkit-4.7.4 fails to compile with sys-devel/dragonegg-3.02012-09-28 13:05:52
393379EbuildsvoyageurUNCONFIRMEDx11-libs/qt-qt3support-4.7.4 fails to compile with sys-devel/dragonegg-3.02012-09-28 13:05:51
387283ApplicationsvoipUNCONFIRMEDFailed to emerge net-voip/linphone-3.3.22012-10-23 16:24:00
403597ApplicationsvoipUNCONFIRMEDnet-voip/linphone-3.4.3-r1 doesn't honor LINGUAS for locale files2012-06-30 13:45:14
392379ApplicationsvmwareUNCONFIRMEDapp-emulation/vmware-modules-238.5: vmmon-only/linux/hostif.c:2749:4: error: implicit declaration of2012-03-26 11:36:37
388983EbuildsvmwareUNCONFIRMEDapp-emulation/vmware-modules-238.5 with sys-kernel/hardened-sources-3.0.4-r4 - work/vmci-only/linux/2013-01-18 22:06:24
438314Ebuildsvincent.hardy.beUNCONFIRMEDapp-crypt/eid-mw - misspelled metadata2012-10-15 11:09:16
448472ApplicationsvimUNCONFIRMEDapp-editors/gvim - segmentation fault when using clang_complete2012-12-25 15:39:05
453418ApplicationsvimUNCONFIRMEDapp-editors/vim-core-7.3.762 Opened file gets modified when mapping g to some other value2013-01-22 02:03:25
417921ApplicationsvimUNCONFIRMEDapp-editors/vim - bash completion fails with paths containing spaces2012-05-28 11:50:58
423137ApplicationsvimUNCONFIRMEDapp-editors/vim-7.3.409: Misleading and outdated hint on solving a problem2012-06-26 14:55:41
423551EbuildsvimUNCONFIRMEDapp-vim/matrix - high memory usage / memory leak2012-07-11 01:20:36
440414ApplicationsvimUNCONFIRMEDapp-editors/vim-7.3.409: some elog messages should only be shown right after the relevant use flag i2012-10-31 15:58:55
393419Eclasses and ProfilesvimUNCONFIRMEDapp-vim/gtk-syntax-20110214-r1 file collision2011-12-12 14:21:29
400585ApplicationsvimUNCONFIRMEDapp-editors/vim-7.3: broken unicode while copy/paste with X PRIMARY and CLIPBOARD2012-01-25 13:56:18
446204Core systemvapierUNCONFIRMEDsys-devel/crossdev: cross-emerge: support multiple parallel SYSROOTs for a single target2012-12-06 22:15:24
439280LibraryvadimkUNCONFIRMEDapp-emulation/vmware-modules-264.4 - missing return carriage in printk in VNetUserIfSetUplinkState()2012-10-23 10:12:15
424189Core systemudev-bugsUNCONFIRMEDsys-fs/udev-171-r6: all modules are loaded even with rc_coldplug="NO"2013-02-08 17:46:29
456048ServerultrabugUNCONFIRMEDwww-servers/uwsgi-1.4.5 init script race condition if starting multiple uwsgi instances with differe2013-02-07 16:47:54
454564ApplicationsultrabugUNCONFIRMEDapp-admin/rsyslog-7.2.5 - In file included from dnscache.c:30: /usr/include/bits/sched.h:132:20: err2013-02-09 15:08:04
442706ApplicationsultrabugUNCONFIRMEDapp-admin/rsyslog.service file does not work with newer sys-apps/systemd2012-11-22 08:33:40
420675ApplicationstuponeUNCONFIRMEDapp-misc/geneweb-5.02 - File "srcfile.ml", line 195, characters 4-56: Error: Unbound constructor Std2013-02-21 12:35:28
398089ApplicationstristanUNCONFIRMEDx11-misc/revelation-0.4.11-r2 USE=applet - configure:13842: error: failed to find module gnomeapplet2012-01-10 00:03:01
457570ApplicationstoveUNCONFIRMEDapp-shells/zsh fails to compile with ncurses[tinfo]2013-02-14 19:59:26
453584EbuildstoveUNCONFIRMEDapp-shells/zsh - prompt_gentoo_setup: replace globally declared variables with local variables2013-01-24 09:42:42
436348EbuildstoveUNCONFIRMEDPlease stabilize =app-shells/zsh-5.0.22013-02-10 03:55:11
404035ApplicationstoveUNCONFIRMEDapp-shells/zsh - add GREP_OPTIONS to profile2012-02-16 05:55:31
454492Toolstools-portageUNCONFIRMEDapp-portage/gentoolkit-0.3.0.7 - eclean-dist: UnboundLocalError: local variable 'cleaner' referenced2013-01-29 17:40:16
453674Third-Party Toolstools-portageUNCONFIRMEDapp-portage/ufed: Shortening/cleaning flag descriptions by eliminating "[Enables/Adds/Includes] Supp2013-01-23 13:44:40
406645Toolstools-portageUNCONFIRMEDapp-portage/gentoolkit-0.3.0.5 please consider renaming the revdep-rebuild scripts2012-03-05 12:52:29
421287Toolstools-portageUNCONFIRMEDgentoolkit 0.3.0.6 euse -i option causes a lot of no such file or directory with app-admin/eselect-12012-06-20 16:02:59
434496Toolstools-portageUNCONFIRMEDapp-portage/gentoolkit-0.3.0.6-r3 - equery crashes on unhandled exception portage.exception.InvalidD2012-09-10 06:45:50
437976Toolstools-portageUNCONFIRMEDProblems with "euse --active" from app-portage/gentoolkit-0.3.0.6-r32012-10-11 14:02:48
372049Applicationstools-portageUNCONFIRMEDRequest for app-portage/gentoolkit to show (for a use flag) status of the flag in installed packages2012-12-25 01:55:20
458020Core systemtoolchainUNCONFIRMED[toolchain overlay] sys-libs/glibc-2.6.1 does not compile with up to date gcc and binutils (via cros2013-02-18 04:43:58
374021Toolstools-portageUNCONFIRMEDapp-portage/gentoolkit-0.3.0.4 - eclean-pkg traceback on unknown file2012-12-25 01:55:36
373823Toolstools-portageUNCONFIRMEDapp-portage/gentoolkit-0.3.0.4: `euse -i` dumps errors about missing repo_name files2012-12-25 01:55:28
449948Core systemtoolchainUNCONFIRMEDsys-libs/glibc - inner-net license is of a boolean non-free nature2013-01-03 12:47:26
453514Core systemtoolchainUNCONFIRMEDsys-libs/glibc-2.15-r3: nscd initscript fails while daemon starts2013-01-22 22:51:57
454200Core systemtoolchainUNCONFIRMEDsys-libs/glibc-2.17 breaks almost all binaries - error while loading shared libraries: libgcc_s.so.12013-02-09 05:39:00
448124DevelopmenttoolchainUNCONFIRMEDsys-devel-gcc-4.5.3: internal compiler error on sci-biology/ncbi-tools++-9.0.0/work/ncbi_cxx--9_0_0/2012-12-26 17:28:43
448172Core systemtoolchainUNCONFIRMEDsys-devel/gcc-4.1.2 - /usr/lib64/libart_lgpl_2.so: could not read symbols: File in wrong format /// 2012-12-25 15:17:16
447708Core systemtoolchainUNCONFIRMEDsys-devel/gcc-4.7.2 fails to crosscompile for mingw64: options.c:952:3: error: ‘HAVE_GAS_ALIGNED_COM2013-02-18 16:35:04
436636JavatoolchainUNCONFIRMEDsys-devel/gcc-{4.5,4.6,4.7?}: gcj fails to compile java source code on ia64 (hardened) - Exception i2012-12-14 08:15:05
437316Core systemtoolchainUNCONFIRMEDsys-devel/prelink-20120628: read-only files (mounts) trigger abort: Could not rename temporary to ..2013-01-23 11:03:37
434908Core systemtoolchainUNCONFIRMEDsys-devel/gcc-4.6.3: ICE in .../work/qemu-kvm-1.1.1/target-i386/op_helper.c:3650:1: internal compile2013-01-04 21:00:13
435110Core systemtoolchainUNCONFIRMEDsys-devel/binutils: ar mishandles 4GB files (causing net-libs/webkit-gtk build to fail with debug fl2013-01-01 20:56:38
434452EbuildstoolchainUNCONFIRMED[4.5/ICE] www-client/firefox-15.0.1 - .../work/mozilla-release/js/src/vm/ObjectImpl.cpp:485:1: inter2012-12-07 08:28:56
434180Core systemtoolchainUNCONFIRMEDsys-devel/gcc sandbox violation in /usr/include/DONE (dev-db/oracle-instantclient-basic creates a li2012-12-25 08:33:27
433056Core systemtoolchainUNCONFIRMEDsys-devel/gcc-4.7.1 fails to crosscompile with cross-powerpc64-unknown-linux-gnu/gcc-4.6.3: cc1: err2012-10-03 01:27:13
432300Core systemtoolchainUNCONFIRMEDsys-devel/gcc-4.5.3-r2 fails to crosscompile: gcc-4.5.3/libstdc++-v3/src/atomic.cc:91:62: error: inv2012-08-22 14:43:31
426306Core systemtoolchainUNCONFIRMEDsys-libs/glibc-2.14.1-r3: tests failed2012-11-10 09:00:26
425728Core systemtoolchainUNCONFIRMEDsys-libs/libstdc++-v3 sys-devel/gcc:3.3: no version information available in ia64 libstdc++.so2012-08-12 14:58:44
418209Core systemtoolchainUNCONFIRMEDcross-armv7m-none-eabi/gcc-4.5.3 stage1 cross-compiler fails2012-11-06 07:23:57
414967Core systemtoolchainUNCONFIRMEDsys-devel/gcc-4.6.3 in dev-lang/gforth-0.7.0 - ./engine.c:460:1: internal compiler error: in simplif2012-06-28 17:14:55
405325Core systemtoolchainUNCONFIRMEDsys-devel/autogen-5.11.2: src_test left an orphan process running in the background2012-03-22 14:50:16
395491Core systemtoolchainUNCONFIRMEDdev-util/dejagnu-1.5 failed (test phase)2013-01-23 05:24:15
370719Core systemtoolchainUNCONFIRMEDsys-devel/gcc-4.5.2: gcda file not found for -fbranch-probabilities2011-06-11 18:32:45
395949DevelopmenttitanofoldUNCONFIRMEDdev-util/premake-4.3 should generate architecture independent makefiles2011-12-26 23:59:11
406805ApplicationstitanofoldUNCONFIRMEDnet-dns/ddclient-3.8.1-r4 - Multiple interface support is broken2012-12-26 12:36:00
457504EbuildstomjbeUNCONFIRMEDapp-backup/bacula-5.2.12: add support for installing examples into docdir2013-02-14 15:48:10
420065LibrarytommyUNCONFIRMEDsci-libs/naga-2.1 fails to connect to server (http://naga.googlecode.com) behind a proxy using subv2013-01-20 10:45:59
435426ApplicationstommyUNCONFIRMEDdev-vcs/subversion-1.6.17-r7 USE=-perl still depends on dev-lang/perl through perl-module.eclass2012-11-05 09:43:38
452410DevelopmenttommyUNCONFIRMEDdev-vcs/subversion-1.7.7 - AutoSplit: Can't open blib/lib/SVN/Client.pm: No such file or directory2013-01-16 16:06:49
452900DevelopmenttommyUNCONFIRMEDdev-vcs/subversion-1.7.7 when rubygems isn't installed for ruby18 - .../work/subversion-1.7.7/libtoo2013-01-21 11:54:22
453020ApplicationstommyUNCONFIRMEDdev-vcs/subversion, please consider patch to fix paths reported for externals2013-01-19 19:26:52
456172ApplicationstommyUNCONFIRMEDdev-vcs/subversion-(1.7.* ?) needs dev-db/sqlite:3 to be compiled with threadsafe2013-02-11 11:20:24
396479ApplicationstgurrUNCONFIRMEDmedia-sound/mumble-1.2.3-r1: Text-to-speech doesn't work2012-11-20 11:30:20
457552ApplicationstgurrUNCONFIRMEDmedia-sound/mumble should not include TTS settings when USE="-speech"2013-02-17 00:37:19
450662ApplicationsThyArmageddon+GentooUNCONFIRMEDmedia-video/subdownloader - /usr/bin/subdownloader: File "/usr/share/subdownloader/modules/configura2013-02-16 19:47:24
449298Keywording and StabilizationtexUNCONFIRMED=app-text/texlive-2012: please stabilize2013-01-21 17:21:51
417927ApplicationstexUNCONFIRMEDdev-tex/latexmk - bash completion fails with paths containing spaces2012-05-28 11:51:57
406783DevelopmenttexUNCONFIRMEDdev-tex/pgf-2.10: TikZ "callout" positioning problem2012-03-05 19:49:20
383403ApplicationstexUNCONFIRMEDchktex detects wrong file names when following \input commands2011-09-18 21:47:52
367925Keywording and StabilizationtexUNCONFIRMEDPlease stabilize =dev-tex/tipa-1.32011-05-18 16:02:25
379147UnspecifiedtcltkUNCONFIRMEDdev-tcltk/iwidgets-4.0.1-r3 fails to configure with et_EE locale2011-08-15 01:54:59
454902ApplicationssystemdUNCONFIRMEDnet-misc/ntp: please add systemd service file2013-02-03 14:05:39
453278Core systemsystemdUNCONFIRMEDsys-apps/systemd - please port netcfg from Arch Linux for easier network configuration2013-01-21 20:21:49
452910Core systemsystemdUNCONFIRMEDsys-apps/systemd-196[python] needs dev-python/pygobject:3 - ImportError: No module named gi.reposito2013-01-20 17:07:04
434090Core systemsystemdUNCONFIRMEDsys-apps/systemd - mount and df list devices multiple times2012-09-19 18:51:11
424637Core systemsystemdUNCONFIRMEDsys-apps/systemd won't work with lvm due to udev and genkernel problems2012-07-07 09:32:46
457100LibrarysysadminUNCONFIRMEDsys-libs/freeipmi please add use flag for --with-dont-check-for-root2013-02-13 19:54:50
453626ApplicationssysadminUNCONFIRMEDnet-analyzer/nagios-core-3.3.1 incomplete privilege grant2013-01-23 16:36:54
434192ApplicationssysadminUNCONFIRMEDnet-analyzer/nagios-plugins - clean up rblservers in rblcheck-dns2012-09-23 02:54:31
391827EbuildssysadminUNCONFIRMEDnet-analyzer/nagios-check_logfiles 2.3.2.1-r1 -> 3.4.5.2 version bump2012-08-19 15:26:59
442734Keywording and StabilizationswegenerUNCONFIRMED~dev-util/systemtap-2.0 please stabilize2013-01-07 09:07:55
417639DevelopmentswegenerUNCONFIRMEDdev-util/systemtap-1.7: error: gettext infrastructure mismatch: using a Makefile.in.in from gettext 2012-12-15 13:34:09
381451ApplicationsswegenerUNCONFIRMEDAdd an init script to run multiple instances of app-misc/screen as a system service2011-09-08 12:17:13
416573EbuildsswaponUNCONFIRMEDx11-drivers/xf86-video-virtualbox - invalid conversion from ‘void*’ to ‘RTHEAPSIMPLEBLOCK*’ [-fpermi2012-06-16 18:59:56
426990LibraryswaponUNCONFIRMEDnet-libs/gsoap-2.8.9 USE=examples - chaining.o: In function `ns__pow': chaining.c:(.text+0x55): unde2013-01-12 16:57:59
410553UnspecifiedswaponUNCONFIRMEDx11-drivers/xf86-video-virtualbox / app-emulation/virtualbox-guest-additions fail to cross-compile2012-04-03 15:23:22
455162DevelopmentssuominenUNCONFIRMEDdev-util/catfish-0.4.0.2 needs dev-python/pygobject:3 in RDEPEND - Error: The required module gi.rep2013-02-04 02:33:15
442092ApplicationsspingUNCONFIRMEDmedia-gfx/gimp-9999 - Portage patch failed to apply (ltmain.sh version 2.4.2)!2012-11-10 00:24:49
454322UnspecifiedsoundUNCONFIRMEDmedia-sound/lame-3.99.5 - console.o: In function `get_termcap_{string,number},apply_termcap_settings2013-01-28 18:33:17
450814Keywording and StabilizationsoundUNCONFIRMEDmedia-libs/flac-1.2.1-r4 stable request2013-01-08 14:04:48
449780ApplicationssoundUNCONFIRMEDmedia-sound/exaile should support USE=dbus2013-01-03 00:19:45
446940ApplicationssoundUNCONFIRMEDmedia-sound/shell-fm-0.8-r1 - Invalid HTTP: HTTP/1.0 403 Forbidden from: http://ws.audioscrobbler.2012-12-12 03:37:12
443600ApplicationssoundUNCONFIRMEDmedia-libs/libsndfile-1.0.25 - Fails test with SyntaxError: invalid syntax in binheader_writef_check2012-11-17 18:45:12
442614EbuildssoundUNCONFIRMEDmedia-sound/trommler-3.8 - Fails when python3 is set.2012-11-11 11:10:35
441038ApplicationssoundUNCONFIRMEDdev-libs/redland-1.0.15 QA Notice: pkg-config files with wrong LDFLAGS detected2012-11-03 16:48:32
441884LibrarysoundUNCONFIRMEDmedia-libs/libvisual-0.4.0-r2 enables threads unconditionally2012-11-05 18:58:43
436528LibrarysoundUNCONFIRMEDmedia-libs/speex: Resampler stops in the middle of run with multiple channels2012-09-29 15:26:02
438020EbuildssoundUNCONFIRMED=media-libs/libsndfile-1.0.25 build log not verbose2012-10-12 16:20:16
434416Keywording and StabilizationsoundUNCONFIRMED=media-sound/qarecord-0.5.0 stable request2012-09-09 15:50:07
431562ApplicationssoundUNCONFIRMEDmedia-sound/lltag 0.14.4 executable contains wrong values2012-08-15 20:03:24
433385LibrarysoundUNCONFIRMEDmedia-libs/nas-1.9.2 should depend on sys-devel/flex and sys-devel/bison (virtual/yacc?)2012-09-03 14:11:42
418185ApplicationssoundUNCONFIRMEDmedia-sound/xmp-3.5.0 fails to play LZMA compressed module2012-06-03 13:36:25
431066UnspecifiedsoundUNCONFIRMEDmedia-libs/libvisual - error: 'sigill_handler_sse' undeclared (first use in this function)2012-11-05 15:00:00
412217LibrarysoundUNCONFIRMEDdev-libs/redland-1.0.15 has malformed Makefile, won't emerge: "missing separator"2012-04-16 17:47:14
403623ApplicationssoundUNCONFIRMEDmedia-sound/exaile-0.3.2.1 doesn't honor LINGUAS for locale files2012-02-23 21:38:44
403625ApplicationssoundUNCONFIRMEDmedia-sound/gbsplay-0.0.91 doesn't honor LINGUAS for locale files2012-02-23 21:38:44
403627ApplicationssoundUNCONFIRMEDmedia-sound/herrie-2.2 doesn't honor LINGUAS for locale files2012-02-23 21:38:44
395817ApplicationssoundUNCONFIRMEDmedia-libs/libsndfile-1.0.25: fails tests with python-32012-01-18 16:03:11
365967EbuildssoundUNCONFIRMEDmedia-sound/qarecord-0.5.0 should install icon and desktop file2011-05-06 16:34:07
454062Applicationsshell-toolsUNCONFIRMEDapp-misc/byobu-5.27 - create window failed: /bin/bash no such file or directory2013-02-06 16:13:05
442544Applicationsshell-toolsUNCONFIRMEDapp-shells/bash-completion-1.3 - No support for XZ compression with Okular.2012-11-11 16:23:59
439978Applicationsshell-toolsUNCONFIRMEDapp-shells/zsh-completion - please add additional completions for ebuild2012-10-29 03:50:21
440428Applicationsshell-toolsUNCONFIRMEDapp-shells/bash-completion-1.3: some elog messages should only be shown for the first install.2012-10-31 16:10:30
432378Applicationsshell-toolsUNCONFIRMEDapp-shells/bash-completion - hard-coded path "/sbin/modinfo" in /usr/share/bash-completion/module-in2012-11-03 18:30:08
426346Applicationsshell-toolsUNCONFIRMEDapp-shells/bash-completion - cd autocomplete's non-directories2012-07-17 20:17:44
426570Applicationsshell-toolsUNCONFIRMEDapp-shells/gentoo-bashcomp extended by a completion for eshowkw2012-07-17 16:56:11
431958Unclassifiedshell-toolsUNCONFIRMEDapp-shells/zsh-completion-20091203-r1 is broken because =sys-apps/portage-2.2.0_alpha121 does not in2013-01-28 08:57:32
418567Applicationsshell-toolsUNCONFIRMEDapp-misc/byobu-5.18: create session failed: /usr/bin/byobu-shell: Too many open files2013-02-06 16:13:27
417945Applicationsshell-toolsUNCONFIRMEDapp-misc/devtodo - bash completion fails with paths containing spaces2012-05-28 12:08:16
417929Applicationsshell-toolsUNCONFIRMEDapp-shells/bash-completion: some builtin completions don't work with spaces2012-05-28 11:52:38
417925Applicationsshell-toolsUNCONFIRMEDapp-shells/gentoo-bashcomp - bash completion fails with paths containing spaces2012-05-28 11:51:25
417717Unspecifiedshell-toolsUNCONFIRMED[Tracker] bash completion files that fail with paths containing spaces2012-05-28 10:15:02
408859Applicationsshell-toolsUNCONFIRMEDapp-misc/byobu-5.16: byobu-config option Help broken, IOError: No such file '/usr/share/doc/byobu/he2013-02-06 16:13:39
403123Unspecifiedshell-toolsUNCONFIRMEDapp-shells/gentoo-bashcomp - Add ebuild(1) --skip-manifest completion support2012-02-13 17:23:49
385761Applicationsshell-toolsUNCONFIRMEDdev-util/colorgcc: please submit gentoo patches to upstream at github2011-10-10 14:45:07
447064ApplicationssgmlUNCONFIRMEDapp-text/build-docbook-catalog - file:///etc/xml/docbook:1: parser error : Document is empty2012-12-13 16:31:25
454478SELinuxselinuxUNCONFIRMEDsys-apps/busybox-1.20.2 fails to merge on selinux profile with USE="static"2013-02-17 09:37:40
413191VulnerabilitiessecurityUNCONFIRMEDapp-portage/pfl - /usr/bin/e-file is too trusting of HTTP response.2012-06-18 06:04:49
431628Default ConfigssecurityUNCONFIRMEDinformation disclosure of the IP address of all connected users to all simple users2012-09-10 06:20:24
441570KernelsecurityUNCONFIRMEDKernel: btrfs: creates world writable files2012-11-29 17:29:18
455270Applicationssci-mathematicsUNCONFIRMED[science overlay] sci-mathematics/scilab-5.4.0 build can't find lots of files2013-02-12 13:14:40
392349VulnerabilitiessecurityUNCONFIRMEDsys-devel/gdb Loads untrusted files with possible arbitrary code execution (CVE-2011-4355)2011-12-30 07:19:51
451626Applicationssci-mathematicsUNCONFIRMED[science overlay] sci-mathematics/scilab-5.4.0 - buildDoc: Error while building documentation: Could2013-02-12 03:35:49
435906Applicationssci-mathematicsUNCONFIRMEDsci-mathematics/octave-3.6.2-r1 - .../work/octave-3.6.2/src/.libs/octave: error while loading shared2013-02-04 21:38:37
418281Applicationssci-mathematicsUNCONFIRMED[sci-overlay] sci-mathematics/scilab-5.3.3-r1 - .../work/scilab-5.3.3/modules/renderer/src/java/org/2012-12-25 13:20:36
406773Keywording and Stabilizationsci-mathematicsUNCONFIRMED=sci-mathematics/maxima-5.28.0: Please stabilize2013-01-14 12:35:08
406779Keywording and Stabilizationsci-mathematicsUNCONFIRMED=sci-mathematics/wxmaxima-12.09.0: Please stabilize.2012-11-11 04:21:47
456404Applicationssci-geosciencesUNCONFIRMEDsci-geosciences/gpsbabel-1.4.4 - shape.c:23:29: fatal error: libshp/shapefil.h: No such file or dire2013-02-12 14:56:18
450682Keywording and Stabilizationsci-geosciencesUNCONFIRMEDsci-libs/gdal-1.9.2 stable request2013-01-07 11:55:21
455430Librarysci-geosciencesUNCONFIRMEDsci-libs/shapelib-1.3.0-r1 - Please make a rev-bump after changing ebuild to install headers.2013-02-07 12:28:41
445824Applicationssci-geosciencesUNCONFIRMEDsci-libs/shapelib-1.3.0-r1 with perl-gcpan/DBD-XBase - file collision in /usr/bin/dbfdump2012-12-04 15:31:13
403653Applicationssci-geosciencesUNCONFIRMEDsci-geosciences/grass-6.4.1-r1 doesn't honor LINGUAS for locale files2012-10-07 09:43:41
405649Ebuildssci-geosciencesUNCONFIRMEDsci-geosciences/openstreetmap-icons-20110601 does not compile2012-03-16 09:50:52
421325Applicationssci-geosciencesUNCONFIRMEDsci-geosciences/osm2pgsql-20100413 with sci-libs/geos-3.3.3 - In function ‘char* get_wkt_simple(osmN2012-10-10 14:53:15
427378Applicationssci-geosciencesUNCONFIRMEDsci-libs/gdal-1.9.1 gdalinfo fails to recognize classic netcdf (3) files2012-12-26 13:37:25
427668Ebuildssci-geosciencesUNCONFIRMEDsci-geosciences/osm2pgsql-99999999 - support for *.pbf files2012-07-24 14:32:27
441760Ebuildssci-geosciencesUNCONFIRMEDsci-geosciences/gpsd-3.7 - NameError: name 'gps_regress' is not defined: File "/var/tmp/portage/sc2012-11-07 02:15:55
447868Applicationssci-electronicsUNCONFIRMED=sci-electronics/magic-7.5.220 doesn't detect Tcl/Tk libraries2012-12-20 14:51:40
415457Ebuildssci-electronicsUNCONFIRMEDsci-electronics/systemc-2.2.0-r2 is broken2012-05-11 15:07:47
421417Ebuildssci-electronicsUNCONFIRMEDsci-electronics/kicad-99999999 - .../work/kicad-99999999/include/common.h:50:9: error: #error "You m2012-07-07 20:05:00
403649Applicationssci-chemistryUNCONFIRMEDsci-chemistry/gperiodic-2.0.10-r2 doesn't honor LINGUAS for locale files2012-02-23 21:47:07
418625Applicationssci-biologyUNCONFIRMEDsci-biology/gatk-1.5: error: name clash: sum(Collection) and sum(Collection) have t2013-02-17 08:28:02
368473Applicationssci-biologyUNCONFIRMEDsci-biology/hmmer-3.0 fails to build with "mpi.c:27:23: error: impl_dummy.: No such file or director2011-06-21 09:31:43
451624ApplicationssciUNCONFIRMED[science overlay] sci-mathematics/scilab-5.4.0 should depend on >=dev-java/flexdock-1.2 sci-libs/arp2013-01-19 17:38:22
452622LibrarysciUNCONFIRMEDdev-python/pytables needs to be recompiled for the exact sci-libs/hdf5 version.2013-01-18 20:03:31
453188LibrarysciUNCONFIRMED[science overlay] kde-base/kdelibs-4.9.3 and sci-libs/plasma-2.4.6 file collision in /usr/include/pl2013-01-21 11:46:54
450906Keywording and StabilizationsciUNCONFIRMEDsci-libs/libqalculate-0.9.7-r1: please stabilize2013-01-08 17:08:14
449232ApplicationssciUNCONFIRMED[science overlay] sci-libs/cholmod-2.0.1: pkg-config fails to find lapack libraries installed from s2013-01-29 19:26:55
448824ApplicationssciUNCONFIRMEDsci-visualization/ggobi-2.1.9-r1 - autom4te-2.69: ../../m4/lt~obsolete.m4: no such file or directory2012-12-27 14:07:04
447448ApplicationssciUNCONFIRMEDsci-misc/boinc-7.0.29 - init script should use/set HOME variable2012-12-17 12:36:16
438768Keywording and StabilizationsciUNCONFIRMEDPlease stabilize =sci-libs/gsl-1.152012-11-09 18:12:29
436750LibrarysciUNCONFIRMEDsci-libs/scikits_learn can't detect blas as non-root2012-10-02 13:09:56
405807ApplicationssciUNCONFIRMEDsci-libs/blas-reference-20120215-r1 - eselect: Can't load module blas2012-02-27 15:25:26
396657ApplicationssciUNCONFIRMED[science-overlay] dev-perl/Bio-BigFile-1.06 fails to emerge due to missing jkweb.a2012-02-11 16:02:44
397885ApplicationssciUNCONFIRMEDsci-misc/boinc-6.12.42: boincmgr process keeps running and an empty space is left in the taskbar aft2012-04-18 12:43:50
404249ApplicationssciUNCONFIRMED[science overlay] sci-biology/embassy-6.3.1 multiple slot conflicts.2012-02-20 14:33:49
396091ApplicationssciUNCONFIRMED[science-overlay] dev-perl/Bio-BigFile-1.06 fails to emerge because of relocation problem2012-01-01 08:50:47
396065ApplicationssciUNCONFIRMED[science-overlay] embassy-topo fails to emerge due to wrong filesize2012-02-20 14:33:52
396057ApplicationssciUNCONFIRMED[science-overlay] embassy-phylipnew-3.69 fails to emerge due to wrong filesize2012-02-20 14:34:00
396063ApplicationssciUNCONFIRMED[science-overlay] embassy-mse fails to emerge due to wrong filesize2012-02-20 14:33:56
391659EbuildssciUNCONFIRMED[science overlay] sci-geosciences/pydap_handlers_sqlite2011-11-23 16:02:22
391319EbuildssciUNCONFIRMED[science overlay] sci-geosciences/pydap_handlers_hdf52011-11-23 15:49:27
378215UnspecifiedsciUNCONFIRMED[science overlay] files missing after layman sync2011-08-11 14:49:17
375359ApplicationsschemeUNCONFIRMEDdev-scheme/slib ebuild scripts cannot find installed drscheme2013-02-06 06:05:35
427346ApplicationsschemeUNCONFIRMED=dev-scheme/guile-1.8.8-r1 fails to build with clang-3.1-r42013-02-02 12:44:30
388073ApplicationssbriesenUNCONFIRMEDmedia-gfx/iscan scan area selection selection problem with >=gcc-4.52012-08-26 02:58:08
386769ApplicationssbriesenUNCONFIRMEDnet-dialup/capi4k-utils-20050718-r5 init script should change opts variable to use either extra_comm2012-06-07 16:11:26
421665SandboxsandboxUNCONFIRMEDsys-apps/busybox-1.20.1 fails with sandboxing enabled2012-11-26 17:24:29
433074ServersambaUNCONFIRMEDnet-fs/samba: please add systemd unit file2013-02-15 18:19:32
446190ServersambaUNCONFIRMEDnet-fs/samba-3.5.19: cross compile fixes2012-12-06 05:03:46
454562ApplicationsroxUNCONFIRMEDrox-extra/archive - deprecation warning about python_mod_cleanup()2013-01-29 19:23:09
397329ApplicationsrubyUNCONFIRMEDdev-lang/ruby-1.9.3_p0 does not compile2012-01-03 21:33:00
403603ApplicationsrubyUNCONFIRMEDgames-util/rubygfe-0.3.4-r1 doesn't honor LINGUAS for locale files2012-02-23 21:38:44
417709UnspecifiedrubyUNCONFIRMEDdev-ruby/ruby-opengl-0.60.1-r2 fails configure with ruby1.9 - cannot load such file -- mkrf2012-05-27 06:43:59
427854DevelopmentrubyUNCONFIRMEDdev-ruby/rspec-core-2.10.1 USE=doc - String finished while reading (break on []) already read: ...2012-07-26 05:09:16
448780DevelopmentrubyUNCONFIRMED=dev-ruby/webmock-1.7.4 - Many tests failed.2013-02-20 06:24:05
458022Core systemryaoUNCONFIRMEDsys-block/iscsitarget-1.4.20.2 - 1 out of 1 hunk FAILED -- saving rejects to file kernel/conn.c.rej2013-02-17 19:02:08
397355ServersambaUNCONFIRMEDnet-fs/samba cluster flags wrong config file /etc/ctdb/functions2012-01-16 23:57:57
392463EbuildsroxUNCONFIRMEDrox-extra/roxcd: Deprecation Warning about of python_mod_cleanup()2012-09-09 01:16:09
458262baselayoutrobbat2UNCONFIRMEDsys-fs/lvm2 Failed to find sysfs mount point when starting2013-02-20 16:20:15
451966Applicationsrobbat2UNCONFIRMEDapp-misc/g15daemon start-stop-daemon: fopen `/var/run/g15daemon.pid': No such file or directory2013-01-15 12:27:28
451478Core systemrobbat2UNCONFIRMEDsys-fs/lvm2 - /etc/init.d/lvm should support multiple volume groups - Command failed with status cod2013-01-31 02:20:00
451452Core systemrobbat2UNCONFIRMEDsys-fs/lvm2-2.02.97-r1 - Errors on LV create/delete operations in systemd-196 environment.2013-02-07 01:16:09
449990Core systemrobbat2UNCONFIRMEDsys-process/audit - init script doesn't handle /var/lock on tmpfs properly2013-01-03 12:37:09
448790Core systemrobbat2UNCONFIRMEDsys-fs/lvm2 - Please don't depend on udev when USE="+static -udev". (was: static flag requires +udev2013-02-10 16:07:22
448354Core systemrobbat2UNCONFIRMEDsys-fs/lvm2-2.02.97-r1 fails to crosscompile: configure: error: thin_check not found in path2013-01-19 16:12:30
446828Applicationsrobbat2UNCONFIRMEDnet-analyzer/sslsniff-0.8-r1 - conftest.cpp:21:26: fatal error: boost/asio.hpp: No such file or dire2012-12-11 22:11:50
444402Serverrobbat2UNCONFIRMEDnet-misc/memcached - Malformed pid filename when running multiple instances2012-11-23 09:40:18
443634Applicationsrobbat2UNCONFIRMEDdev-vcs/git-1.8.0-r1 USE=gnome-keyring - ld: i386:x86-64 architecture of input file `git-credential-2012-11-19 10:42:29
443518Keywording and Stabilizationrobbat2UNCONFIRMEDdev-libs/libmemcached-0.50 stable request2012-11-20 07:42:08
439614GNOMErobbat2UNCONFIRMEDsys-apps/vbetool-1.1: Failed Running automake2013-02-06 22:06:33
437718Core systemrobbat2UNCONFIRMEDsys-fs/lvm2-2.02.97 /etc/init.d/lvm-monitoring slows down boot and shutdown on systems with multiple2012-12-23 09:48:04
436704Keywording and Stabilizationrobbat2UNCONFIRMEDPlease stabilize =dev-vcs/git-1.7.12.42013-02-20 10:06:09
434110Applicationsrobbat2UNCONFIRMEDapp-admin/cancd-0.1.0-r2: netconsole init script fails to start due to wrong ifconfig path2012-09-06 14:20:31
431080Toolsrobbat2UNCONFIRMEDapp-portage/g-cpan-0.16.4-r1 does not handle quotes in description properly2012-08-13 01:48:00
421741Developmentrobbat2UNCONFIRMEDdev-vcs/git-1.7.3.4-r1: test t7508-status.sh failed with FEATURES="sandbox -userpriv"2012-06-19 15:11:50
420453Keywording and Stabilizationrobbat2UNCONFIRMED=dev-util/checkbashisms-2.0.0.5 stable request2012-12-06 09:16:14
417785Ebuildsrobbat2UNCONFIRMEDapp-portage/g-cpan-0.16.4 broken regexp building for some cpan modules2012-05-30 09:21:46
413979Core systemrobbat2UNCONFIRMEDlvm2create_initrd in sys-fs/lvm2-2.02.95-r1 fails to setup $LVM variable properly in initrd2013-01-17 23:44:45
395839Applicationsrobbat2UNCONFIRMEDnet-misc/adjtimex-1.29 is not compatible with baselayout-22011-12-26 10:07:56
395209Ebuildsrobbat2UNCONFIRMEDnet-misc/memcached-1.4.10 doesn't installs systemd service file2012-12-27 21:45:17
376767Ebuildsrobbat2UNCONFIRMEDapp-portage/g-cpan-0.16.4 creates non-existent categories file without newline (inconsistent)2011-08-03 01:16:53
449352Gamesrich0UNCONFIRMEDgames-rpg/eternal-lands Assertion `self' failed (runtime error)2013-01-03 00:24:17
366509Applicationsrobbat2UNCONFIRMEDdev-db/libdbi-drivers-0.8.3: uses incorrect query for listing tables on PostgreSQL database2011-05-12 18:58:07
368001Applicationsrobbat2UNCONFIRMEDapp-portage/g-cpan fails to install Sys::Filesystem2011-05-19 16:12:27
454652StagesreleaseUNCONFIRMEDcurrent stage3-amd64-nomultilib has an immediate block between sys-apps/module-init-tools and sys-ap2013-01-30 14:46:25
453080All ISOreleaseUNCONFIRMEDSIL 3124 SATA controller driver missing from Alpha install CD2013-01-20 01:23:16
448788InstallCDreleaseUNCONFIRMEDAMD 64 install CD: wireless network card not detected (lenovo T61, Intel Wireless 4965) - missing fi2012-12-27 07:54:59
431912InstallCDreleaseUNCONFIRMEDinstall-x86-minimal-20120710.iso - boot hangs while looking for cdrom when encounters swap partition2013-02-21 02:38:59
458186ApplicationsreavertmUNCONFIRMED=dev-util/ddd-3.3.12-r3: fails to compile with ncurses[tinfo]2013-02-19 20:20:58
398295StagesreleaseUNCONFIRMEDstage3-amd64-20120105 has PAGER=/usr/bin/less set but sys-apps/less not installed2013-02-12 19:10:42
437028UnspecifiedrafaelmartinsUNCONFIRMEDdev-lua/luafilesystem-1.6.0 version bump2013-02-03 13:08:28
455824ApplicationsrafaelmartinsUNCONFIRMEDwww-client/xombrero-1.4.0 - make branding configurable2013-02-07 17:56:52
373891EbuildsramerethUNCONFIRMEDnet-misc/stunnel build fails: #error OpenSSL library compiled without thread support2012-12-25 04:27:10
457924Keywording and StabilizationramerethUNCONFIRMED=dev-vcs/gitolite-3.3 stable request2013-02-17 16:56:42
398677GamesreavertmUNCONFIRMEDdev-games/openscenegraph-3.0.1 - /usr/lib64/libdcmimgle.a(dcmimage.o): relocation R_X86_64_32S again2012-11-18 23:58:42
412135PrintingreavertmUNCONFIRMEDapp-text/poppler-0.16.7 and 0.20.2: pdftops creates postscript files which don't print on Brother MF2012-11-25 21:17:48
421239EbuildsrafaelmartinsUNCONFIRMEDdev-lua/luadoc - lua: /usr/bin/luadoc:7: module 'luadoc' not found: ...2013-02-03 13:14:21
424463EbuildsrafaelmartinsUNCONFIRMEDapp-portage/g-octave please provide an updated database2012-08-03 22:03:54
434236DevelopmentrafaelmartinsUNCONFIRMEDdev-lua/luafilesystem-1.5.0 with dev-lang/lua-5.2.1: src/lfs.c:779:30: error: array type has incompl2013-02-03 13:08:19
430996EbuildsradioUNCONFIRMEDnet-wireless/gnuradio-3.6.1-r1 does not byte-compile grc_gnuradio package2012-08-12 11:35:18
430348EbuildsradioUNCONFIRMEDnet-wireless/gnuradio-3.6.1-r1 USE="doc" - some documentation is installed outside /usr/share/doc/${2012-08-13 23:02:49
432106DevelopmentradhermitUNCONFIRMEDdev-libs/protobuf-2.4.0a fails to crosscompile: …/protoc: cannot execute binary file2013-01-01 20:30:56
368497ApplicationsradhermitUNCONFIRMEDapp-admin/lsyncd - add init.d and configuration files2012-11-24 08:30:17
419389ApplicationsradhermitUNCONFIRMEDwww-client/lynx-2.8.8_pre12 fails to build: ../../../WWW/Library/Implementation/HTUtils.h:735:17: fa2012-06-16 09:40:28
412581Installation Handbookr0bertzUNCONFIRMED[zh_cn] two problems in Chinese handbook2012-06-30 17:52:43
458278DevelopmentqtUNCONFIRMEDdev-util/eric-5.2.7 - RuntimeError: the sip module implements API v9.0 to v9.1 but the PyKDE4.kdeui 2013-02-21 12:24:07
403479Ebuildsqmail-bugsUNCONFIRMEDmail-mta/netqmail-1.06 - typo in /etc/tcprules.d/Makefile.qmail2012-02-14 18:31:39
435334Applicationsqmail-bugsUNCONFIRMEDmail-mta/netqmail-1.06 - pkg_postinst(): queue-repair failed2012-10-14 19:09:10
433944KDEqtUNCONFIRMEDdev-python/PyQt4 does not install phonon-module2013-01-02 12:49:56
448178LibraryqtUNCONFIRMED[qt overlay] x11-libs/qt-webkit-5.0.0: Project ERROR: Unknown module(s) in QT: opengl2013-01-09 08:46:26
451456LibraryqtUNCONFIRMED[qt overlay] Qt5 packages try to link against already installed versions during recompilation2013-02-14 11:59:11
457024LibraryqtUNCONFIRMED[qt overlay] add Qt5 tools module2013-02-13 10:20:17
379033Serverqmail-bugsUNCONFIRMEDmail-filter/qmail-scanner: Causing problems with RBL-checks activated spamassassin on target when se2011-08-14 02:01:12
442326ApplicationsqemuUNCONFIRMEDsys-firmware/sgabios-0.1_pre8 - Compile phase failure - ld: i386:x86-64 architecture of input file `2012-11-08 10:43:27
408917EbuildsqaUNCONFIRMEDHomepage variable contains sub variable2012-03-20 16:03:28
440214EbuildsqaUNCONFIRMED[tracker] packages with emerge messages that can be improved by checking the previous installed vers2013-02-14 19:45:48
435534ApplicationsqemuUNCONFIRMEDapp-emulation/qemu-kvm-1.1.1-r1 - manual pages are not installed2012-11-30 12:14:46
457676DevelopmentpythonUNCONFIRMEDdev-python/pymad-0.6 madmodule.so is segfaulting as soon as it is invoked2013-02-15 17:17:34
455210DevelopmentpythonUNCONFIRMEDdev-lang/python-3.2.3 fails to build native Parser/pgen while crosscompiling2013-02-04 19:42:53
450086Keywording and StabilizationpythonUNCONFIRMEDPlease stabilize =dev-python/stevedore-0.62013-01-05 17:04:57
450084Keywording and StabilizationpythonUNCONFIRMEDPlease stabilize =dev-python/virtualenv-clone-0.2.42013-01-05 17:04:31
439724ApplicationspythonUNCONFIRMED>app-editors/leo-4.9 USE =tk is not needed anymore2012-10-26 16:26:57
443510EbuildspythonUNCONFIRMEDdev-lang/python should install helper file for sys-devel/gdb2012-11-16 16:07:09
434716DevelopmentpythonUNCONFIRMEDdev-lang/python:2.7 - POSIX_SEMAPHORES_NOT_ENABLED 1 in /usr/include/python2.7/pyconfig.h2012-09-11 15:18:37
431608Keywording and StabilizationpythonUNCONFIRMEDStabilize dev-python/virtualenvwrapper2013-01-04 01:17:32
433003LibrarypythonUNCONFIRMEDdev-libs/libxml2 - File "/usr/lib/python2.7/xml/sax/__init__.py", line 93, in make_parser raise 2012-09-09 04:48:34
426658EbuildsproaudioUNCONFIRMEDmedia-sound/phasex-0.12.0_beta3 installs desktop and icon files in wrong places2013-01-13 09:19:20
426672EbuildsproaudioUNCONFIRMEDmedia-sound/timemachine should install a desktop file2012-07-18 15:45:01
427244DevelopmentpythonUNCONFIRMEDdev-python/networkx 1.7 - Syntax errors / warnings in Python modules for CPython 3.2: File "/usr/lib2013-01-22 11:57:15
426194ApplicationspythonUNCONFIRMEDapp-admin/eselect-python: python wrapper breaks OpenELEC build2012-07-12 00:36:25
425152ApplicationspythonUNCONFIRMEDdev-python/genshi-0.6: ebuild does not expose speedups c module2012-07-27 20:44:20
421687Keywording and StabilizationpythonUNCONFIRMEDdev-python/pylint-0.25.1 - please stabilize2012-06-18 18:27:14
408147UnspecifiedpythonUNCONFIRMEDapp-admin/eselect-python with FEATURES="nomac nodoc" - eselect python does not set man page (...)2012-03-14 19:23:10
407681ApplicationspythonUNCONFIRMEDmedia-sound/quodlibet-2.3.92-r1 segfaults when dev-lang/python-2.7.2-r3 is compiled with the hardene2012-10-06 17:14:29
407813EbuildspythonUNCONFIRMEDPlease stabilize dev-python/fabric-1.2.22012-11-09 18:32:51
402659DevelopmentpythonUNCONFIRMEDdev-python/pydb-1.26-r1 - ImportError: No module named fns2012-04-24 16:19:54
399139EbuildspythonUNCONFIRMEDapp-admin/eselect-python - Can't select python without man page2012-01-17 14:56:48
395495ApplicationspythonUNCONFIRMEDdev-lang/python-3.2.2 failed (test phase)2011-12-22 08:56:37
394103Core systempythonUNCONFIRMEDdev-lang/python-2.7.2-r3 fix for exception: "handle out of range in select()"2011-12-10 21:27:35
386163Core systempythonUNCONFIRMEDEmerging app-admin/eselect-python-20100321 fails with 2011-10-09 11:37:24
371009DevelopmentpythonUNCONFIRMEDdev-lang/python-2.7.1-r1 fails to cross compile on mipsel-r3000-linux-uclibc2011-10-02 21:07:28
366571DevelopmentpythonUNCONFIRMEDapp-admin/eselect-python: override python version from environment2011-07-29 06:41:23
389633Unspecifiedproxy-maintUNCONFIRMEDx11-drivers/xf86-input-wacom / sys-kernel/linuxwacom-module - missing udev rules for wacom2013-02-16 14:37:56
458256ApplicationsprometheanfireUNCONFIRMEDmedia-sound/spotify-0.8.8.323-r1 spotify-dbus.py isn't python 3.2 compatible2013-02-19 14:22:25
413623ApplicationsproaudioUNCONFIRMEDmedia-sound/terminatorx 3.82 and 3.84 - tX_midiin.cc:452:2: error: cannot convert ‘gzFile_s**’ to ‘g2013-01-06 04:23:20
412715EbuildsproaudioUNCONFIRMEDmedia-plugins/swh-plugins: please remove obsolete DEPEND="dev-vcs/cvs"2012-04-21 17:31:26
403595ApplicationsproaudioUNCONFIRMEDmedia-sound/ardour-2.8.12 doesn't honor LINGUAS for locale files2012-02-23 21:38:44
403471ApplicationsproaudioUNCONFIRMEDmedia-sound/rezound-0.12.3_beta-r2 - work/rezound-0.12.3beta/src/frontend_fox/../../src/PoolFile/TSt2012-02-14 18:25:30
396211ApplicationsproaudioUNCONFIRMEDmedia-sound/ardour crashes - /usr/share/themes/Clearlooks/gtk-2.0/gtkrc:76: error: unexpected identi2012-10-06 14:26:04
391675EbuildsproaudioUNCONFIRMEDmedia-plugins/swh-plugins - make x86 extensions optional at compile time2012-07-04 13:47:31
455238LibraryprintingUNCONFIRMEDmedia-libs/vigra-1.7.1-r1 failed (compile phase): ImportError: No module named nose2013-02-05 01:00:18
450220ApplicationsprintingUNCONFIRMED=net-print/cups-1.5.2-r4 - German localization file has empty strings.2013-01-05 18:07:19
440886PrintingprintingUNCONFIRMEDnet-print/cups-bjnp-1.1 - In file included from bjnp-io.c:22:0: bjnp-protocol.h:100:5: error: redefi2013-02-11 11:01:36
425192PrintingprintingUNCONFIRMEDapp-text/acroread-9.5.1-r1 not able to open file by clicking in filemanager, bum request for acrorea2013-02-15 17:03:57
429442EbuildsprintingUNCONFIRMEDapp-text/ghostscript-gpl - disable endian check when cross-compiling2012-08-02 13:07:09
430498PrintingprintingUNCONFIRMEDnet-print/cups-bjnp-1.0 and net-print/cups-1.6.1: Failed to read side-channel request!2012-08-09 23:40:25
414593PrintingprintingUNCONFIRMEDapp-text/ghostscript-gpl 9.05-r1 - ld: error in ./sobin/libgs.so(.eh_frame); no .eh_frame_hdr table 2012-12-19 23:42:44
399741PrintingprintingUNCONFIRMEDmedia-libs/plotutils-2.6 - g_miscmi.c:26:58: fatal error: xmi.h: No such file or directory2013-02-12 05:34:31
455226Prefix SupportprefixUNCONFIRMEDprefix has python3_2 enabled but no python:3.2 ebuilds2013-02-03 02:45:11
458042Prefix SupportprefixUNCONFIRMEDfix_libtool_files.sh --justfixit doesn't look for fixlafiles.awk in EPREFIX2013-02-18 00:28:40
456720Prefix SupportprefixUNCONFIRMEDFiles are outside of the prefix for dev-util/diffuse-0.4.62013-02-11 02:30:56
449786Prefix SupportprefixUNCONFIRMEDPlease keyword dev-perl/Exporter-Lite and dev-perl/Sys-CPU on ~ppc-macos2013-01-02 17:26:29
447556Mac OSXprefixUNCONFIRMEDdev-python/virtualenv-1.8.4 emerge failed with error virtualenv-3.3 already exists2013-01-19 18:48:58
446796ApplicationsprefixUNCONFIRMEDapp-misc/pax-utils: src_install tries to compile stuff2013-01-02 17:41:59
437362Prefix SupportprefixUNCONFIRMEDdev-libs/jemalloc-3.0.0 fails to build because of double prefix2012-10-06 16:47:56
437020Prefix SupportprefixUNCONFIRMEDbootstrap-prefix failed on gcc-4.2.4 in stage 32012-10-03 15:44:28
433972Prefix SupportprefixUNCONFIRMEDapp-text/tree-1.6.0-r1: failed to compile on Mac OSX Mountain Lion2012-10-10 01:23:24
422535Prefix SupportprefixUNCONFIRMEDdev-lisp/sbcl-1.0.55-r1: Fail to compile on x64 OS X due to missing binary2012-06-21 05:23:34
419793Prefix SupportprefixUNCONFIRMEDapp-emulation/hercules-3.07: install failed due to chown root2012-08-25 06:35:42
416949Prefix SupportprefixUNCONFIRMEDapp-misc/figlet-222 works fine on x64-macos2012-05-21 18:21:31
416501Prefix SupportprefixUNCONFIRMEDdev-java/jffi-1.0.0 and jffi-1.0.11 failed to build: No rule to make target2012-05-18 14:04:04
416465Prefix SupportprefixUNCONFIRMEDFailed to emerge dev-libs/protobuf-2.4.1 "No suitable threading library available."2012-08-12 20:11:24
416269Prefix SupportprefixUNCONFIRMEDdev-python/reportlab-2.5-r1 fails to build : libart.h : No such file or directory2012-05-23 15:49:39
414289Prefix SupportprefixUNCONFIRMEDeselect-rails-0.18 support2012-05-23 20:25:13
413167Prefix SupportprefixUNCONFIRMEDsys-fs/fuse-2.9.0: emerge failed at compile phase.2012-04-22 23:17:14
412773Prefix SupportprefixUNCONFIRMEDapp-editors/emacs-vcs: Includes incorrect libpng header file2012-04-22 13:12:19
392979Prefix SupportprefixUNCONFIRMEDmedia-gfx/fontforge-20110222-r1 fails to compile on x86-macos2012-05-31 12:28:59
384581Mac OSXprefixUNCONFIRMEDapp-editors/emacs-23.3-r2: emerge failed with error unexec: my_endbss_static is not in section __bss2011-10-31 03:04:33
381105Prefix SupportprefixUNCONFIRMEDdev-lang/nasm-2.09.10: failed to compile in prefix/linux-amd642011-08-30 04:04:34
371601Prefix SupportprefixUNCONFIRMEDmedia-libs/gegl fails to compile2012-06-23 20:46:50
443962Core systemppc64UNCONFIRMEDsys-boot/yaboot-static-1.3.17-r1 unable to read ext2 filesystem on powermac G52012-11-20 00:06:17
401617Core systemppc64UNCONFIRMEDsys-kernel/gentoo-sources-3.2.1-r2 produces a lot of "BUG: using smp_processor_id() in preemptible .2012-02-05 03:20:56
413695Unspecifiedppc64UNCONFIRMEDinstall-powerpc-minimal-20120415.iso is not bootable2012-04-27 15:05:40
447006Enhancement/Feature Requestsportage-utilsUNCONFIRMEDapp-portage/portage-utils' "qgrep" should parse multiple args over entire file for broader search re2012-12-12 17:20:02
367199Applicationsportage-utilsUNCONFIRMEDapp-portage/portage-utils 'qlop' - gauge option's description is vague and misleading2011-05-17 10:12:02
428124Applicationspolynomial-cUNCONFIRMEDapp-emulation/virtualbox-4.1.12: "Failed to create the VirtualBox COM object"2012-09-21 15:25:00
432884Ebuildspolynomial-cUNCONFIRMEDapp-emulation/virtualbox-modules: undeclared 'VM_RESERVED'2013-01-24 15:45:20
436360Applicationspolynomial-cUNCONFIRMEDwww-client/seamonkey-2.12.1 - /bin/sh: line 1: 24652 Aborted .../work/comm-release/seamonk/suite/ins2012-09-28 14:44:46
436536Applicationspolynomial-cUNCONFIRMEDnet-irc/xchat-2.8.8-r2 - patches that apply cleanly and fix several issues2012-09-29 15:32:27
438164Unspecifiedpolynomial-cUNCONFIRMEDapp-emulation/virtualbox - EQ overflow in X server when virtualbox starts with Wacom tablet's mouse 2012-10-14 18:22:06
438930Ebuildspolynomial-cUNCONFIRMEDapp-emulation/virtualbox-4.2 USE=vnc - vnc module is built but not installed2012-12-21 18:07:10
440532Applicationspolynomial-cUNCONFIRMEDapp-emulation/virtualbox-modules-4.1.22: some elog messages should only be shown when upgrading from2012-10-31 16:22:12
447302Applicationspolynomial-cUNCONFIRMEDapp-emulation/virtualbox-modules-4.2.4 with gentoo-sources-3.7.0 - Header files were moved and re-or2013-02-03 19:32:07
447356Unspecifiedpolynomial-cUNCONFIRMEDapp-emulation/virtualbox-modules-4.2.4 with kernel 3.7 - modprobe: FATAL: Error inserting vboxdrv (/2013-02-14 10:04:16
426898Applicationspolynomial-cUNCONFIRMED=app-emulation/virtualbox-modules-4.1.12 with sys-kernel/vanilla-sources-3.4.5 - src_test(): .../wor2012-11-13 17:18:09
423355Applicationspolynomial-cUNCONFIRMEDapp-emulation/virtualbox - remove `-f' from VBox_load_modules2012-07-26 14:30:14
408607Applicationspolynomial-cUNCONFIRMEDapp-emulation/virtualbox - make --disable-vmmraw optional2012-03-18 05:32:07
413467Applicationspolynomial-cUNCONFIRMEDapp-emulation/virtualbox-4.1.12: parallel build sometimes fails2013-01-07 06:25:45
401823Applicationspolynomial-cUNCONFIRMEDseamonkey desktop file lists unhandled mimetype associations2012-02-16 12:48:55
404345Applicationspolynomial-cUNCONFIRMEDapp-emulation/virtualbox-modules-4.1.4 - work/vboxpci/linux/VBoxPci-linux.c:989:9: Fehler: Zu wenige2012-02-18 16:57:37
395927Applicationspolynomial-cUNCONFIRMEDapp-emulation/virtualbox-4.1.8, app-emulation/virtualbox-extpack-oracle-4.1.8 - broken /usr/lib64/vi2011-12-26 10:21:44
383669Applicationspolynomial-cUNCONFIRMEDapp-emulation/virtualbox-4.1.2: fails to compile due to Java name clash2011-12-21 14:52:14
395429Ebuildspolynomial-cUNCONFIRMEDapp-emulation/virtualbox-modules: need check CONFIG_HZ=value2011-12-21 02:10:58
379967Applicationspolynomial-cUNCONFIRMEDapp-emulation/virtualbox-modules-4.0.12 doesn't check kernel config on compatibility2011-08-22 12:36:13
367443Ebuildspolynomial-cUNCONFIRMEDapp-emulation/virtualbox-9999 sets RPATH to /opt/VirtualBox but is installed to /usr/lib/virtualbox2011-05-17 17:41:46
366215Applicationspolynomial-cUNCONFIRMEDapp-emulation/virtualbox has incomplete dependencies2013-01-01 09:29:16
440218Conceptual/Abstract Ideaspms-bugsUNCONFIRMEDportage should have a ebuild-accessible variable for the USE flags of previously-installed versions2012-10-30 16:30:36
444568PMS/EAPIpms-bugsUNCONFIRMED[Future EAPI] Export XDG_* variables in ebuild environment2013-01-03 05:44:14
438494Conceptual/Abstract Ideaspms-bugsUNCONFIRMEDHave configuration file protection against new files in conf.d/ directories2012-10-16 15:46:11
414817PMS/EAPIpms-bugsUNCONFIRMED[Future EAPI] Support for make.defaults, use.force, use.stable.force, use.mask, use.stable.mask, pac2013-01-12 13:13:11
414813PMS/EAPIpms-bugsUNCONFIRMED[Future EAPI] REPOSITORY variable set in ebuild environment2013-01-12 13:12:38
414811PMS/EAPIpms-bugsUNCONFIRMED[Future EAPI] globstar shell option enabled by default2013-02-07 19:03:35
456820Developmentphp-bugsUNCONFIRMEDdev-lang/php-5.3.21-r2 fails to compile with USE="ssl"2013-02-12 08:54:30
439918Serverphp-bugsUNCONFIRMEDdev-lang/php USE=fpm should provide a systemd service file2012-12-27 21:50:11
448254Keywording and Stabilizationphp-bugsUNCONFIRMED=dev-libs/libxdiff-0.23 - Please stabilize2012-12-24 15:41:34
448564Keywording and Stabilizationphp-bugsUNCONFIRMEDplease stabilize dev-php/pecl-apc-3.1.132013-01-28 10:43:52
432804Project-specific documentationphp-bugsUNCONFIRMEDhttp://www.gentoo.org/proj/en/php/php-upgrading.xml multiple small issues2012-08-27 10:29:56
437064Applicationsphp-bugsUNCONFIRMEDdev-lang/php (5.4.6 and 5.4.7) fail to build under x32 profile2012-10-03 13:16:23
412913Applicationsphp-bugsUNCONFIRMEDapp-admin/eselect-php leaves dangling files2012-04-24 14:07:08
417991Developmentphp-bugsUNCONFIRMEDdev-php/phpunit-3.5.13 should RDEPEND on 2012-10-14 15:29:54
392719Developmentphp-bugsUNCONFIRMEDdev-lang/php does not compile with alternative ROOT2012-03-02 12:58:20
457958Keywording and Stabilizationpgsql-bugsUNCONFIRMEDdev-db/postgis-2.0.1 stable request2013-02-17 17:00:06
454882DevelopmentperlUNCONFIRMEDdev-perl/TermReadKey-2.300.0 - ReadKey.o: file not recognized: file truncated - collect2: ld executi2013-01-31 23:12:14
453122ApplicationsperlUNCONFIRMEDPlease stabilize =app-text/po4a-0.42 (was: 0.38 misparses CDATA section)2013-02-19 20:59:42
448104DevelopmentperlUNCONFIRMEDdev-perl/PortageXS-0.02.10-r2 - test-suite fails - Cannot open file /etc/portage/make.conf at lib//P2012-12-24 09:37:14
438660Eclasses and ProfilesperlUNCONFIRMEDperl-module.eclass should not delete .packlist files2012-10-17 12:43:39
432944UnspecifiedperlUNCONFIRMEDperl-gcpan/Math-GSL-0.27 wants to install perl-gcpan/Test-Tester-0.108 which conflics with installed2012-09-17 07:17:25
427990EbuildsperlUNCONFIRMEDvirtual/perl-File-Spec-3.330.0-r1 tries to downgrade dev-lang/perl-5.16.02012-09-25 19:42:06
425200EbuildsperlUNCONFIRMEDwww-apps/Apache-Gallery-1.0_rc3 missing RDEPEND2012-07-10 04:10:51
413263Keywording and StabilizationperlUNCONFIRMEDPlease stabilize =perl-core/MIME-Base64-3.130.0 and virtual/perl-MIME-Base64-3.130.0-r22012-11-01 08:46:25
408151LibraryperlUNCONFIRMEDdev-perl/Cairo-1.90.0 with dev-lang/perl-5.14.2 - Failed 1/8 test programs. 6/270 subtests failed.2012-04-03 19:32:36
402691ApplicationsperlUNCONFIRMEDapp-text/po4a-0.41 doesn't honor LINGUAS for locale files2012-02-23 21:38:44
400659DevelopmentperlUNCONFIRMEDperl-core/Module-Build and dependencies on it are unnecessary2012-01-29 00:25:09
386751ApplicationsperlUNCONFIRMEDdev-lang/perl-5.12.4-r1: 2 files left after upgrade and "perl-cleaner --all"2012-07-14 17:16:36
383241ApplicationsperlUNCONFIRMEDdev-lang/perl-5.12.4-r1 - ./hints/linux.sh: line 194: ./a.out: cannot execute binary file2011-09-19 02:57:56
384137EbuildsperlUNCONFIRMEDdev-perl/Inline-0.480.0: fails tests with parallel make2011-09-27 16:26:48
378645DevelopmentperlUNCONFIRMEDdev-perl/math-pari ignores profile, and fails when compiling on2011-08-20 17:10:38
374149DevelopmentperlUNCONFIRMEDMoose-2.1.0 conflicts with all existent versions of File-ChangeNotify, MooseX-Params-Validate, and M2011-07-10 03:47:03
452608ApplicationspdaUNCONFIRMEDapp-pda/gtkpod-2.1.3-r1 with dev-util/anjuta-3.4.3 - In function ‘on_layout_lock_toggle’: anjuta-act2013-02-01 22:49:13
455268DevelopmentpchristUNCONFIRMED=dev-lisp/sbcl-1.1.3 - WARNING! Some of the contrib modules did not build successfully or pass the2013-02-05 16:16:54
431036ApplicationspchristUNCONFIRMEDdev-lisp/sbcl fails to compile (when the build system is testing "sb-posix")2012-08-30 18:50:48
454648LibrarypatrickUNCONFIRMEDdev-libs/leveldb should install memenv library2013-02-03 17:27:05
445120LibrarypatrickUNCONFIRMEDsys-libs/tdb-1.2.10 - Compilatin phase failed - [Errno 2] No such file or directory: '/var/tmp/porta2012-12-08 15:46:16
447774Core systempatrickUNCONFIRMEDsys-libs/tdb-1.2.11: tdb.h uses mode_t but does not include relevant system header2012-12-19 02:24:08
447780EbuildspatrickUNCONFIRMEDnet-analyzer/snort init scripts snort.rc1* still use opts variable2012-12-19 02:35:38
444218ApplicationspatrickUNCONFIRMEDwww-servers/apache-2.4.3 - init script doesn't handle failed start correctly2013-02-16 13:19:08
438758ServerpatrickUNCONFIRMEDwww-servers/apache-2.4 - Syntax error on line 60 of /etc/apache2/modules.d/40_mod_ssl.conf: Invalid 2013-02-16 13:32:50
438150ServerpatrickUNCONFIRMEDwww-servers/apache-2.4.3 - configuration files have "require host", should be "require ip"2013-02-16 14:07:53
432964ApplicationspatrickUNCONFIRMEDwww-servers/apache - init.d script fails to detect server check/startup problem2013-02-16 13:23:59
410699ApplicationspatrickUNCONFIRMEDwww-servers/apache-2.4.1-r2 /etc/init.d/apache2 start complains about Config variable ${SVN_REPOS_LO2013-02-16 13:32:09
424373ApplicationspatrickUNCONFIRMEDnet-misc/strongswan-5.0.0 - Outdated description about (non-)root privileges2012-07-03 14:39:13
427946Eclasses and ProfilespatrickUNCONFIRMEDapache-2.eclass: Proposed enhancement: USE_EXPAND of APACHE2_MODULES should support IUSE-DEFAULTS2013-02-17 09:25:03
430274EbuildspatrickUNCONFIRMEDwww-servers/apache-2.2.22-r1: modules aren't compiled with -fPIC2013-02-16 13:34:26
409303ApplicationspatrickUNCONFIRMEDdev-lang/nqp-2012.02 - In file included from dyncall_thunk.c:27:0: dyncall_thunk.h:59:1: error: func2012-03-22 14:55:21
406187LibrarypatrickUNCONFIRMEDsys-libs/talloc-2.0.7 - [Errno 2] No such file or directory: '/var/tmp/portage/sys-libs/talloc-2.0.72012-03-29 20:03:40
398755ApplicationspatrickUNCONFIRMEDnet-misc/elliptics-2.11.0.12 - a fault tolerant key/value storage2012-12-25 19:11:17
446172Core systempam-bugsUNCONFIRMEDsys-libs/pam-1.1.5 fails to cross-compile because flex is not installed in the target2013-01-09 09:31:35
456908Core systempam-bugsUNCONFIRMEDsys-libs/pam-1.1.6-r2: /usr/lib64/portage/bin/isolated-functions.sh: line 215: wait: `Failed Running2013-02-16 21:10:14
371635EbuildspatrickUNCONFIRMEDapp-portage/getdelta picks bad source file names2011-06-15 01:13:14
373979EbuildspatrickUNCONFIRMEDapp-emulation/virtualbox-modules-4.0.10 does not compile if KBUILD_OUTPUT != KERNEL_DIR2012-09-11 09:29:19
379003LibrarypatrickUNCONFIRMEDsys-libs/tevent-0.9.12 fails on portage-multilib because of waflib module's python support2012-12-25 21:03:18
391041ServerpatrickUNCONFIRMEDwww-servers/apache 2.2 - suexec and django non-ASCII file upload incompatibility as apache cut out L2013-02-16 14:04:07
428282LibrarypachoUNCONFIRMEDnet-wireless/bluez-4.99 expected specifier-qualifier-list before ‘typeof’ in bluetooth.h2013-02-12 21:43:00
452162ApplicationspachoUNCONFIRMED=net-wireless/bluez-5.2 version bump request2013-02-08 20:41:38
389787Core systempam-bugsUNCONFIRMEDsys-libs/pam-1.1.5: User mail has no access to the /etc/shadow file via pam2011-11-08 15:50:11
410421Core systempam-bugsUNCONFIRMEDauth: PAM unable to resolve symbol: pam_sm_open_session2012-05-22 05:00:57
412941Applicationspam-bugsUNCONFIRMEDsys-auth/pam_blue-0.9.0: various username matching problems2012-05-21 21:45:01
456934Other documentsoverlaysUNCONFIRMEDSince the 2012-09-09-make.conf-and-make.profile-move the overlay instructions are out of date2013-02-13 10:03:36
307401ApplicationspachoUNCONFIRMEDmedia-gfx/xsane crashes during startup if xinerama is enabled2012-03-02 11:17:03
458320ApplicationsottxorUNCONFIRMEDgoogle-talkplugin-3.13.2.0 does not work correctly2013-02-20 10:16:03
458156OpenRCopenrcUNCONFIRMEDsys-apps/openrc-0.11.8 creates /etc/runlevels/sysinit/udev with wrong target when ROOT is not /2013-02-19 09:30:05
454914OpenRCopenrcUNCONFIRMEDsys-apps/openrc: Feature Request: Open logfile before chuid option2013-01-31 23:56:37
454120OpenRCopenrcUNCONFIRMEDsys-apps/openrc-0.11.8: Service XY stop makes other services stop, but consequent start of XY leaves2013-01-26 09:43:51
446606OpenRCopenrcUNCONFIRMEDsys-apps/openrc: Routing policy rules need to be set before routes2013-01-15 20:33:29
447678OpenRCopenrcUNCONFIRMEDsys-apps/openrc-0.11.8 - rm: cannot remove /run/openrc: Read-only file system2012-12-19 17:54:11
443480OpenRCopenrcUNCONFIRMEDsys-apps/openrc: iproute2 net module: add xfrm ( ipsec ) support2012-11-17 08:02:46
442594OpenRCopenrcUNCONFIRMEDsys-apps/openrc-0.11.4: ifconfig module doesn't support ipv6 routes without explicit prefix2012-12-25 09:18:25
438964OpenRCopenrcUNCONFIRMEDsys-apps/openrc-0.10.5 writes to /lib64/rc/console/2012-10-22 15:24:16
430318OpenRCopenrcUNCONFIRMEDsys-apps/openrc-0.10.5 fails to remounts reiserfs root file system read only on reboot: failed becau2012-11-07 11:40:40
434020OpenRCopenrcUNCONFIRMEDnet.example in docs dir suggest a faulty bond0-configuration.2012-09-05 11:55:57
427998OpenRCopenrcUNCONFIRMEDsys-apps/openrc: The root script does not work correctly if root or any filesystems it remounts are 2012-10-18 17:42:12
411461OpenRCopenrcUNCONFIRMEDsys-apps/openrc-0.9.8.4: services fail to start at boot because of "stalled" deptree cache2012-04-10 12:21:07
411815OpenRCopenrcUNCONFIRMEDsys-apps/openrc-0.9.8.4 does not install ethtool_ring and txqueuelen params for network cards in bon2012-05-05 17:48:36
383493baselayoutopenrcUNCONFIRMEDsys-apps/openrc-0.9.3-r1, net-firewall/ipset, net-firewall/iptables: Circular Dependency with custom2011-09-20 13:06:03
372551OpenRCopenrcUNCONFIRMEDsys-apps/openrc: rc.c:read_key() hangs waiting for input at Interactive? prompt (termios problem)2012-02-15 12:49:05
369925OpenRCopenrcUNCONFIRMED/etc/conf.d/net - Setting associate_timeout_ does not have any effect with net-wireless/wpa_s2013-01-01 17:01:05
369811ApplicationsopenrcUNCONFIRMEDsys-apps/openrc: Patch to measure time required for starting daemons (was: delay to sys-auth/console2012-05-20 13:25:32
367793OpenRCopenrcUNCONFIRMED[TRACKER] packages with scripts that are not openrc compatible2011-12-12 05:30:39
366779OpenRCopenrcUNCONFIRMEDsys-apps/openrc - "cannot allocate memory" when overcommit is disabled2012-02-27 14:07:23
449104GNOMEopenofficeUNCONFIRMEDThe variable OOO_FORCE_DESKTOP=gnome don't work anymore with Libreoffice and Openbox2012-12-30 16:53:23
415577ApplicationsopenofficeUNCONFIRMEDapp-office/libreoffice-3.5.3.2 QA Notice: make jobserver unavailable2012-05-16 02:57:58
415367ApplicationsopenofficeUNCONFIRMEDapp-office/libreoffice selecting part of a file name does not work when using "LibreOffice file dial2012-05-10 13:37:24
377933ApplicationsopenofficeUNCONFIRMEDapp-office/libreoffice-3.4.2.3 Impress text boxes become inaccessible when containing RTL text2012-04-03 23:26:53
424840ApplicationsolegUNCONFIRMEDnet-wireless/reaver-1.4 should probably maintain database in /var/lib/reaver, not /etc/reaver2012-07-05 15:27:53
448142EbuildsnixphoeniUNCONFIRMEDsci-electronics/eagle-6.4.0 - Version bump.2013-01-29 13:36:42
450252EbuildsnirbheekUNCONFIRMEDNetworkmager and dhclient: can't create /var/lib/dhclient/*-eth0.lease2013-01-06 18:25:17
457092ApplicationsnirbheekUNCONFIRMEDnet-misc/networkmanager disables IPv6 Privacy Extensions2013-02-13 19:21:04
445492ApplicationsnirbheekUNCONFIRMEDgnome-extra/nm-applet-0.9.6.4 leaks memory2012-12-01 16:22:15
424357EbuildsnirbheekUNCONFIRMEDdev-python/pypy-1.9-r1: There is NOT at least 4 gibibytes RAM2012-12-16 10:05:41
457656ApplicationsnikoliUNCONFIRMEDmedia-sound/clementine (while scanning media) - segfault in TagLib::File::find(TagLib::ByteVector co2013-02-15 15:57:13
456024ApplicationsnikoliUNCONFIRMEDmedia-sound/clementine 1.1.1 crashes with 0 size .mood file when moodbar is enabled in the playlist2013-02-07 14:14:11
456790DevelopmentneurogeekUNCONFIRMEDdev-db/unixODBC-2.3.1: please add --enable-iconv-char-{utf8,utf16le}2013-02-11 17:12:48
433443EbuildsnetmonUNCONFIRMEDnet-analyzer/snmptt should install snmptthandler-embedded2012-09-03 15:46:10
408825ApplicationsnetmonUNCONFIRMEDnet-analyzer/ntop-4.1.0 No interface has been configured. Please configure ntop first.2012-08-11 18:16:20
408263ApplicationsnetmonUNCONFIRMED=net-analyzer/fail2ban-0.8.6 iptables bans lost on restart2012-03-15 15:16:00
383055EbuildsnetmonUNCONFIRMEDnet-analyzer/rrdtool[ruby] - fails to compile2011-09-16 22:56:02
450730Servernet-proxyUNCONFIRMEDnet-proxy/squid-3.1.22 vs net-proxy/squidclamav-6.10 vs net-proxy/c-icap-0.2.4 problems2013-01-08 12:01:38
367375EbuildsnetmonUNCONFIRMEDnet-analyzer/ndoutils-1.4_beta9: "db/" directory from source code is not installed to system2012-02-09 10:57:19
389419Applicationsnet-proxyUNCONFIRMEDnet-proxy/ntlmaps - add multiple configuration support2011-11-03 15:39:17
389675Applicationsnet-proxyUNCONFIRMEDnet-proxy/polipo-1.0.4.1 reports timeout for domains that are available2011-11-08 03:18:20
383969Applicationsnet-proxyUNCONFIRMEDnet-proxy/tsocks manpage mentions TSOCKS_CONFFILE, but the program uses TSOCKS_CONF_FILE2011-10-13 01:17:57
375713Applicationsnet-proxyUNCONFIRMEDnet-proxy/dante-1.3.1 can not enable "preload"2011-08-10 05:12:50
455816Librarynet-p2pUNCONFIRMEDnet-libs/gupnp-igd - src_prepare(): libgupnp-igd/Makefile.am:64: HAVE_INTROSPECTION does not appear 2013-02-06 13:54:26
446184Applicationsnet-p2pUNCONFIRMEDnet-libs/libtorrent-0.13.2: fails to cross compile2012-12-06 05:02:50
439406Ebuildsnet-p2pUNCONFIRMEDnet-p2p/amule - add epatch_user support2012-10-25 01:07:21
433942Applicationsnet-p2pUNCONFIRMEDnet-p2p/amule - amule fails to start when an empty ~/.aMule/statistics.dat file is present2012-09-04 15:33:37
420157Ebuildsnet-p2pUNCONFIRMED${AMULEHOME} do not work for amuled, amuleweb (net-p2p/amule-2.3.1)2013-01-14 23:46:38
426912Librarynet-p2pUNCONFIRMEDnet-p2p/deluge unicode casting problems with net-libs/rb_torrent 0.16.x2013-01-26 06:22:29
401681Applicationsnet-p2pUNCONFIRMEDnet-misc/curl-7.24.0 with net-p2p/rtorrent-* leads to 100% CPU load.2013-01-01 14:36:36
378413Applicationsnet-newsUNCONFIRMED[patch] net-news/yarssr-0.2.2-r1: URL Handler fails to launch correct URL in web browser2011-08-11 15:04:02
377289Ebuildsnet-p2pUNCONFIRMEDnet-p2p/mldonkey: use bw_toggle in the init.d script to control bandwidth2011-08-02 11:24:05
388879Servernet-p2pUNCONFIRMEDnet-p2p/mldonkey-3.1.0: Exception setgid failed: Operation not permitted trying to set group_gid2011-11-21 00:31:52
448352Core systemnet-mailUNCONFIRMEDdev-libs/cyrus-sasl-2.1.25-r3 fails to crosscompile: ./makemd5: ./makemd5: cannot execute binary fil2012-12-25 18:07:35
432502Ebuildsnet-mailUNCONFIRMEDmail-filter/mimedefang-2.73 please stabilize2012-11-09 18:12:51
387009Applicationsnet-mailUNCONFIRMEDnet-mail/fetchmail - modified initscript to allow multiple daemons AND inlined configuration2011-11-08 12:12:48
449526Applicationsnet-imUNCONFIRMEDnet-im/pidgin-2.10.6 fails to compile with USE="eds" and gnome-extra/evolution-data-server-3.62013-02-12 16:15:52
430042Ebuildsnet-imUNCONFIRMEDx11-plugins/purple-plugin_pack-2.7.0 should depend on dev-libs/json-glib2012-08-07 03:36:54
423801Applicationsnet-imUNCONFIRMEDnet-im/pidgin-2.10.4[gnutls] fails configure with net-libs/gnutls[nettle]2013-02-13 20:41:47
398961Ebuildsnet-imUNCONFIRMEDnet-im/pidgin-2.10.1: please separate dbus-python dependency into a USE-flag2013-01-01 23:11:04
458024Applicationsnet-fsUNCONFIRMEDnet-nds/rpcbind with sys-libs/uclibc - security.c:23:26: fatal error: rpcsvc/mount.h: No such file o2013-02-20 11:38:41
380889Applicationsnet-imUNCONFIRMEDnet-im/sendxmpp-1.20 does not work when dev-perl/XML-Stream-1.22 is installed (1.23 needed)2011-09-01 19:39:25
443636Core systemnet-fsUNCONFIRMEDnet-fs/davfs2-1.4.7 - User mount does not work, no entry for http://HOST/owncloud/files/webdav.php f2013-02-13 22:40:25
431252Ebuildsnet-fsUNCONFIRMEDnet-fs/nfs-utils unable to run nfs client only (nfs4), without server support in kernel2012-08-14 12:57:57
402343Servernet-fsUNCONFIRMEDnet-fs/netatalk /etc/init.d/afpd needs avahi-daemon even if called with -nozeroconf2012-04-08 21:14:32
406615Applicationsnet-fsUNCONFIRMEDnet-fs/ncpfs: HOMEPAGE and SRC_URI no longer available2012-03-02 18:26:34
425332Ebuildsnet-dialupUNCONFIRMEDnet-dialup/capisuite-0.4.5 doesn't compile with python 3.* as active python interpreter2012-07-09 11:37:10
436122Ebuildsnet-dialupUNCONFIRMEDnet-dialup/ppp-2.4.5-r3 - Failed Patch: 80_all_eaptls-mppe-0.991-gentoo.patch !2012-11-09 04:09:40
407227baselayoutnet-dialupUNCONFIRMEDnet-dialup/ppp - /etc/init.d/net.ppp0 goes into endless loop after openvpn was stopped2012-04-22 20:16:25
403633Applicationsnet-dialupUNCONFIRMEDnet-dialup/pppconfig-2.3.17-r1 doesn't honor LINGUAS for locale files2012-02-23 21:38:44
403631Applicationsnet-dialupUNCONFIRMEDnet-dialup/lrzsz-0.12.20-r3 doesn't honor LINGUAS for locale files2012-06-11 05:25:17
396045Ebuildsnet-dialupUNCONFIRMEDnet-dialup/gnuradius should install startup files2011-12-26 23:56:22
374667Applicationsnet-dialupUNCONFIRMEDnet-dialup/rp-pppoe fail to cross compile2011-07-10 18:06:14
373369Applicationsnet-dialupUNCONFIRMEDnet-dialup/freeradius-client fail to cross-compile2011-07-03 16:45:23
373365Applicationsnet-dialupUNCONFIRMEDnet-dialup/radiusclient-ng fail to cross-compile2011-07-01 19:11:38
373347Applicationsnet-dialupUNCONFIRMEDnet-dialup/radiusclient fail to cross-compile2011-07-01 19:11:18
444486Keywording and StabilizationnaotaUNCONFIRMEDPlease stabilize =sys-fs/nilfs-utils-2.1.42013-02-03 13:07:08
442346Applicationsmysql-bugsUNCONFIRMEDdev-db/mysql-5.5.28 - InnoDB: Assertion failure in thread 140230384047936 in file trx0rseg.c line 332012-11-08 22:04:30
435690Applicationsmysql-bugsUNCONFIRMEDdev-db/mysql-5.1.62-r1 - Makefile:186: *** missing separator. Stop.2013-02-04 23:51:03
431000Applicationsmysql-bugsUNCONFIRMEDdev-db/mysql-5.1.62-r1 - make[1]: *** No rule to make target `../mysys/libmysys.la', needed by `fact2012-08-21 17:31:46
417947Applicationsmr_bones_UNCONFIRMEDapp-misc/figlet - bash completion fails with paths containing spaces2012-05-28 12:08:37
427700Ebuildsmr_bones_UNCONFIRMEDapp-misc/figlet-2.2.5 version bump2012-07-23 12:15:04
370703Applicationsmysql-bugsUNCONFIRMEDdev-db/myodbc-5.1.6 - emerge --config fails: odbcinst: SQLWritePrivateProfileString failed with Gene2011-06-10 02:05:40
371369Applicationsmysql-bugsUNCONFIRMEDmod-auth-mysql-4.3.9: LoadModule statement is wrong (with solution)2012-11-27 19:59:19
382055Servermysql-bugsUNCONFIRMEDmod-auth-mysql-4.3.9: The module crashes when the web service is under heavy concurrent load2012-11-27 20:00:04
382283Ebuildsmysql-bugsUNCONFIRMEDMySQL C API missing handle_options and get_tty_password functions2012-08-15 14:25:50
385513Developmentmysql-bugsUNCONFIRMEDdev-db/mariadb-5.1.50: failed to compile x86-libs with multilib-overlay enabled2011-10-30 04:20:27
403051Applicationsmr_bones_UNCONFIRMEDmedia-gfx/gqview-2.1.5 - ld: pan-calendar.o: undefined reference to symbol 'sqrt@@GLIBC_2.0'2012-02-13 12:03:19
456798ApplicationsmozillaUNCONFIRMEDwww-client/firefox and mail-client/thunderbird 17.0.2 - parallel build issues2013-02-12 22:15:37
456904ApplicationsmozillaUNCONFIRMED[mozilla overlay] dev-lang/spidermonkey-1.8.8 - ./dist/include/js/HashTable.h:898:9: error: size of 2013-02-12 16:50:39
451504ApplicationsmozillaUNCONFIRMEDwww-client/firefox-18.0/www-client/seamonkey-2.15 failed (install phase) [to emerge]; incorrect pag2013-02-07 15:47:44
446866UnspecifiedmozillaUNCONFIRMEDdev-libs/nspr-4.9.2 - checking whether the C compiler (gcc -Os -pipe -march=armv6j -mfpu=vfp -mfloat2013-01-05 13:03:54
443712ApplicationsmozillaUNCONFIRMED>=www-client/firefox-16: add USE flag for enabling the built-in profiler2012-11-26 19:47:03
445044ApplicationsmozillaUNCONFIRMEDwww-client/firefox-10.0.6 - File collisions: /usr/bin/firefox and /usr/lib/firefox/plugins2012-11-30 02:43:00
442692ApplicationsmozillaUNCONFIRMEDwww-client/firefox-16.0.2 mail-client/thunderbird-16.0.1-r1 - comm-release/tbird/mozi - Segmentation2012-11-30 06:41:13
439244UnspecifiedmozillaUNCONFIRMEDwww-client/firefox-16.0.1 - .../work/mozilla-release/memory/jemalloc/src/src/jemalloc.c:1736:1: erro2013-01-14 08:53:52
439106ApplicationsmozillaUNCONFIRMED>=www-client/firefox-15.0.1: random freezes (e.g. opening file chooser dialog)2012-11-17 12:30:47
427038ApplicationsmozillaUNCONFIRMEDthunderbird: useflag "crypt" use uncompatible version of enigmail or gnupgp2012-07-25 01:52:10
418115ApplicationsmozillaUNCONFIRMEDwww-client/firefox-12.0-r2 ignores ccache when both ccache and distcc are enabled2012-07-15 05:38:36
417687ApplicationsmozillaUNCONFIRMEDmail-client/thunderbird www-client/seamonkey segfault at startup if nss_ldap/openldap are installed2012-10-22 16:13:48
409295ApplicationsmozillaUNCONFIRMEDmail-client/thunderbird-bin-10.0.2 - HTTP links cannot be opened - Failed to load native module at p2012-03-23 15:08:47
413131EbuildsmozillaUNCONFIRMEDwww-client/firefox - sdk binaries are not executable2012-05-08 15:54:49
414363ApplicationsmozillaUNCONFIRMEDwww-client/firefox-12.0 / mail-client/thunderbird-12.0.1 german locale not recognized, no german int2012-05-08 15:45:35
415805Eclasses and ProfilesmozillaUNCONFIRMEDmozcoreconf-2 eclass should filter MOZCONFIG env variable in moz_pkgsetup()2012-05-24 01:55:40
416047ApplicationsmozillaUNCONFIRMEDdev-libs/nss-3.13.{3,4} - die "Failed to detect whether your arch is 64bits or 32bits, disable distc2012-05-16 02:51:26
386077ApplicationsmozillaUNCONFIRMED=mail-client/thunderbird-10.0.1 shows double entries in newly created address book contacts2012-07-06 07:46:22
406541ApplicationsmozillaUNCONFIRMEDmail-client/thunderbird-10.0.1-r1 and www-client/firefox-10.0.1-r1 - checking whether the C compiler2012-03-06 13:50:15
382237ApplicationsmozillaUNCONFIRMEDwww-client/icecat-3.6.16-r3 inoperable remember ssl client certificate choice function2013-01-28 05:45:18
435674Applicationsmobile-phoneUNCONFIRMEDapp-mobilephone/gnome-phone-manager-0.68: phonemgr.c:47:2: error: too many arguments to function 'bl2012-12-18 08:29:47
417525Ebuildsmobile-phoneUNCONFIRMEDapp-mobilephone/dfu-util-0.7 version bump2013-01-25 02:12:45
391705Applicationsmobile-phoneUNCONFIRMEDapp-mobilephone/kannel-1.5.0 version bump2011-11-24 17:47:28
398113Ebuildsmobile-phoneUNCONFIRMEDapp-mobilephone/obexftp: disable unnecessary dev-lang/perl[-build] dependency2013-01-01 22:54:07
377079ApplicationsmmokrejsUNCONFIRMEDsci-biology/GBrowse-2.39 fails to compile2011-08-02 20:22:32
453338LibrarymlUNCONFIRMEDdev-ml/lablgl-1.04 - File "togl.mli", line 4, characters 14-29: Error: Unbound module Widget2013-02-01 06:27:17
414975ApplicationsmlUNCONFIRMEDnet-misc/unison-2.32.52 - hangs during file transfer2012-06-06 17:00:16
455090New Servermirror-adminUNCONFIRMEDdistfiles source mirror2013-02-02 06:40:17
435162New Servermirror-adminUNCONFIRMED[full+rsync] New mirror: University of Nebraska at Omaha, College of IS&T (US)2012-09-15 20:30:25
426850New Servermirror-adminUNCONFIRMEDPlease add new rsync server.2012-07-16 15:06:40
455048Eclasses and ProfilesmgornyUNCONFIRMED[git-2.eclass] Add support for submodules in non-bare clones.2013-02-02 21:35:22
457702ApplicationsmgornyUNCONFIRMEDeclean-kernel doesn't work w/ grub2 when /boot is FAT2013-02-20 20:51:05
448094Eclasses and ProfilesmgornyUNCONFIRMEDgit-2_update_repo fails if HEAD file is missing2012-12-24 09:48:06
405533EbuildsmgornyUNCONFIRMEDFix mirror usage in SRC_URI for multiple ebuilds2012-04-24 11:03:23
402415Third-Party ToolsmgornyUNCONFIRMEDapp-portage/flaggie breaks soft link after doing a cleanup2012-02-06 17:27:38
456110Applicationsmedia-videoUNCONFIRMED[multimedia overlay] mpv-9999 --disable-tv-bsdbt848 and --disable-radio-bsdbt848 does not exist anym2013-02-09 15:41:09
450526Applicationsmedia-videoUNCONFIRMEDmedia-video/tovid-0.34_p20120123 - Please rebuild dev-python/pypy:1.9 with the following USE flags e2013-01-07 11:52:42
433375Applicationsmedia-videoUNCONFIRMEDmedia-video/cinelerra ignores LDFLAGS, causing multilib compile failure2012-11-20 12:23:36
437258Applicationsmedia-videoUNCONFIRMEDmedia-video/vlc-9999 - Failed Patch: 300_all_pic.patch !2012-10-06 13:33:40
445544Applicationsmedia-videoUNCONFIRMEDmedia-video/dvdstyler-2.3.4 - Fails to generate iso, consider to hard-mask this version.2012-12-03 05:50:21
445962Applicationsmedia-videoUNCONFIRMEDmedia-video/dvdauthor-0.7.1 files contain writable and executable sections2012-12-04 19:02:06
446552Applicationsmedia-videoUNCONFIRMEDnet-misc/mediatomb-0.12.1-r1 - Mediatomb launches the transcoder twice for a given file.2012-12-09 08:28:14
430564Applicationsmedia-videoUNCONFIRMEDmedia-video/devede - when converting mkv, devede passes an obsolete options to mencoder2012-08-09 23:46:58
413661Librarymedia-videoUNCONFIRMEDmedia-libs/x264-0.0.20111220 on x86 enables SSE even on non-SSE host2012-04-27 15:27:08
414911Applicationsmedia-videoUNCONFIRMEDErrors while reading video-dvd with label contains special characters2012-05-20 15:31:07
418037Applicationsmedia-videoUNCONFIRMEDmedia-video/subtitlecomposer-0.5.3 USE=xine fails due to underlinking: ld: CMakeFiles/subtitlecompos2012-05-29 00:01:02
405173Applicationsmedia-videoUNCONFIRMEDmedia-video/vlc-2.0.0 - /bin/sh: line 4: 2215 Segmentation fault ./vlc-cache-gen ../modules2012-09-19 13:09:28
395801Applicationsmedia-videoUNCONFIRMEDmedia-video/libav-0.8_pre20111222 produces white noise with part of some music files2012-03-08 07:44:03
384947Applicationsmedia-videoUNCONFIRMEDmedia-video/aacskeys-0.4.0c-r1: please update ProcessingDeviceKeysSimple.txt2012-08-23 16:40:14
386947Librarymedia-videoUNCONFIRMEDmedia-libs/libdv-1.0.0-r2 - enc_input.c:1021:26: error: array type has incomplete element type2011-11-12 17:03:32
370275Applicationsmedia-videoUNCONFIRMEDmedia-video/libav-0.7_pre20110327 error: selected processor does not support ARM mode2011-10-26 17:48:22
383513Applicationsmedia-videoUNCONFIRMED>media-video/transcode-1.0.7 can handle only the first audio track when transcoding from media-video2011-12-06 10:16:57
378557Librarymedia-videoUNCONFIRMEDmedia-libs/libvpx-0.9.7: Compile failure with debug USE flag - "No rule to make target libvpx_g.so, 2012-09-15 05:01:43
370587Applicationsmedia-videoUNCONFIRMEDmedia-video/vlc-1.1.9: vlc won't play files from ssh folder connected through gnome "Places" menu2012-09-19 13:08:20
367699Ebuildsmedia-videoUNCONFIRMEDmedia-video/winki - winki: [..] ImportError: No module named gnome (missing RDEPEND?)2011-05-17 23:55:09
423687Ebuildsmedia-tvUNCONFIRMEDmedia-tv/linuxtv-dvb-apps - Please enable building of alevt2012-06-27 14:05:27
404539Applicationsmedia-tvUNCONFIRMEDapp-misc/lirc-0.9.0 - /usr/src/linux-3.2.1-gentoo/arch/amd64/Makefile: No such file or directory mak2012-09-27 19:15:55
369987Ebuildsmedia-tvUNCONFIRMEDapp-misc/lirc-0.9.0 emerge error econf failed2012-07-17 20:43:17
430690EbuildsmattmUNCONFIRMEDnet-libs/wt-3.2.2 - Aborting due to QA concerns: 4 files installed in /tmp/portage/net-libs/wt-3.2.22012-09-17 06:33:36
402673Applicationsmedia-opticalUNCONFIRMEDapp-cdr/graveman-0.3.12_p5-r1 doesn't honor LINGUAS for locale files2012-02-23 21:38:44
457172Eclasses and ProfilesmaxUNCONFIRMEDssl-cert.eclass should use more secure defaults for crypto functions / keylengths2013-02-19 06:49:28
433708ApplicationsmattmUNCONFIRMEDnet-analyzer/zabbix-2.0.2-r1: Makefiles are erroneously installed in /usr/share/zabbix2012-09-03 17:12:18
374943ApplicationsmattmUNCONFIRMEDmedia-gfx/cutycapt-0_p20110502-r2 unable to ignore invalid ssl certificate2012-04-16 01:32:13
458376Ebuildsmaintainer-wantedUNCONFIRMEDdev-db/odb-examples - Programming examples for use with ODB (dependency of dev-db/odb)2013-02-20 13:24:27
458520Ebuildsmaintainer-wantedUNCONFIRMEDgames-board/pachi-10.00 - Simple Go/Baduk/Weiqi Bot2013-02-21 12:34:44
418007DevelopmentmaksbotanUNCONFIRMEDdev-python/scrapy-0.14.4 fails in setup while parsing urlparse_monkeypatches.py2012-06-14 16:40:49
438530ApplicationsmaksbotanUNCONFIRMEDx11-wm/awesome-3.4.13 USE=gnome - add application file for gdu-notification-daemon2013-02-06 12:31:57
418343ApplicationsmarioUNCONFIRMEDapp-cdr/xfburn-0.4.3-r3 - /usr/share/applications/xfburn.desktop: file contains key "MimeType" in gr2012-05-31 14:59:11
458356Ebuildsmaintainer-wantedUNCONFIRMEDdev-db/libodb-oracle - access an Oracle server with ODB (dependency of dev-db/odb)2013-02-19 20:47:53
458152Ebuildsmaintainer-wantedUNCONFIRMEDdev-db/odb-2.2.0 - C++ Object-Relational Mapping (ORM) implemented as a gcc plugin2013-02-19 22:42:42
456698Ebuildsmaintainer-wantedUNCONFIRMED[ebuild] net-proxy/c-icap-modules new ebuild2013-02-11 17:28:54
456994Ebuildsmaintainer-wantedUNCONFIRMEDdev-python/polib - a library to manipulate gettext catalogs file2013-02-13 10:22:11
454744Ebuildsmaintainer-wantedUNCONFIRMEDnet-dns/validns should depend on new package dev-perl/Test-Command-Simple for src_test()2013-01-31 16:22:52
454396Ebuildsmaintainer-wantedUNCONFIRMEDNew ebuild: gnome-extra/proxy_applet-0.2 - GNOME applet for changing network proxy configuration fro2013-01-28 08:58:55
452572Ebuildsmaintainer-wantedUNCONFIRMEDdev-php/PHP_Invoker - Utility class for invoking callables with a timeout.2013-01-22 16:32:38
450946Ebuildsmaintainer-wantedUNCONFIRMEDapp-vim/syntastic - vim plugin: Syntastic is a syntax checking plugin that runs files through extern2013-01-08 20:07:20
450684Applicationsmaintainer-wantedUNCONFIRMEDmedia-gfx/xdot - Interactive viewer for Graphviz dot files2013-01-07 11:59:08
450732Ebuildsmaintainer-wantedUNCONFIRMEDdev-php/wurfl - Wireless Universal Resource File - RDEPEND for ZendFramework2013-01-07 18:14:14
450440Core systemmaintainer-wantedUNCONFIRMEDnet-fs/xtreemfs - XtreemFS is a fault-tolerant distributed file system for all storage needs2013-01-07 02:42:31
450300Ebuildsmaintainer-wantedUNCONFIRMEDx11-misc/menulibre - An advanced menu editor that provides modern features in a clean, easy-to-use i2013-01-27 17:35:31
449700Ebuildsmaintainer-wantedUNCONFIRMEDPlease add sys-boot/boot-update to the tree2013-02-10 18:40:29
449794Ebuildsmaintainer-wantedUNCONFIRMEDapp-emulation/tilem-2.0 - an emulator and debugger for Texas Instruments Z80-based graphing calculat2013-01-03 00:16:42
449654Ebuildsmaintainer-wantedUNCONFIRMEDmedia-video/subliminal-0.6.2.ebuild - Subtitles, faster than your thoughts2013-01-22 02:24:52
449034Ebuildsmaintainer-wantedUNCONFIRMEDNew package: app-backup/insync-bin-0.9.32 - Advanced cross-platform Google Drive client2012-12-28 14:36:13
448168Applicationsmaintainer-wantedUNCONFIRMEDdev-perl/pDLNA - a UPnP and DLNA service which serves multimedia content to compatible clients on th2012-12-24 15:40:36
448016Ebuildsmaintainer-wantedUNCONFIRMEDapp-misc/hardening-wrapper - New package. - Compiler wrapper to enable security hardening flags2012-12-26 21:51:22
447542Ebuildsmaintainer-wantedUNCONFIRMEDdev-php/PHPExcel-9999 - A pure PHP library for reading and writing spreadsheet files2012-12-17 12:31:03
446076Developmentmaintainer-wantedUNCONFIRMEDdev-lua/tir-0.9.3.3 - simple Lua+Mongrel2 web framework2012-12-05 14:16:08
446024Ebuildsmaintainer-wantedUNCONFIRMEDdev-python/python-sipsimple-0.31.1 - SDK for easy development of SIP multimedia end-points2012-12-16 23:53:59
445296Ebuildsmaintainer-wantedUNCONFIRMEDdev-perl/File-KeePass-2.30.0.ebuild (New Package)2012-12-01 13:41:12
445280Ebuildsmaintainer-wantedUNCONFIRMEDmedia-libs/avbin-bin - New package. - AVbin is a binary release of a cross-platform, thin wrapper ar2012-12-09 09:27:38
445004Ebuildsmaintainer-wantedUNCONFIRMEDapp-text/sgml-base - SGML infrastructure and SGML catalog file support2012-11-27 22:29:18
442068Ebuildsmaintainer-wantedUNCONFIRMEDsci-geosciences/splitter-bin - Tile splitter for mkgmap.2012-11-06 17:37:23
442104Ebuildsmaintainer-wantedUNCONFIRMEDsci-geosciences/osmconvert - Tool for converting and processing OpenStreetMap files2012-11-06 21:45:24
442222Ebuildsmaintainer-wantedUNCONFIRMEDdev-libs/thrust - a parallel algorithms library which resembles the C++ Standard Template Library2012-11-07 17:53:54
442232Ebuildsmaintainer-wantedUNCONFIRMEDsys-fs/hammer-{linux,read} - a port of the HAMMER File System from DragonFly BSD2012-11-07 19:44:43
442342Ebuildsmaintainer-wantedUNCONFIRMEDdev-perl/Data-Diver - Simple, ad-hoc access to elements of deeply nested structures2012-12-27 11:11:38
442388Ebuildsmaintainer-wantedUNCONFIRMEDapp-backup/storebackup - Storebackup is a backup suite that stores files on other disks.2012-11-08 23:28:56
439600Ebuildsmaintainer-wantedUNCONFIRMEDnet-print/cque - drivers and PPD files of CANON printers (CLC, ColorPASS, imagePASS, imagePRESS, ima2013-01-16 08:57:19
439578Ebuildsmaintainer-wantedUNCONFIRMEDPlease add x11-libs/libxkbcommon-0.2.0 to the tree2012-12-09 21:13:33
438470Ebuildsmaintainer-wantedUNCONFIRMEDsci-electronics/eds-libs - Set of libraries for EDS2013-01-15 12:48:14
438490Ebuildsmaintainer-wantedUNCONFIRMEDwww-plugins/mozilla-gnome-keyring-0.6.4 - A firefox extension that enables Gnome Keyring integration2012-10-15 18:59:37
439060Ebuildsmaintainer-wantedUNCONFIRMEDsci-electronics/openhantek-0.2.0 and -9999 - Digital Storage Osziloscope2012-10-20 15:41:18
438468Ebuildsmaintainer-wantedUNCONFIRMEDsci-electronics/eds - Electric design tool2013-01-16 08:45:05
436920Ebuildsmaintainer-wantedUNCONFIRMEDsci-electronics/smartsim: new ebuild2012-10-03 05:26:27
436484Servermaintainer-wantedUNCONFIRMEDmail-mta/exim-geoip - an IPv4 and IPv6 capable GeoIP dlfunc library for Exim2012-09-28 16:06:19
435960Core systemmaintainer-wantedUNCONFIRMEDsys-boot/refind - (rEFInd) Extensible Firmware Interface boot manager2013-01-28 19:33:22
435712Ebuildsmaintainer-wantedUNCONFIRMEDnet-nntp/es-f-2.6.0 - web based HTML frontend for esniper, a lightweight console application for sni2013-01-23 03:27:50
435146Ebuildsmaintainer-wantedUNCONFIRMEDsci-electronics/bitscope-chart - a frequency and voltage logger designed for use with the BitScope P2012-09-16 15:52:10
435148Ebuildsmaintainer-wantedUNCONFIRMEDsci-electronics/bitscope-logic - a logic analyzer designed for use with the BitScope PC oscilloscope2012-09-16 15:53:01
435150Ebuildsmaintainer-wantedUNCONFIRMEDsci-electronics/bitscope-meter - a frequency and voltage meter designed for use with the BitScope PC2012-09-16 15:53:47
435284Ebuildsmaintainer-wantedUNCONFIRMEDapp-text/pdf2htmlEX - A PDF to HTML converter2012-10-07 21:07:55
435558Applicationsmaintainer-wantedUNCONFIRMEDnet-analyzer/graphite - Enterprise scalable realtime graphing2013-02-12 17:05:51
435660Ebuildsmaintainer-wantedUNCONFIRMEDx11-themes/beefy-miracle-background - Fedora's official background artwork2012-09-20 15:36:51
435144Ebuildsmaintainer-wantedUNCONFIRMEDsci-electronics/bitscope-dso - a suite of high performance mixed signal virtual test, measurement an2012-09-16 16:13:50
433864Ebuildsmaintainer-wantedUNCONFIRMEDapp-misc/format-junkie - a program that can convert your media files (audio files, videos and pictur2012-09-10 17:00:15
434124Ebuildsmaintainer-wantedUNCONFIRMEDdev-perl/Cache-FastMmap - Uses an mmap'd file to act as a shared memory interprocess cache2012-09-06 14:41:46
434592Ebuildsmaintainer-wantedUNCONFIRMEDnet-misc/bubbleupnpserver - extends your existing UPnP AV Media Servers and Media Renderers on your 2012-09-11 14:16:40
432040Ebuildsmaintainer-wantedUNCONFIRMEDdev-libs/xdispatch - a event processing library (aka Grand Central Dispatch by Apple)2012-08-23 09:02:49
432564Ebuildsmaintainer-wantedUNCONFIRMEDapp-text/gtumbler - a graphical PDF manager2012-08-24 13:40:32
432688Ebuildsmaintainer-wantedUNCONFIRMEDapp-shells/zsh-completions-0.6.0 - Additional completion definitions for Zsh2012-10-22 11:21:26
432712Ebuildsmaintainer-wantedUNCONFIRMEDsci-geosciences/gpx2svg – Convert GPX formatted geodata to Scalable Vector Graphics (SVG)2012-08-26 20:33:26
431928Ebuildsmaintainer-wantedUNCONFIRMEDapp-benchmarks/mmtests - a configurable test suite that runs a number of common workloads of interes2012-08-20 02:07:01
431872Ebuildsmaintainer-wantedUNCONFIRMEDx11-terms/kmscon - Linux KMS/DRM based virtual Console Emulator2012-12-13 01:07:28
431842Ebuildsmaintainer-wantedUNCONFIRMEDmedia-sound/lyvi - A simple command-line lyrics viewer for various audio players2012-08-18 16:10:35
431706Applicationsmaintainer-wantedUNCONFIRMEDdev-lang/jwasm - masm compatible crossplatform assembler2012-10-20 19:27:43
431742Gamesmaintainer-wantedUNCONFIRMEDgames-misc/limbo - a puzzle platform video game (wine)2012-08-20 13:17:08
431488Ebuildsmaintainer-wantedUNCONFIRMEDnet-wireless/bluez-tools - Command line tools for Bluez2013-01-17 00:16:17
431358Ebuildsmaintainer-wantedUNCONFIRMEDdev-util/lttng-modules - lttng kernel modules2012-08-14 12:55:20
430928Ebuildsmaintainer-wantedUNCONFIRMEDnet-wireless/rtl8712-firmware: new ebuild2012-08-11 18:57:10
430862Ebuildsmaintainer-wantedUNCONFIRMEDx11-misc/pdfpc - a presenter console with multi-monitor support for PDF files2012-08-12 20:07:52
428158Ebuildsmaintainer-wantedUNCONFIRMEDnet-wireless/mbm-gpsd; net-wireless/mbm-gps-control new ebuilds2012-07-30 07:31:23
428246Ebuildsmaintainer-wantedUNCONFIRMEDapp-backup/jungledisk-server - offsite managed backup for servers2012-07-28 23:06:49
427764Ebuildsmaintainer-wantedUNCONFIRMEDNew: dev-python/django-filebrowser-3.5.0 - File management in the Django admin interface2012-12-13 06:57:02
427730Ebuildsmaintainer-wantedUNCONFIRMEDNew: dev-python/django-mptt-0.4.2 - Utilities for implementing a modified pre-order traversal tree i2012-12-12 11:46:23
427296Ebuildsmaintainer-wantedUNCONFIRMEDdev-python/django-tables2-0.11.0 - Table/data-grid framework for Django2012-12-12 11:30:43
427162Ebuildsmaintainer-wantedUNCONFIRMEDdev-python/django-admin-tools-0.4.1 - a collection of tools for the django administration interface2012-12-12 12:25:24
426946Ebuildsmaintainer-wantedUNCONFIRMEDx11-wm/beshell - a simple desktop shell on KDE technology (namely KIO and Solid) for the rest of us2012-09-06 15:53:17
426618Applicationsmaintainer-wantedUNCONFIRMEDapp-admin/eselect-flash-nsplugin - manage Flash plugin symlinks2012-07-18 16:27:18
424191Gamesmaintainer-wantedUNCONFIRMEDgames-strategy/vcmi-data-0.89 - Data files for the turn based strategy game HOMM3 clone VCMI2013-01-28 21:27:50
419847Ebuildsmaintainer-wantedUNCONFIRMEDmedia-plugins/gst-editing-services - a high-level library for facilitating the creation of audio/vi2012-07-08 08:53:36
419167Ebuildsmaintainer-wantedUNCONFIRMEDgames-rpg/bastion-20120529-r2 - an original action role-playing game set in a lush imaginative world2012-09-25 08:31:15
418311Ebuildsmaintainer-wantedUNCONFIRMEDdev-lua/lualdap-1.1 - Simple interface from Lua to an LDAP client2012-05-31 02:15:05
418285Ebuildsmaintainer-wantedUNCONFIRMEDmedia-libs/dcmtk - DCMTK - a collection of libraries and applications implementing large parts the D2012-05-30 18:44:00
418211Ebuildsmaintainer-wantedUNCONFIRMEDsys-process/xjobs - reads job descriptions line by line and executes them in parallel2012-06-01 14:23:50
417681Ebuildsmaintainer-wantedUNCONFIRMEDmedia-plugins/gimp-apng-0.1.0 - provides Animated PNG (APNG) image file load and save modules for th2012-07-06 20:09:12
417161Ebuildsmaintainer-wantedUNCONFIRMEDsys-fs/csvfs - file system representation of CSV data2012-06-10 03:48:18
416023Ebuildsmaintainer-wantedUNCONFIRMEDdev-php/zend-gdata - provides PHP 5 client interfaces for the Google Data API2012-05-16 02:59:27
415989Librarymaintainer-wantedUNCONFIRMEDdev-python/prettytable-python-0.6 - Python interface to print pretty tabular data2012-12-12 10:10:18
415443Ebuildsmaintainer-wantedUNCONFIRMEDnet-fs/junglediskworkgroup-3.16 - Networked storage/backup using Amazon's S3 service2012-07-28 23:06:49
413535Ebuildsmaintainer-wantedUNCONFIRMEDdev-lang/julia - a high-level, high-performance dynamic programming language for technical computing2012-12-19 07:31:31
415029Applicationsmaintainer-wantedUNCONFIRMEDapp-misc/doublecmd - Double Commander is a cross platform open source file manager with two panels s2012-08-09 06:24:21
415375Ebuildsmaintainer-wantedUNCONFIRMEDapp-office/makebeamerinfo - Creates .info file for use with app-office/impressive and dev-tex/latex-2012-05-10 14:51:46
412921Ebuildsmaintainer-wantedUNCONFIRMEDapp-text/peg-multimarkdown - An implementation of MultiMarkdown in C, using a PEG grammar2012-04-24 14:13:30
411087Core systemmaintainer-wantedUNCONFIRMEDsys-fs/ddumbfs-1.0.11 - An inline data deduplicating filesystem designed with backup in mind2012-04-07 14:35:41
411895Ebuildsmaintainer-wantedUNCONFIRMEDapp-text/peg-markdown -- an implementation of John Gruber's markdown in C2012-06-30 09:24:16
411173Ebuildsmaintainer-wantedUNCONFIRMEDsys-cluster/orangefs-2.8.5 - a branch of the PVFS2 cluster filesystem2012-04-09 18:51:41
408729Ebuildsmaintainer-wantedUNCONFIRMEDapp-misc/shelr - console screencasting tool2012-06-03 20:50:21
409759Ebuildsmaintainer-wantedUNCONFIRMEDx11-themes/gtk-engines-clearlooks-compact-1.5 - Theme for Clearlooks GTK+ engine, optimized for smal2012-07-12 11:32:18
409915Ebuildsmaintainer-wantedUNCONFIRMEDx11-themes/dmz-cursor-theme-0.4.3 - Style neutral, scalable cursor theme2012-03-28 00:20:23
408225Ebuildsmaintainer-wantedUNCONFIRMEDdev-python/runsnakerun-2.0.2_alpha1: GUI to display python profile dumps from cProfile, python-profi2012-03-15 01:15:15
408217Ebuildsmaintainer-wantedUNCONFIRMEDdev-python/meliae-0.4.0: Profile python's memory footprint2012-03-15 01:15:55
408215Ebuildsmaintainer-wantedUNCONFIRMEDdev-util/line_profiler-1.0_beta3: Profile individual lines (not only function calls) of python sourc2012-03-15 01:28:00
407669Applicationsmaintainer-wantedUNCONFIRMEDapp-misc/imgur-2.0 - A simple Imgur Bash screenshot utility2012-03-13 09:55:22
407589Ebuildsmaintainer-wantedUNCONFIRMEDdev-python/factory_boy : A versatile test fixtures replacement2012-03-12 12:07:45
406937Ebuildsmaintainer-wantedUNCONFIRMEDdev-libs/rapidxml-1.13 - an attempt to create the fastest XML parser possible2012-03-05 20:41:21
406935Ebuildsmaintainer-wantedUNCONFIRMEDmedia-libs/silly-0.1.0 - Silly image codec (Simple Image Loading LibrarY)2012-03-05 20:40:08
406895Ebuildsmaintainer-wantedUNCONFIRMEDmedia-gfx/psdparse-9999 - tools to parse Photoshop PSD/PSB format files2012-03-06 14:26:15
405945Ebuildsmaintainer-wantedUNCONFIRMEDNew ebuild: app-misc/pycarddav - a simple way of accessing a CardDAV resource, mainly for use with m2012-10-14 18:19:44
405643Ebuildsmaintainer-wantedUNCONFIRMEDapp-misc/stackapplet-1.5.1 - a small application that uses the new AppIndicator framework to display2012-02-26 17:22:22
402067Ebuildsmaintainer-wantedUNCONFIRMEDdev-utils/statifier - creates one file from dynamically linked executables and all its libraries2012-04-09 15:46:20
401073Ebuildsmaintainer-wantedUNCONFIRMEDnet-wireless/b43-openfwwf - Open FirmWare for WiFi networks2012-01-28 16:34:42
399009Ebuildsmaintainer-wantedUNCONFIRMEDnet-im/myagent-im - Instant messenger that implements Mail.ru protocol2012-01-17 03:58:52
399003Ebuildsmaintainer-wantedUNCONFIRMEDNew Ebuild: sci-electronics/cdmm-0.3 - a console program to read data from RS232 Digital MultiMeters2012-01-18 17:43:32
398733Ebuildsmaintainer-wantedUNCONFIRMEDnet-fs/unfs3-0.9.22 A portable user-space implementation of the NFSv3 server specification2012-01-15 19:29:12
398485Ebuildsmaintainer-wantedUNCONFIRMEDmedia-sound/eko-0.6.0.ebuild simple sound editor2012-01-11 17:11:12
398487Ebuildsmaintainer-wantedUNCONFIRMEDmedia-sound/coquillo-1.9 - a metadata editor / tagger for various audio file formats2012-01-11 17:10:51
397417Applicationsmaintainer-wantedUNCONFIRMEDPlease add app-dicts/dictd-gcide2012-01-03 17:31:10
396411Ebuildsmaintainer-wantedUNCONFIRMEDsys-apps/ataidle ( New package )2011-12-29 14:37:43
396167Ebuildsmaintainer-wantedUNCONFIRMEDsys-power/jupiter-applet - a light weight power and hardware control applet for Linux2012-11-23 03:56:02
395939Ebuildsmaintainer-wantedUNCONFIRMEDHypertable 0.9.5.4 : ebuild request2012-11-15 17:27:46
395887Ebuildsmaintainer-wantedUNCONFIRMEDgames-puzzle/nightsky ( New package )2012-06-11 05:17:19
395169Gamesmaintainer-wantedUNCONFIRMEDgames-puzzle/beret2011-12-18 19:04:02
394569Ebuildsmaintainer-wantedUNCONFIRMEDsys-auth/pam_yubico - Yubico PAM module2012-10-25 13:45:09
394761Ebuildsmaintainer-wantedUNCONFIRMEDnew ebuild: net-print/gnome-manual-duplex2012-04-06 10:37:09
390225Core systemmaintainer-wantedUNCONFIRMEDAll kernels missing cbfw_fc.bin file.2011-11-13 04:58:26
390391Ebuildsmaintainer-wantedUNCONFIRMEDx11-misc/pdf_presenter_console - a GTK based presentation viewer application2012-08-12 14:09:53
389673Ebuildsmaintainer-wantedUNCONFIRMEDmedia-sound/gsharkdown: Download and play audio files from the grooveshark.com service2011-11-08 20:53:53
389151Ebuildsmaintainer-wantedUNCONFIRMEDnet-misc/justwifiindicator-0.1 - Simple WiFi signal strength tray indicator2011-11-20 12:10:03
389489Ebuildsmaintainer-wantedUNCONFIRMEDmedia-video/smoviecat - Simple Movie Catalog2011-11-05 15:49:59
389021Ebuildsmaintainer-wantedUNCONFIRMED[net-misc?]/dlan-linux - Find and configure your devolo (Ethernet via existing electrical wiring) dL2012-01-12 10:14:40
389129Gamesmaintainer-wantedUNCONFIRMEDgames-action/voxatron - game set in a world completely made of tiny cubes that can be blasted to smi2012-06-03 22:42:56
389029Ebuildsmaintainer-wantedUNCONFIRMEDsys-libs/libuser - implements a standardized interface for manipulating and administering user and g2011-11-01 15:42:13
389027Ebuildsmaintainer-wantedUNCONFIRMEDnet-misc/qpid-cpp - cross-platform Enterprise Messaging system which implements the Advanced Message2012-08-31 06:30:43
389015Ebuildsmaintainer-wantedUNCONFIRMEDdev-libs/libpki - Provide an easy-to-use PKI library and tools for PKI enabled application developme2011-11-01 15:33:59
388533Ebuildsmaintainer-wantedUNCONFIRMEDmemcacheq-0.2.0.ebuild - Simple Queue Service over Memcache2011-10-26 14:10:13
386909Applicationsmaintainer-wantedUNCONFIRMEDmedia-libs/libshairport: new package (used by xbmc + --enable-airtunes)2013-02-21 14:38:48
385739Applicationsmaintainer-wantedUNCONFIRMEDQaquarelle ebuild request2011-10-05 16:40:34
384747Ebuildsmaintainer-wantedUNCONFIRMEDsci-electronics/usbpicprog-0.4.2.ebuild (New Package)2011-11-03 16:48:41
383455Ebuildsmaintainer-wantedUNCONFIRMEDapp-misc/openplacos/openplacos-0.3.0.ebuild New ebuild, latest stable releases on x86 and amd642012-10-11 17:25:44
381969Ebuildsmaintainer-wantedUNCONFIRMEDAsus Notebook keyboard/backlight support kernel modules package2011-09-08 16:02:28
382099Ebuildsmaintainer-wantedUNCONFIRMEDmedia-gfx/mitsuba - An extensible rendering framework written in portable C++ (ebuild request)2011-09-07 04:01:42
381927Ebuildsmaintainer-wantedUNCONFIRMEDapp-i18n/libgooglepinyin (new ebuild)2011-09-06 16:21:11
381679Ebuildsmaintainer-wantedUNCONFIRMEDPlease provide an ebuild for net-misc/lifenet2011-09-03 10:28:32
381671Ebuildsmaintainer-wantedUNCONFIRMEDPlease provide media-gfx/s3d ebuild2011-09-03 10:30:33
381487Ebuildsmaintainer-wantedUNCONFIRMEDdev-python/DerApproximator - A python module for numerical optimization2011-09-05 11:36:51
381669Ebuildsmaintainer-wantedUNCONFIRMEDPlease provide an ebuild for media-gfx/g3dviewer2011-09-03 10:37:29
379691Ebuildsmaintainer-wantedUNCONFIRMEDPlease add telepathy-ring ebuild into portage2013-01-18 10:49:26
377833Ebuildsmaintainer-wantedUNCONFIRMEDNew ebuild for RTAI-lib modules for RTAI2011-08-05 22:24:39
377957Gamesmaintainer-wantedUNCONFIRMEDgames-puzzle/vvvvvv - A 2D puzzle platform video game2012-06-06 20:42:27
377859Ebuildsmaintainer-wantedUNCONFIRMEDapp-misc/libspnav - A free, compatible alternative for 3Dconnexion's 3D input SDK2011-09-22 19:29:47
377811Ebuildsmaintainer-wantedUNCONFIRMEDGaalet - Geometric Algebra Library C++ (Expression Template)2011-08-13 16:40:09
375249Ebuildsmaintainer-wantedUNCONFIRMEDapp-misc/xmind-portable (new package)2011-07-17 07:03:26
374849Ebuildsmaintainer-wantedUNCONFIRMEDnet-wireless/kismon ebuild request2011-07-11 15:49:17
373179Ebuildsmaintainer-wantedUNCONFIRMEDPackage Request: Mozilla Mobile2012-02-03 16:13:16
371775Ebuildsmaintainer-wantedUNCONFIRMEDprotobuf-c-0.15.ebuild (New Package) - C bindings for Google's Protocol Buffers2012-06-03 20:47:25
371773Ebuildsmaintainer-wantedUNCONFIRMEDmedia-sound/umurmur-0.2.8 - Minimalistic Murmur (Mumble server)2012-12-25 19:00:18
370785Ebuildsmaintainer-wantedUNCONFIRMEDsteadyflow-0.1.7 - a GTK+ based download manager that aims for minimalism, ease of use, and a clean,2013-02-06 11:25:50
370741Ebuildsmaintainer-wantedUNCONFIRMEDnet-im/gtmess-0.96 - An excellent terminal MSN client2011-06-10 02:30:49
370445GNOMEmaintainer-wantedUNCONFIRMED[gnome overlay] Ebuild for gnome-shell-extensions-weather applet2011-12-30 11:49:48
369977Javamaintainer-wantedUNCONFIRMEDNew package: dev-java/htmlcleaner2011-06-07 21:13:31
369989Ebuildsmaintainer-wantedUNCONFIRMEDdev-libs/jcal-0.3.0 - Jalali calendar library2012-06-10 13:58:30
369855Ebuildsmaintainer-wantedUNCONFIRMED[media-video(?)/]freeseer - a video capture utility capable of capturing and streaming video2012-03-16 04:22:13
369489Ebuildsmaintainer-wantedUNCONFIRMEDsys-fs/boxfs-0.7.ebuild - A FUSE filesystem to access files on box.net accounts2011-06-06 00:29:16
368985Ebuildsmaintainer-wantedUNCONFIRMEDgames-kids/scratch: New ebuild for MIT's "scratch" programming environment for young people2012-11-21 10:11:11
368053Ebuildsmaintainer-wantedUNCONFIRMEDnew ebuild : net-dns/yaddns - ddns is a small ddns client with multiple ddns server supports and a h2011-05-19 20:48:37
367429Ebuildsmaintainer-wantedUNCONFIRMEDmedia-sound/jackctlmmc-4 - JackCtlMMC is a slightly simpler command-line version of QJackMMC2011-05-17 11:44:37
367003Ebuildsmaintainer-wantedUNCONFIRMEDnet-wireless/urfkill (new package) - Handler for rfkill events in userspace2011-06-12 07:58:43
366017Ebuildsmaintainer-wantedUNCONFIRMEDnew ebuild sys-apps/samefile2011-05-05 10:16:31
366219Ebuildsmaintainer-wantedUNCONFIRMEDHandlerSocket-Plugin-for-MySQL ebuild request2011-05-10 21:04:37
458190Keywording and Stabilizationmaintainer-neededUNCONFIRMEDsys-apps/i2c-tools stable request2013-02-19 10:48:36
447352Unspecifiedmaintainer-neededUNCONFIRMEDapp-laptop/tp_smapi-0.41 with kernel 3.7 - modprobe: FATAL: Error inserting tp_smapi (/lib/modules/32013-01-02 20:30:53
447812Keywording and Stabilizationmaintainer-neededUNCONFIRMEDapp-doc/gimp-help-2.6.1 stable request2013-02-16 13:26:25
450156Applicationsmaintainer-neededUNCONFIRMEDmedia-gfx/splashutils-1.5.4.4-r2 unable to switch from silent mode to verbose using F2 with the 2nd 2013-01-20 10:25:23
427426Applicationsmaintainer-neededUNCONFIRMEDapp-misc/run-mailcap - run-mailcap unlinks tmplink before an app has a chance to read a file2012-07-30 18:15:09
432296Developmentmaintainer-neededUNCONFIRMEDdev-libs/apr-1.4.5 fails to crosscompile: configure: error: cannot run test program while cross comp2013-01-03 18:43:02
434926Applicationsmaintainer-neededUNCONFIRMED>=net-im/skype-4.0.0.7 - login failure, stuck at "signing in" with JFS filesystem2013-01-03 19:31:41
437898Core systemmaintainer-neededUNCONFIRMEDnet-wireless/broadcom-sta-5.100.82.112-r2 with gentoo-sources-3.6.x - general protection fault in wl2013-02-03 13:08:44
438622Ebuildsmaintainer-neededUNCONFIRMEDnet-wireless/broadcom-sta-6.20.55.19 version bump2013-02-07 12:05:08
443856Applicationsmaintainer-neededUNCONFIRMEDmedia-gfx/splashutils-1.5.4.4-r2 failed to build - asm/posix_types.h: No such file or directory2013-01-27 08:05:31
446424Applicationsmaintainer-neededUNCONFIRMEDapp-misc/gpsdrive-2.11-r3[mapnik] - In file included from ..., .../gpsdrive-2.11/src/mapnik.cpp:11: 2013-01-03 18:33:04
446968Applicationsmaintainer-neededUNCONFIRMEDnet-misc/netkit-telnetd-0.17-r10 - Use native gcc instead of CC (cross compile issue)2013-02-16 13:35:19
410343Ebuildsmaintainer-neededUNCONFIRMEDnet-wireless/broadcom-sta - modprobe wl: ERROR: could not insert 'wl': No such file or directory2013-02-03 13:03:43
410037Core systemmaintainer-neededUNCONFIRMEDsys-power/cpufreqd config parser prevents usage of multi-cpu profile support2012-11-18 12:15:58
407667Ebuildsmaintainer-neededUNCONFIRMEDnet-wireless/broadcom-sta-5.100.82.112-r2 has broken multicast patch2013-02-03 13:03:15
406255Sandboxmaintainer-neededUNCONFIRMEDdev-libs/apr-1.4.6 failed test: testlfs : \/bin/bash: line 2: 3428 Segmentation fault (core d2012-12-29 17:08:08
402701Applicationsmaintainer-neededUNCONFIRMEDapp-dicts/fantasdic-1.0_beta7-r2 doesn't honor LINGUAS for locale files2013-02-03 13:13:42
402681Applicationsmaintainer-neededUNCONFIRMEDapp-editors/cooledit-3.17.17-r1 doesn't honor LINGUAS for locale files2012-02-23 21:38:44
399747Ebuildsmaintainer-neededUNCONFIRMEDnet-wireless/broadcom-sta floods logs with "could not get rate/rssi"2013-02-03 13:03:07
400905Applicationsmaintainer-neededUNCONFIRMEDnet-libs/udns please add filter-flags -fpeel-loops used with -03 or -0s2013-02-16 13:22:28
399217Librarymaintainer-neededUNCONFIRMEDnet-libs/udns - please add building of rblcheck, dnsget binaries2013-02-16 14:13:07
385155Ebuildsmaintainer-neededUNCONFIRMEDnet-misc/axel-9999: please add live ebuild2012-07-06 15:17:03
379951Ebuildsmaintainer-neededUNCONFIRMEDx11-terms/mrxvt squared tabs build flag not available2012-12-31 14:36:04
375825Applicationsmaintainer-neededUNCONFIRMEDapp-admin/ulogd-2.0.0_beta4 fails to build with +doc USE flag if latex is not installed2012-09-16 09:14:45
372871Keywording and Stabilizationmaintainer-neededUNCONFIRMEDPlease add ~arm keyword to the ypbind and yp-tools packages2012-03-03 19:40:07
456784ApplicationslxnayUNCONFIRMED[sabayon overlay] net-wireless/blueman-1.23-r2: Failed Patch: blueman-1.21-fix-segfault-startup.patc2013-02-12 15:10:18
445484SELinuxlxnayUNCONFIRMEDnet-nds/389-ds-base-1.2.11.15 fails to build in hardened selinux profile2012-12-04 19:58:35
385401ApplicationslxnayUNCONFIRMEDapp-admin/packagekit-base-0.6.18 compile error on using python3 as default2012-05-12 22:10:25
447626Applicationslu_zeroUNCONFIRMEDmedia-gfx/blender should not use environment variables to set installation directories2013-01-31 09:26:50
452874Applicationslu_zeroUNCONFIRMEDmedia-video/mplayer-1.1 - mplayer-1.1-libav-9.patch introducing enum AVPixelFormat, should be called2013-02-18 15:15:08
434812ApplicationslxdeUNCONFIRMEDlxde-base/lxdm-0.4.1-r5 - session selection not working2012-09-12 18:15:27
443666EbuildslxdeUNCONFIRMEDlxde-base/lxdm-0.4.1-r5 - Should not hard depend on ConsoleKit2012-11-18 13:45:38
444394Core systemlu_zeroUNCONFIRMEDsys-apps/dtc-1.3.0-r1 - /usr/bin/install: cannot stat 'fdtdump': No such file or directory2012-12-21 15:58:17
395109Unspecifiedlu_zeroUNCONFIRMEDmedia-video/lives-1.4.6 "Capture External Window" fails to render video; errors in console2011-12-19 12:16:42
365749Ebuildslu_zeroUNCONFIRMEDapp-emulation/bochs-2.4.5 unable to build in amd64 emulation on x86 platforms2011-05-10 21:14:05
135923Applicationslu_zeroUNCONFIRMEDx11-drivers/ati-drivers: weird image rendering problems with www-client/firefox2012-06-06 13:44:40
455890Core systemlivecdUNCONFIRMEDsys-block/parted - parted binary should be installed in /usr/bin2013-02-07 02:12:12
416903ApplicationslivecdUNCONFIRMEDsys-block/parted-3.1 fails tests [t8001-loop-blkpg.sh t2100-zerolen.sh]2012-05-21 14:59:50
441880ApplicationslehoUNCONFIRMEDmedia-tv/tvheadend-3.2 should not force --disable-dvbscan and should not install data in /usr/share/2012-11-30 01:57:07
450528Serverldap-bugsUNCONFIRMEDnet-nds/openldap-2.4.30: configure: error: crossing compiling: use --with-yielding_select=yes|no|man2013-01-07 11:32:59
399899Developmentlang-miscUNCONFIRMEDdev-lang/fpc-2.6.0 USE=ide - fpcalc.pas(244,3) Fatal: Selected assembler reader not supported2012-02-15 16:20:16
416641Ebuildslang-miscUNCONFIRMEDdev-lang/fpc-2.6.0 configuration files contain paths with ${D}2012-05-21 03:37:35
449340ApplicationslackUNCONFIRMEDwww-client/firefox-17.0.1 crashed while watching movie online2013-01-02 22:09:55
452656ApplicationslackUNCONFIRMEDx11-plugins/screenlets-0.1.2 does not work with python32013-01-18 10:16:15
454866ApplicationslackUNCONFIRMEDx11-misc/ipager-1.1.0 - Calls imlib_render_image_on_drawable with image being NULL. (Imlib2 Develope2013-01-31 19:30:56
454868ApplicationslackUNCONFIRMEDx11-wm/fluxbox-? with updated media-libs/glew-1.9.0 - `fbrun` yields error while loading shared libr2013-02-04 17:23:15
383699ApplicationslackUNCONFIRMEDx11-plugins/screenlets-0.1.2 some parts depend on gconf-python2011-09-20 04:04:24
446700Ebuildskernel-miscUNCONFIRMEDdev-libs/klibc-1.5.25 - make silentoldconfig: Console input/output is redirected. Run 'make oldconfi2012-12-10 11:38:29
438784Eclasses and Profileskernel-miscUNCONFIRMEDlinux-mod.eclass - kernel modules packages are incompatible with using multiple kernels2012-10-18 14:18:50
438730Core systemkernel-miscUNCONFIRMEDSandbox violations when emerging kernel modules from /etc/kernel/postinst.d hook against a kernel bu2012-11-05 03:29:40
436442Eclasses and Profileskernel-miscUNCONFIRMEDkernel-2.eclass - Offer a mean to install the kernel distribution under a tunable directory name2012-09-28 14:34:11
428728Core systemkernel-miscUNCONFIRMEDsys-kernel/ksymoops-2.4.11-r1 - In file included from ksymoops.h:9:0, from ksymoops.c:14: /usr/inclu2012-12-17 16:12:54
390293Unspecifiedkernel-miscUNCONFIRMED[enhancement] sys-fs/sshfs-fuse: Improve remote permissions when files and directories are created2011-11-15 00:36:35
392247Core systemkernel-miscUNCONFIRMEDsys-kernel/module-rebuild-0.7 doesn't respect EMERGE_DEFAULT_OPTS variable2011-12-04 02:58:30
409207Eclasses and Profileskernel-miscUNCONFIRMEDlinux-info.eclass should document WARNING_ variables2012-03-22 03:00:57
410923Core systemkernel-miscUNCONFIRMEDsys-kernel/module-rebuild - command line options are consistent (should be "module-rebuild --action"2012-04-06 14:44:25
417313Unspecifiedkernel-miscUNCONFIRMEDsys-fs/avfs-1.0.0 ecompressdir stumbles over an symlink2012-05-24 14:13:30
425316Applicationskernel-miscUNCONFIRMEDapp-misc/fdutils-5.5-r2 - fdmount.c:25:27: fatal error: linux/ext2_fs.h: No such file or directory2012-12-12 05:51:37
458028Core systemkernelUNCONFIRMEDKernel:3.7.8 BUG: unable to handle kernel paging request in radeon_mmap()2013-02-21 02:43:20
458426EbuildskernelUNCONFIRMED=sys-kernel/gentoo-sources-3.8.0 fails to compile: invalid operands to binary == (have ‘kuid_t’ and 2013-02-20 11:26:46
444742ApplicationskernelUNCONFIRMEDnet-fs/autofs-5.0.6-r3 unable to mount NFS on HPPA: do_mount_indirect: path to be mounted is to long2013-02-06 04:36:10
445222Core systemkernelUNCONFIRMEDsys-kernel/vanilla-sources uli526x module incompatible with GART_IOMMU2012-12-11 12:37:18
457934Eclasses and ProfileskdeUNCONFIRMEDAdd app-arch/unzip natspec to KDE profiles package.use2013-02-17 17:00:46
457732KDEkdeUNCONFIRMEDkde-base/kwin - Hyperthreading enabled + Java = Kwin unresponsive2013-02-17 17:49:19
457166KDEkdeUNCONFIRMEDmedia-fonts/terminus-font unusable in konsole-4.9.5 because QT-4.8.4 renders terminus bitmap-font in2013-02-13 23:40:12
456388KDEkdeUNCONFIRMEDkde-misc/krename-4.0.9: fatal error: freetype/config/ftheader.h: No such file or directory2013-02-19 06:44:46
456230KDEkdeUNCONFIRMEDapp-cdr/k3b-2.0.2-r4: complains about "process can't started. Calling of In/Output module not possib2013-02-10 15:13:30
455234KDEkdeUNCONFIRMEDkmix: dbuscontrolwrapper.cpp:(.text+0x169): undefined reference to `vtable for DBusControlWrapper'2013-02-03 07:06:26
455288KDEkdeUNCONFIRMEDkde-base/kdm: please provide a systemd service file2013-02-15 17:35:02
449888KDEkdeUNCONFIRMEDapp-text/poppler-0.20.4 - In file included from .../work/poppler-0.20.4/qt4/src/poppler-page.cc:36: 2013-01-17 13:59:17
449742ApplicationskdeUNCONFIRMEDnet-im/ktp-call-ui-0.5.1 does not build with net-libs/telepathy-farstream-0.6.02013-02-19 21:49:10
449630KDEkdeUNCONFIRMEDkde-base/kdelibs-4.9.4-r1: several *.desktop files are not compliant with XDG standard (missing trai2013-01-01 13:31:13
446275KDEkdeUNCONFIRMEDpython ABI deps support for system-config-printer-kde and printer-applet2012-12-11 14:07:52
447246KDEkdeUNCONFIRMEDkde-misc/kolor-manager-0.99 crashes when media-libs/oyranos-0.9.1 is built against app-admin/elektra2013-02-10 22:35:46
445392ApplicationskdeUNCONFIRMEDkde-base/konsole-4.9.3: backgroundcolor is not reset when scrolling2012-12-01 20:25:30
442984KDEkdeUNCONFIRMEDapp-office/calligra-l10n-2.5.3 does not compile.2012-11-15 14:52:36
436290KDEkdeUNCONFIRMEDkde-base/okular-4.9.1 - hpcups[7483]: prnt/hpcups/HPCupsFilter.cpp 536: cupsRasterOpen failed, fd = 2013-01-10 19:35:12
442120KDEkdeUNCONFIRMED[kde overlay] please add caledonia kdm-theme2012-11-07 02:08:16
433876KDEkdeUNCONFIRMEDkde-base/marble-4.9.0: cannot move globe with mouse2012-09-18 13:46:27
430968KDEkdeUNCONFIRMEDdev-libs/grantlee-0.2.0 fails to build on arm hardfp2012-08-24 23:31:13
431636KDEkdeUNCONFIRMEDkde-base/konqueror downloads dont appear as bin files2012-08-28 07:33:50
432976KDEkdeUNCONFIRMEDnet-libs/telepathy-logger-qt-0.5.0: fails to build with >=dev-libs/boost-1.50.0-r22013-01-18 10:48:33
433070KDEkdeUNCONFIRMEDapp-editors/kile-2.1.2-r1 - index.docbook:124: parser error : Entity 'ged.vertaald' not defined2013-02-17 22:53:14
430938KDEkdeUNCONFIRMEDkde-base/plasma-workspace-4.8.5 fails with parallel build: fatal error: ui_killrunner_config.h: No s2012-10-24 16:55:05
430286KDEkdeUNCONFIRMED>=kde-base/konsole-4.9.0 freezes on double-click2013-02-18 08:38:42
406047KDEkdeUNCONFIRMEDKDE 4.8.1 compose key doesn't work with Kwrite & Konsole2012-03-23 08:13:36
457534ServerjsbronderUNCONFIRMEDsys-cluster/torque-2.4.16: mv: cannot stat `libtool': No such file or directory2013-02-14 14:39:41
401183KDEkdeUNCONFIRMEDKDE 4.7 and 4.8: no file tooltips in dolphin/konqueror with USE=-semantic-desktop2012-08-03 16:19:43
451056DevelopmentjsbronderUNCONFIRMEDsys-cluster/mpich2-1.2.1_p1-r1 fails to crosscompile: configure: error: Unable to determine Fortran 2013-01-09 15:17:48
417661ApplicationsjlecUNCONFIRMEDgnome-extra/zeitgeist-datasources[bzr] dev-vcs/bzr-gtk file collision: /usr/share/pixmaps/bzr-icon-62012-05-28 00:01:10
433481LibraryjlecUNCONFIRMEDsci-libs/vtk bundles the following netcdf, ftgl, sqlite3 and exodusii2012-12-13 12:38:46
448348Core systemjlecUNCONFIRMEDsys-fs/aufs-util-3.6 fails to crosscompile: ./ver: ./ver: cannot execute binary file2012-12-25 16:14:13
454118ApplicationsjlecUNCONFIRMED[science overlay] sci-chemistry/mgltools-pmv-1.5.6_rc2 - runPmv: TclError: cannot use geometry manag2013-01-30 09:02:43
457810Core systemjlecUNCONFIRMEDsys-fs/aufs3-3_p20130207 with USE="inotify" and sys-kernel/hardened-sources-3.7.5 doesn't compile - 2013-02-17 09:10:21
372703UnspecifiedjmbsvicettoUNCONFIRMEDnet-misc/vde service script unloads module when it is still needed2012-06-08 13:14:11
456186ApplicationsjmbsvicettoUNCONFIRMEDmedia-sound/amarok-2.6.0 - make[2]: *** No rule to make target `/usr/lib64/libGLU.so', needed by `li2013-02-13 19:21:15
375117Libraryjmfo1982UNCONFIRMEDIf i686-pc-linux-gnu-windres is present, configure process detects it and attempts to cross-compile2011-12-12 16:27:25
381655GamesjokerUNCONFIRMEDPlease port patches for mupen64plus 1.5 from debian2012-05-28 22:08:43
384429ApplicationsjlecUNCONFIRMEDdev-python/pyglet should depend on media-libs/libtxc_dxtn2011-10-05 19:38:41
456832ApplicationsjerUNCONFIRMEDnet-misc/putty and net-misc/pssh - File collision: /usr/bin/pscp2013-02-11 19:20:34
443116Core systemjerUNCONFIRMEDsys-apps/lsb-release with sys-apps/baselayout-2.2 - /etc/os-release breaks lsb-release2013-01-10 17:47:52
399353ApplicationsjerUNCONFIRMEDapp-admin/sysstat-10.0.3 generated daily report file will be truncated by cron.daily (sys-process/vi2012-05-10 14:40:15
435732ApplicationsjerUNCONFIRMEDx11-terms/rxvt-unicode-9.15 - glibc detected *** urxvtd: malloc(): smallbin double linked list corru2013-01-05 22:08:43
405855Keywording and StabilizationjerUNCONFIRMEDx11-terms/rxvt-unicode-9.15 USE=-xft disables background transparency?2012-06-02 15:58:37
381333ApplicationsjerUNCONFIRMEDx11-terms/rxvt-unicode feature request (disable underline and cursor behaviour)2012-02-26 18:39:51
456718LibraryjdhoreUNCONFIRMEDmedia-plugins/audacious-plugins-3.3.4 is incompatible with media-video/libav, fails during configure2013-02-11 17:14:50
403605ApplicationsjdhoreUNCONFIRMEDmedia-plugins/audacious-plugins-3.2 doesn't honor LINGUAS for locale files2012-02-23 21:52:28
403621ApplicationsjdhoreUNCONFIRMEDmedia-sound/audacious-3.2 doesn't honor LINGUAS for locale files2012-02-23 21:38:44
422483ApplicationsjdhoreUNCONFIRMEDdev-lang/pike-7.8.352-r2 multilib-strict check failed!2012-12-21 03:51:15
427688EbuildsjdhoreUNCONFIRMEDmedia-video/miro-5.0.1, pre-stripped files, and revdep-rebuild keeps rebuilding due to /usr/bin/code2012-08-14 16:25:31
439372Core systemjdhoreUNCONFIRMEDsys-apps/paludis[ruby-bindings] installs unslotted to latest ruby (actually 1.9) disregarding eselec2013-02-07 08:07:43
457960Keywording and StabilizationjavaUNCONFIRMEDdev-java/jdbc-postgresql-9.1_p902 stable request2013-02-17 17:38:38
458264JavajavaUNCONFIRMEDdev-java/sablecc-3.7 version bump2013-02-19 15:22:14
456932JavajavaUNCONFIRMEDERROR: dev-java/netbeans-javafx-7.2 failed (compile phase)2013-02-13 20:19:37
453804JavajavaUNCONFIRMEDCreate ebuilds for jdk 8 (early access release), a current Java 8 partial implementation2013-01-24 12:02:05
442334JavajavaUNCONFIRMEDdev-java/jlex should install jlex launcher2012-11-08 15:36:52
439140JavajavaUNCONFIRMEDdev-java/icedtea: Use meaningful names for distfiles2013-02-20 07:39:04
434024JavajavaUNCONFIRMEDwww-client/firefox-15.0, "click to play": Java applets don't work2012-09-20 09:38:49
434222JavajavaUNCONFIRMEDdev-java/ant-ivy-2.0.0 compilation failed2012-09-07 15:04:44
436226JavajavaUNCONFIRMEDdev-util/checkstyle should install an ant task2012-09-26 10:14:51
428618Keywording and StabilizationjavaUNCONFIRMEDPlease mark =dev-java/rxtx-2.2_pre2 stable2012-07-30 23:35:26
427932JavajavaUNCONFIRMED[java-overlay] dev-java/j3d-core-1.5.1: compile phase fails with image resolution errors2012-07-24 19:35:50
426756JavajavaUNCONFIRMEDsci-physics/jaxodraw-2.0.1 - doicon etc/OS/Linux/*.png: etc/OS/Linux/*.png is not a valid file/direc2012-12-16 14:31:24
420605DevelopmentjavaUNCONFIRMEDdev-util/eclipse-sdk-3.5.1-r1 No more handles [MOZILLA_FIVE_HOME='/usr/lib64/xulrunner-devel-1.9.2']2013-02-04 12:41:42
417897JavajavaUNCONFIRMEDdev-java/guava-12.0 released2012-05-28 20:37:26
417895JavajavaUNCONFIRMEDdev-java/stringtemplate-4.0.6 released2012-12-07 19:10:27
398689EbuildsjavaUNCONFIRMEDRemove dev-java/servletapi replace with java-virtuals/servlet-api2012-09-29 09:01:54
399471JavajavaUNCONFIRMEDdev-java/ibm-jre-bin-1.6.0.9_p2-r1: error while loading shared libraries: libstdc++.so.5: cannot op2012-01-27 02:05:35
383013JavajavaUNCONFIRMEDOnline bank security apple refuses to work unless I create a '/etc/.java' folder2011-09-15 18:53:28
389709JavajavaUNCONFIRMEDdev-java/icedtea-7.2.0-r1: failed to emerge due to SIGSEGV in the build process2012-11-02 14:42:48
380441JavajavaUNCONFIRMEDjconsole (JRE 6.0_22-b22) crashes (SIGSEGV) in IcedTea6 1.10.32011-10-19 14:43:03
376823JavajavaUNCONFIRMEDdev-java/icedtea-6.1.10.3: I have problems when open Jdownloader program. A fatal error has been det2011-12-08 10:40:09
368205JavajavaUNCONFIRMEDjava-vm-2.eclass:pkg_prerm could mention eselect java-vm instead.2012-12-30 15:53:24
368049JavajavaUNCONFIRMEDdev-java/jjtraveler-0.4.3-r2 does not emerge, fails unpack2012-06-26 02:05:17
367037JavajavaUNCONFIRMEDdev-java/piccolo2d-1.2.1-r2 did not build unable to find paths2011-05-13 05:12:20
447102Applicationsidl0rUNCONFIRMEDnet-analyzer/nagstamon-0.9.9 throws glib.GError: Couldn't recognize the image file format for file '2012-12-13 14:34:59
430316Ebuildsidl0rUNCONFIRMEDFeature request: Add a check for sane folder/file permission in net-dns/bind2012-08-07 16:19:51
376315Ebuildsidl0rUNCONFIRMEDnet-dns/bind: config-file split2012-05-22 00:07:14
426872Serveridella4UNCONFIRMEDapp-emulation/xen-tools-4.1* - disable HPET broadcast2012-08-13 09:47:39
454354Applicationsidella4UNCONFIRMEDapp-emulation/xen-tools-4.2.1 - Fails to compile with KeyError: '.text.asm.out/../src/smp.c.68'2013-02-01 21:20:22
450908Keywording and Stabilizationia64UNCONFIRMEDsys-boot/gnu-efi-3.0s: please stabilize2013-01-08 17:08:39
443728EbuildshwoarangUNCONFIRMEDapp-laptop/prey-0.5.4-r1: /etc/init.d/prey-trigger is installed as invalid symlink, first run attemp2013-01-15 19:43:12
450536ServerhwoarangUNCONFIRMEDnet-ftp/vsftpd-3.0.2 prints warning: `vsftpd' uses 32-bit capabilities (legacy support in use) in ke2013-01-15 23:14:17
439796EbuildshwoarangUNCONFIRMEDnet-misc/dibbler - /etc/init.d/dibbler-client stop doesn't stop client gracefully2012-11-04 10:57:39
406757ApplicationshwoarangUNCONFIRMEDmedia-video/rtmpdump crashes with gnutls[nettle]2012-03-24 09:19:49
397391ApplicationshwoarangUNCONFIRMEDx11-misc/lightdm doesn't work properly with gnome-base/gdm installed.2013-01-22 22:35:59
442610ServerhollowUNCONFIRMEDwww-servers/nginx - Feature support request for dav-ext-module.2012-11-26 20:05:19
427194ApplicationshollowUNCONFIRMEDwww-servers/nginx: add rtmp module support2012-11-26 08:04:35
401397ServerhollowUNCONFIRMEDwww-servers/nginx: add automatic minification module (jitify)2012-11-26 08:02:58
447754Core systemhardened-kernelUNCONFIRMEDsys-kernel/vanilla-sources with sys-devel/gcc-4.6+ creates unbootable kernel images on ia642013-02-21 02:19:12
453492Hardenedhardened-kernelUNCONFIRMEDsys-kernel/hardened-sources-3.7.3: kernel panic when loading modules2013-01-28 14:15:36
456970Applicationshardened-kernelUNCONFIRMEDapp-editors/emacs-24.2 failed to emerge with a segmentation fault on hardened-sources-3.7.4-r12013-02-12 22:17:52
420573UnspecifiedhaskellUNCONFIRMEDhaskell-updater wrongly identifies packages as not installed by package manager2012-06-12 18:40:25
421623DevelopmenthaskellUNCONFIRMEDdev-lang/ghc-7.4.1-r1: unable to compile with portage because it results in a segmentation fault.2012-06-19 16:29:37
444012ApplicationshaskellUNCONFIRMED=dev-lang/ghc-6.12.3 poorly handles -fPIC (ZCMain_main_closure' can not be used when making a shared2012-12-16 14:18:00
444544EbuildshaskellUNCONFIRMED[haskell overlay] dev-haskell/accelerate-cuda passes CFLAGS into non-gcc compiler2012-11-24 17:29:02
451290LibraryhaskellUNCONFIRMEDdev-haskell/pandoc-types-1.9.1.1 - setup: At least the following dependencies are missing: syb -any2013-01-11 18:00:06
456694LibraryhaubiUNCONFIRMEDdev-db/oracle-instantclient-sqlplus-11.2.0.3: sqlpus binary needs paxctl -c on hardened ~amd642013-02-19 20:33:27
457728ApplicationshasufellUNCONFIRMEDx11-misc/spacefm fails by opeining files with ö ä ü or pdf file with acroread.2013-02-16 17:18:18
447702Core systemhardened-kernelUNCONFIRMEDsys-kernel/hardened-sources-3.7.0 fails to crosscompile for Ski-Simulator: include/linux/gfp.h:295:22012-12-19 09:10:48
437722Core systemhardened-kernelUNCONFIRMEDsys-kernel/hardened-sources-3.4.5, 3.5.4-r1: BUG: unable to handle kernel NULL pointer dereference2013-01-22 13:36:29
446326Core systemhardened-kernelUNCONFIRMED=sys-kernel/hardened-sources-3.6.8 - unable to handle kernel NULL pointer dereference - vsftpd copy_2013-01-22 13:36:00
390363Core systemhardened-kernelUNCONFIRMEDsys-kernel/hardened-sources-2.6.32-r42/r68/r73 - Problem with support OCFS2 filesystems2011-12-24 02:47:23
456922UnspecifiedhardenedUNCONFIRMEDUnable to start any java-vm on hardened gentoo icedtea-bin-6.1.11.5: Could not reserve enough space 2013-02-13 15:13:44
455472HardenedhardenedUNCONFIRMEDsys-kernel/hardened-sources-3.2.37-r2: File "/usr/src/linux-3.2.35-hardened-r1/arch/ia64/scripts/unw2013-02-04 17:45:58
450776HardenedhardenedUNCONFIRMEDapp-emulation/wine-1.5.21 - configure: checking for -lGL... ./conftest: error while loading shared l2013-02-11 21:23:57
452828HardenedhardenedUNCONFIRMEDsys-apps/util-linux-2.21.2 - dmesg: *** glibc detected *** dmesg: double free or corruption (!prev):2013-01-18 16:31:50
446850HardenedhardenedUNCONFIRMEDthunderbird-17.0-r2 fails to install with CONFIG_PAX_MPROTECT enabled2012-12-14 17:52:48
434922HardenedhardenedUNCONFIRMEDnet-fs/openafs-1.6.1 doesn't built with sys-kernel/hardened-sources with grsecurity/PaX enabled2013-02-10 14:52:43
417175EbuildshardenedUNCONFIRMEDapp-admin/bastille-3.0.9: homepage is not correct2012-05-22 21:45:41
428682HardenedhardenedUNCONFIRMEDSystem.map has an incorrect kernel version reported when grsec enabled2012-08-03 15:29:25
400951HardenedhardenedUNCONFIRMEDJava does not run properly on non-root with Grsecurity Hardened Gentoo [workstation] level2012-01-26 19:28:36
386647HardenedhardenedUNCONFIRMEDdev-java/jamvm-1.5.4-r1 segfaults with hardened gcc-4.5.3-r1 (any profile), unless -Xnoinlining is s2012-07-11 11:36:26
391839HardenedhardenedUNCONFIRMEDcompiling external module which is using file_operations fails2011-11-25 08:09:59
442372ApplicationshannoUNCONFIRMEDmail-mta/courier : init.d file lacks "checkpath --directory /var/run/courier" for openrc-0.11.52012-12-12 15:30:37
434722UnspecifiedhannoUNCONFIRMEDnet-mail/mailman-2.1.14 uses python_mod_cleanup() incorrectly2012-09-11 15:14:21
435656EbuildshannoUNCONFIRMEDnet-analyzer/greenbone-security-assistant-2.0.1 - ld: CMakeFiles/gsad.dir/gsad.c.o: undefined refere2012-09-24 10:44:47
434472ApplicationshannoUNCONFIRMEDnet-analyzer/openvas-scanner-3.2.4 - ld: CMakeFiles/openvassd.dir/preferences.c.o: undefined referen2013-01-01 12:37:32
430422ApplicationshannoUNCONFIRMEDapp-emulation/dosemu-1.4.1_pre20091009 : svga USE flag is not handled properly2012-08-08 09:56:45
416587LibraryhannoUNCONFIRMEDmedia-libs/gegl-0.2.0: fails to compile with USE="introspection"2012-11-17 12:46:15
402675ApplicationshannoUNCONFIRMEDapp-arch/unp-2.0_pre7 doesn't honor LINGUAS for locale files2012-02-23 21:38:44
406333ApplicationshannoUNCONFIRMEDmedia-gfx/gimp-2.6.12 - Black and yellow striped rectangle on zoom2012-04-02 22:14:48
396525ApplicationshannoUNCONFIRMEDmail-mta/courier-0.66.3: wrong file ownership on /usr/share/courier/esmtpd2012-06-23 19:03:26
396561ServerhannoUNCONFIRMEDnet-mail/mailman-2.1.14 installs CGIs non-world-readable, breaks under lighttpd2011-12-31 09:30:28
392261UnspecifiedhannoUNCONFIRMEDapp-emulation/dosemu -fno-pic causes build failure when using hardened compiler with PIE2012-12-23 17:38:30
377817EbuildshannoUNCONFIRMED[hanno overlay] net-im/gajim-9999 Please split crypt USE to otr, gpg and new for E2E2011-08-05 08:55:52
454084ApplicationsgurligebisUNCONFIRMEDnet-wireless/hostapd USE=-debug prints no messages2013-01-26 15:49:39
436702ApplicationsgurligebisUNCONFIRMEDnet-wireless/wpa_supplicant - systemd unit does not configure ctrl_interface2012-11-18 13:03:00
421829ApplicationsgstreamerUNCONFIRMEDmedia-plugins/gst-plugins-ffmpeg-0.10.13-r1 with ABI=x32 - libswscale/x86/swscale_template.c:998: Er2012-09-11 06:15:09
402763EbuildsgstreamerUNCONFIRMEDmedia-plugins/gst-plugins-ffmpeg-0.10.13-r1 - libavcodec/arm/dsputil_vfp.S:45: Error: selected proce2012-02-09 01:08:01
374043ApplicationsgstreamerUNCONFIRMEDmedia-plugins/gst-plugins-ffmpeg-0.10.11-r1 does not compile on x86 with mstackrealign CFLAG and gcc2011-07-10 10:04:50
371869UnspecifiedgstreamerUNCONFIRMEDgst-plugins-bad-0.10.21: Regression in playback of avi with multiple ac3 audio tracks2011-10-22 06:53:58
418199ApplicationsgrozinUNCONFIRMEDsci-libs/mathgl-1.11.2 install phase - ln: failed to create symbolic link './mathgl-1.11.2/ChangeLog2012-06-04 09:41:36
455346ServergrobianUNCONFIRMEDmail-mta/exim-4.80.1: pidfile in /var/run - should be in /run2013-02-05 11:49:31
456896LibrarygraphicsUNCONFIRMEDmedia-libs/lensfun-0.2.5-r2 - Fatal error: can't create out/posix.x86_64/release/libs/lensfun/mod-co2013-02-12 08:34:39
456990LibrarygraphicsUNCONFIRMEDmedia-libs/lensfun-0.2.7 version bump2013-02-12 21:58:13
457080EbuildsgraphicsUNCONFIRMEDmedia-gfx/cellwriter-1.3.5 - version bump request and please move it to app-accessibility/2013-02-13 18:34:41
457634LibrarygraphicsUNCONFIRMEDmedia-libs/imlib2-1.4.5 with media-libs/giflib-5.0.x - pass NULL a second argument to DGifOpenFileHa2013-02-15 15:41:00
440212ServergrobianUNCONFIRMEDmail-mta/exim - R=localuser T=local_delivery defer (27): File too large: error while writing to /var2012-10-30 16:23:42
449086ApplicationsgraphicsUNCONFIRMEDmedia-libs/lensfun-0.2.5-r2 fails using multiple jobs2013-01-10 07:44:47
440104ApplicationsgraphicsUNCONFIRMEDmedia-libs/lensfun-0.2.6 installs corrupted pkgconfig file2013-01-10 07:44:34
438436ApplicationsgraphicsUNCONFIRMEDmedia-gfx/enblend-4.0 USE=doc - !pdfTeX error: pdfetex (file ./smooth-edge.pdf): reading image file 2012-10-15 11:31:41
437446ApplicationsgraphicsUNCONFIRMEDmedia-gfx/nip2-7.26.4 - parser.h:57:12: error: conflicting types for ‘yyleng’ lex.c:275:11: note: pr2013-02-16 13:23:10
431986ApplicationsgraphicsUNCONFIRMEDmedia-gfx/luminance-hdr-2.3.0 - crash when loading any hdr file if compiled with -march=core22012-08-20 12:08:47
424812EbuildsgraphicsUNCONFIRMEDmedia-gfx/cairosvg should depend on dev-python/cssselect2012-07-06 04:28:24
426362ApplicationsgraphicsUNCONFIRMEDmedia-gfx/graphviz-2.28.0 media-gfx/graphviz-2.28.0 enables qt, despite USE=-qt4 builds Qt support2012-07-18 00:01:30
422643ApplicationsgraphicsUNCONFIRMEDmedia-gfx/graphviz-2.28.0 sci-biology/phrap-1.080812 - file collision in /usr/bin/cluster2012-06-21 14:28:59
417711ApplicationsgraphicsUNCONFIRMEDmedia-gfx/graphviz-2.26.3-r4 + distcc - iffe: x86_64-pc-linux-gnu-gcc : not a C compiler: should not2012-06-05 19:48:49
416835ApplicationsgraphicsUNCONFIRMEDmedia-gfx/nip2 should support USE="compat examples"2013-02-16 14:13:54
400601ApplicationsgraphicsUNCONFIRMEDmedia-gfx/enblend-4.0 USE=doc - ./auxmac.tex:1: I can't find file `thumbpdf.sty'.2012-01-25 13:59:04
403045ApplicationsgraphicsUNCONFIRMEDmedia-gfx/tuxpaint-0.9.21-r1 doesn't honor LINGUAS for locale files2013-02-16 13:25:53
373479ApplicationsgraphicsUNCONFIRMEDmedia-libs/lensfun - Lensfun plugin for GIMP2013-01-10 07:42:30
373387ApplicationsgraphicsUNCONFIRMEDmedia-gfx/hugin-2011.0.0 fail to compile; ld cannot find -lwx_gtk2_gl-2.82012-03-26 20:18:36
385897ApplicationsgraphicsUNCONFIRMEDmedia-gfx/enblend-4.0 fails compilation with use="+image-cache"2011-10-07 00:52:55
373519EbuildsgraphicsUNCONFIRMEDmedia-gfx/yafray-9999 ebuild REQUEST for blender 2.5x or blender-svn2011-08-12 02:07:29
451494gpackages - http://packages.gentoo.org/gpackagesUNCONFIRMEDpages on http://packages.gentoo.org with multiple "Homepages:" show no links to them and no license2013-01-25 09:34:32
364495Keywording and Stabilizationgnu_andrewUNCONFIRMEDPlease stabilize dev-java/icedtea-6.1.10.4 and dev-java/icedtea-web-1.1.12012-11-27 04:46:18
450262LibrarygnustepUNCONFIRMEDgnustep-base-1.24.0-r1 - Assembler messages: {standard input}:1430: Error: symbol `_OBJC_CLASS_GCObj2013-01-05 17:44:50
389861ApplicationsgnustepUNCONFIRMEDgnustep-base/gnustep-make-2.6.1-r1[doc] - mkdir: cannot create directory `gnustep-howto.t2d': File e2011-11-08 15:59:39
416829Applicationsgnome-officeUNCONFIRMEDapp-office/abiword-2.8.6-r2: USE=gnome is misleading, suggesting USE=goffice2012-07-07 13:04:16
455134Applicationsgnome-officeUNCONFIRMEDapp=office/gnucash with dev-db/libdbi - "The library "libdbi" installed on your system doesn't corre2013-02-12 19:39:30
402689Applicationsgnome-accessibilityUNCONFIRMEDdev-libs/atk-2.2.0 doesn't honor LINGUAS for locale files2012-04-19 08:58:57
454808LibrarygnomeUNCONFIRMEDnet-libs/webkit-gtk-1.10.2-r300 - File "./Tools/Scripts/run-gtk-tests", line 168: Could not start ac2013-02-08 00:08:40
455372Keywording and StabilizationgnomeUNCONFIRMEDapp-text/rarian-0.8.1-r2 stable request2013-02-04 12:47:50
454956GNOMEgnomeUNCONFIRMEDgnome-base/orbit-2.14.19-r1 with sys-devel/automake-1.13.1 - test/everything/Makefile.am:81: error: 2013-02-01 06:41:21
453842GNOMEgnomeUNCONFIRMED[PATCH] gnome-base/gnome-shell-3.6.2-r1: Fix partialy memory leaks issues2013-02-12 09:35:27
452648GNOMEgnomeUNCONFIRMEDgnome-base/gnome-panel-3.4.2.1: dconf-client.h: No such file or directory2013-01-21 13:53:08
450930GNOMEgnomeUNCONFIRMEDglib-2.34.x causes nautilus-2.32 to consume 1 whole core when attempting to display thumbnails2013-02-20 16:36:03
450260GNOMEgnomeUNCONFIRMEDnet-im/empathy-3.6.2-r2 fails to compile2013-01-04 21:31:54
449552GNOMEgnomeUNCONFIRMEDgnome-base/gnome-3.6.2: font and icons problem2013-01-01 14:26:54
450004GNOMEgnomeUNCONFIRMEDgnome-extra/libgda-5.1.1-r1: Couldn't find suitable VM2013-02-11 14:07:26
450246LibrarygnomeUNCONFIRMEDdev-python/pygtk-2.24.0 - memory leak in _wrap_pango_cairo_create_layout2013-01-05 16:55:14
448894DevelopmentgnomeUNCONFIRMEDapp-mobilephone/gnome-phone-manager-0.68 : Only should be included directly2012-12-27 23:08:41
448896EbuildsgnomeUNCONFIRMEDdev-python/pygobject-3.4.2-r1 (and others): py-compile coming from 2012-12-28 19:03:04
449270ApplicationsgnomeUNCONFIRMEDgnome-base/gdm-3.6.2: unable to log in after logout from autologin2013-01-22 22:54:27
448772GNOMEgnomeUNCONFIRMED[gnome overlay] x11-libs/gtk+-9999 fails to build due to failed patch "gtk+-3.3.18-fallback-theme.2012-12-27 05:55:29
448770GNOMEgnomeUNCONFIRMED[gnome overlay] app-accessibility/at-spi2-atk-9999 fails to build due to failed patch "at-spi2-atk-2012-12-27 05:56:05
439246ApplicationsgnomeUNCONFIRMEDmedia-gfx/gthumb-3.0.0 - segmentation fault in strlen(""), called from g_str_has_prefix at gstrfuncs2012-11-19 23:40:51
436054GNOMEgnomeUNCONFIRMEDgnome-base/gnome-control-center-3.4.2-r1 QA Notice: This package installs one or more .desktop files2012-11-25 09:53:38
436602GNOMEgnomeUNCONFIRMEDThe systemd and consolekit USE-flags should not be set together for GNOME >= 3.42012-11-04 15:02:44
436052GNOMEgnomeUNCONFIRMEDgnome-base/gnome-shell-3.4.2 QA Notice: This package installs one or more .desktop files that do not2012-11-21 18:48:32
434842GNOMEgnomeUNCONFIRMEDmedia-video/cheese-3.4.2 This package installs one or more .desktop files that do not pass validati2012-11-21 18:48:25
434510GNOMEgnomeUNCONFIRMEDgnome-base/gnome-shell-3.2.2.1: autocomplete in the run dialog does not work for non-members of grou2012-09-16 11:37:30
426676GNOMEgnomeUNCONFIRMEDmail-client/evolution-2.32.3-r1 deleted whole directory with calendars2012-07-21 12:09:48
423993GNOMEgnomeUNCONFIRMEDgnome-base/gnome-keyring: unable to create a new keyring due general protection2013-02-01 20:57:07
422695GNOMEgnomeUNCONFIRMEDmail-client/evolution-3.2.3-r1 fails to compile with USE flag clutter2012-06-20 19:07:36
421107GNOMEgnomeUNCONFIRMEDmedia-libs/cogl-1.10.2[gles2] error with GLchar (tegra2 headers of EGL & GLES1/2)2012-06-14 15:04:50
420771GNOMEgnomeUNCONFIRMEDgnome-base/gvfs-1.12.3 (and apps using it, e.g. Nautilus) corrupt files on copy. Caused by prelink?2012-07-24 08:26:50
415801GNOMEgnomeUNCONFIRMEDwww-client/epiphany-3.4.1 fails test test-ephy-embed-single2012-09-16 08:52:40
398955GNOMEgnomeUNCONFIRMEDgnome-base/libglade-2.6.4: please split the python dependency2013-01-01 23:07:29
398419New DocumentationgnomeUNCONFIRMEDPlease provide documentation for using pam_ldap.so in combination with sys-auth/pambase[gnome-keyrin2012-07-08 23:26:02
393497GNOMEgnomeUNCONFIRMEDgnome-base/gnome-applets-3.2.1 fails to install if sys-apps/linux-misc-apps is installed2012-08-07 17:34:06
379001LibrarygnomeUNCONFIRMEDsys-libs/ldb-1.1.4 fails on portage-multilib because of waflib module's python support2013-01-01 18:40:16
368731ApplicationsgnomeUNCONFIRMEDx11-libs/gdk-pixbuf-2.22.1: parallel install fails sometimes2012-01-30 10:16:01
429680[RU]gentoo-doc-ruUNCONFIRMEDLinks on GLEPs on Russian page triggers 404 error2012-08-11 20:46:28
454780Core systemgenkernelUNCONFIRMEDsys-kernel/genkernel-3.4.45 - initramfs unable to switch on real-root on /dev/sdax2013-02-01 22:15:24
455266genkernelgenkernelUNCONFIRMED=sys-kernel/genkernel-3.4.45 inoperable --disklabel option2013-02-05 11:27:40
448624genkernelgenkernelUNCONFIRMEDlast step of compile_kernel() does not respect ${KERNEL_OUTPUTDIR} in genkernel-3.4.452012-12-26 01:26:22
389361Core systemgenkernelUNCONFIRMEDsys-kernel/genkernel-3.4.16 dmraid advises user to install obsolete device-mapper package2012-01-31 02:42:48
447328genkernelgenkernelUNCONFIRMEDsys-kernel/genkernel-3.4.45: encrypted filesystems from initramfs.mounts cannot be mounted2012-12-15 11:14:42
444934genkernelgenkernelUNCONFIRMEDsys-kernel/genkernel-3.4.45: no support for iptables target LOG with gentoo-sources-3.5.72012-12-13 12:03:26
444574genkernelgenkernelUNCONFIRMEDsys-kernel/genkernel-3.4.45: genkernel/defaults/linuxrc does not handle spaces right2012-11-24 18:40:17
419773genkernelgenkernelUNCONFIRMEDearly bind mounts are listed twice in the mount table2012-06-05 14:14:06
395095genkernelgenkernelUNCONFIRMEDgenkernel add support for custom location of boot config file2011-12-17 22:26:49
453466GamesgamesUNCONFIRMEDgames-puzzle/closure - new ebuild2013-01-22 03:19:53
448416GamesgamesUNCONFIRMEDgames-strategy/dungeon-defenders - Humble Indie Bundle 7 game2013-01-04 00:06:56
447904GamesgamesUNCONFIRMEDBuild games-rpg/pcgen from source with fewer bundled libraries2012-12-20 05:10:59
429604GamesgamesUNCONFIRMEDgames-puzzle/krosswordpuzzle-0.15.6.2.1259326 fails to configure with KDE 4.92012-12-21 22:55:29
424445GamesgamesUNCONFIRMEDufo-ai-2.4 fails with Com_EParseValue: Illegal color statement '1 .874 .294 1'2012-08-02 20:55:27
424539GamesgamesUNCONFIRMEDgames-fps/qudos: problem with opengl & sdl use flags2012-10-21 12:32:14
424341GamesgamesUNCONFIRMEDgames-puzzle/enigma prevents upgrade of games-fps/sauerbraten and games-rpg/mana (blocker in slots o2012-11-24 03:10:20
420611GamesgamesUNCONFIRMEDgames-strategy/gratuitous-space-battles - new ebuild2012-06-11 00:31:04
420755GamesgamesUNCONFIRMEDgames-puzzle/machinarium - new ebuild2012-06-12 02:12:24
423031GamesgamesUNCONFIRMEDgames-puzzle/mindless-1.6 crash in generating sealed deck2012-08-27 12:45:23
419545GamesgamesUNCONFIRMEDgames-puzzle/chocolate-castle new ebuild2012-06-04 19:50:10
419055GamesgamesUNCONFIRMEDgames-emulation:mednafen-0.9.21 does not compile2012-06-01 20:48:36
417187GamesgamesUNCONFIRMEDgames-puzzle/world-of-goo installs 32-bit binary on 64-bit system, causing shadow dependency on emul2012-06-03 13:44:16
415913GamesgamesUNCONFIRMEDgames-sports/speed-dreams new version 2.0 available - please update2013-01-28 08:07:00
416211Keywording and StabilizationgamesUNCONFIRMEDPlease stabilize app-emulation/vice-2.3 for PPC2012-05-16 11:36:08
411099GamesgamesUNCONFIRMEDgames-simulation/tpt_merbo-1.0 - A mod of The Powder Toy, a particle simulator2012-04-07 15:00:08
405839GamesgamesUNCONFIRMEDdelay created when selecting tiles2012-02-26 03:03:55
403599GamesgamesUNCONFIRMEDgames-puzzle/gtetrinet-0.7.11-r1 doesn't honor LINGUAS for locale files2012-10-03 10:09:20
400779GamesgamesUNCONFIRMEDgames-puzzle/lemmini - a Java port of Lemmings2012-01-25 20:53:58
395389GamesgamesUNCONFIRMEDgames-puzzle/cuyo-2.1.2: version bump2011-12-20 18:55:36
394849GamesgamesUNCONFIRMEDgames-action/shank - A side scrolling beat 'em up with a comic book art style2012-09-23 17:44:45
389435GamesgamesUNCONFIRMEDgames-puzzle/blocks-that-matter-1.0.0.6 - drill blocks of matter one by one, collect them, and recyc2012-04-30 19:21:22
383321GamesgamesUNCONFIRMEDgames-fps/doom3-mitm: please add additional map2011-09-17 09:54:51
382195Keywording and StabilizationgamesUNCONFIRMEDPlease stabilize =games-fps/quake4-bin-1.4.22012-09-20 19:48:29
382169Keywording and StabilizationgamesUNCONFIRMEDPlease stabilize =games-util/ucon64-2.0.02012-09-20 15:39:11
378837GamesgamesUNCONFIRMEDgames-puzzle/crayon - new ebuild for Crayon Physics Deluxe: a 2D physics puzzle2012-06-06 20:45:27
377307EbuildsgamesUNCONFIRMEDgames-puzzle/cogs - New Ebuild for Cogs2012-06-10 15:31:29
374475GamesgamesUNCONFIRMEDnwn-data downloads 1.5GB of files only to tell me i need USE=cdinstall in order to proceed2012-10-07 11:42:43
447662Applicationsfreedesktop-bugsUNCONFIRMEDx11-misc/xdg-utils-1.1.0_rc1_p20120916 xdg-open does not escape filenames2012-12-19 04:29:40
456662Core systemfreedesktop-bugsUNCONFIRMEDsys-fs/udisks-2.0.91 - memory leak in /usr/lib/udisks2/udisksd2013-02-12 14:59:47
457642Applicationsfreedesktop-bugsUNCONFIRMEDapp-misc/tracker-0.14.4 with media-libs/giflib-5 - add NULL as second argument to DGifOpenFileHandle2013-02-15 15:43:43
367787GamesgamesUNCONFIRMEDrevenge-of-the-titans-1.80.12 doesn't support humble bundle installation files.2012-12-27 10:32:12
443530Applicationsfreedesktop-bugsUNCONFIRMEDsys-power/pm-utils - fix wireless power saving in /usr/lib/pm-utils/power.d/wireless2012-11-16 16:35:14
442052Applicationsfreedesktop-bugsUNCONFIRMEDsys-power/pm-utils-1.4.1-r2 uses deprecated kernel option CONFIG_WIRELESS_EXT_SYSFS2012-11-06 16:06:47
409583GNOMEfreedesktop-bugsUNCONFIRMEDapp-misc/tracker-9999 fails to compile with sys-devel/gettext-0.182012-04-02 12:35:18
407169Ebuildsfreedesktop-bugsUNCONFIRMEDsys-fs/udisks-1.0.4-r2 - file:///etc/xml/docbook:1: parser make[3]: *** [udisks.7] Fehler 4 parser e2012-10-03 07:06:31
430056Applicationsford_prefectUNCONFIRMEDmedia-sound/pulseaudio-1.1-r1 USE=lirc does not build lirc module2012-08-05 22:53:00
430854GNOMEford_prefectUNCONFIRMEDmedia-sound/pulseaudio-2.1: won't store volume level on gnome 3.2012-08-27 21:33:07
394875Applicationsford_prefectUNCONFIRMEDmedia-sound/pulseaudio - module-tunnel-sink is unreliable2012-12-15 12:50:15
455318LibraryfontsUNCONFIRMEDmedia-libs/freetype[X,-utils] needlessly depends on X libraries2013-02-05 11:37:35
456264LibraryfontsUNCONFIRMEDmedia-fonts/droid-113-r2 with multiple values in 2013-02-15 20:47:53
442814ApplicationsfloppymUNCONFIRMEDnet-misc/freerdp-1.1.0_pre20121004-r1 CMake Error at cunit/CMakeLists.txt:28 (add_executable): Canno2012-11-13 07:00:04
406891ApplicationsfontsUNCONFIRMEDmedia-libs/freetype-1.4_pre20080316-r2 compile failure: make[2]: execvp: ../libtool: Permission deni2012-03-05 20:19:14
401207UnspecifiedfontsUNCONFIRMEDmedia-gfx/fontforge-20110222-r1: Crash while select more than 4 points while press "Shift/Ctrl"2012-01-28 17:49:29
457010ApplicationsfloppymUNCONFIRMEDnet-misc/flexget-1.0.3344: BUG: Unhandled error in plugin --series: Only '='/'!=' operators can be u2013-02-17 18:32:40
432342EbuildsfloppymUNCONFIRMEDwww-client/google-chrome - wrapper does not respect $CHROMIUM_USER_FLAGS2012-08-23 00:47:10
410321ApplicationsfloppymUNCONFIRMEDwww-client/google-chrome-18.0.1025.142_p129054: "While your browser seems to support WebGL, it is di2012-07-24 04:30:58
454802DevelopmentflameeyesUNCONFIRMEDdev-utils/google-perftools-2.0-r1 ARMv6 does not imply 'dmb' instruction availability but it is used2013-02-02 00:14:37
455208Core systemflameeyesUNCONFIRMEDsys-firmware/amd-ucode-2012.09.10 - ebuild SRC_URI no longer available2013-02-04 00:50:10
424699EbuildsflameeyesUNCONFIRMEDdev-perl/google-api-adwords-perl gzip support USE flag2012-07-08 19:56:15
423817DevelopmentflameeyesUNCONFIRMEDdev-util/dwarves-1.9: ostra-cg cannot find python module ostra: ImportError: No module named ostra2012-06-27 18:54:10
449720Core systemferringbUNCONFIRMEDsys-apps/pkgcore-0.8.6: SyntaxError during compilation of Python modules for Python 3.22013-01-02 10:12:25
399839EbuildsfauliUNCONFIRMEDapp-admin/tmpwatch reports "Cannot stat file" with --fuser on sufficiently loaded system2012-02-17 15:33:53
373613EselecteselectUNCONFIRMEDapp-admin/eselect broken for eselect modules which rely on skel.bash (such as blas, cblas, lapack)2011-07-04 12:04:13
376153EselecteselectUNCONFIRMEDRequest: eselect module for managing /etc/init.d/net.* symlinks2011-07-26 10:41:35
408663EselecteselectUNCONFIRMEDAlias 'eselect news read unread' for 'eselect news read new'2012-03-20 20:33:24
413581ApplicationsevaUNCONFIRMEDnet-voip/telepathy-salut-0.8.0 - .../work/telepathy-salut-0.8.0/src/.libs/libsalut-plugins.so: file 2013-02-11 14:04:35
426994EbuildsevaUNCONFIRMEDx11-drivers/xf86-input-synaptics - Enable natural scrolling for MacBooks by default2012-09-10 14:04:38
427336UnspecifiedevaUNCONFIRMEDx11-drivers/xf86-input-evdev-2.7.0 - Lenovo W510 (Synaptics) Touchpad doesn't work2012-07-30 23:39:55
417263EbuildsembeddedUNCONFIRMEDsys-apps/busybox - USE=make-symlinks should not overwrite existing files2012-06-28 04:01:46
430566DevelopmentembeddedUNCONFIRMEDsys-devel/crossdev installed bashrc doesn't run cross-fix-root when it should2012-08-10 00:43:26
441976StagesembeddedUNCONFIRMEDIdea: Providing a tiny stage (and profile) for limited embedded devices.2013-02-15 11:46:25
458354Eclasses and ProfilesembeddedUNCONFIRMEDvideo_cards_geode is masked in profile hardened/linux/uclibc/x862013-02-20 15:30:48
372707EbuildsenlightenmentUNCONFIRMED[enlightenment-overlay] x11-plugins/e_modules-comp-scale: new ebuild2012-12-22 20:35:46
427428ApplicationsenlightenmentUNCONFIRMED[enlightenment overlay] x11-wm/enlightenment-9999 now optionally depends on elementary2012-12-22 20:35:54
435752LibraryenlightenmentUNCONFIRMEDmedia-libs/evas-9999 - configure: WARNING: unrecognized options: --enable-software-sdl2012-09-21 16:55:35
455548Keywording and StabilizationenlightenmentUNCONFIRMEDx11-wm/enlightenment:0.17 stable request2013-02-08 05:26:27
410065ServererasUNCONFIRMEDnet-mail/dovecot-2.1.3 fails at parallel make: fatal error: ../../../src/plugins/quota/rquota.h: No 2012-07-12 15:51:16
426444ApplicationsemacsUNCONFIRMEDapp-editors/emacs-23.4-r3 fails to build in parallel (--jobs=64)2012-07-18 15:26:44
370063DevelopmentembeddedUNCONFIRMEDsys-devel/crossdev: settings masked via arch profiles are not considered with cross-compilers2012-03-08 21:08:25
431916ApplicationsdotnetUNCONFIRMEDdev-dotnet/libgdiplus-2.10.9 - Variable 'libjpeg_prefix' not defined in '/usr/lib64/pkgconfig/libgdi2012-11-09 14:13:30
449512Third-Party ToolsdolsenUNCONFIRMEDapp-portage/porthole with python3 - File "/usr/lib/portage/pym/portage/__init__.py", line 224, in __2013-02-10 22:16:25
380647UnspecifieddolsenUNCONFIRMEDapp-portage/layman-2.0.0: More complete support for CVS2012-02-28 05:33:36
457672Otherdocs-teamUNCONFIRMED[FA] handbook/hb-net-wireless.xml2013-02-15 08:37:25
457668Otherdocs-teamUNCONFIRMED[fa] handbook/hb-net-modules.xml2013-02-15 08:30:33
456988Other documentsdocs-teamUNCONFIRMEDrsync doc: multiple guides, ambiguity on which version for FAQ2013-02-12 20:03:28
451846Installation Handbookdocs-teamUNCONFIRMEDwireless-tools no longer function with default installation2013-01-20 16:04:16
424513Other documentsdocs-teamUNCONFIRMEDiptables comment for working w/ UML2012-07-02 15:44:13
451574ApplicationsdjcUNCONFIRMEDnet-misc/openvpn-2.2.2: cannot open ifconfig-pool-persist file on startup2013-01-13 10:36:53
442162ApplicationsdjcUNCONFIRMEDnet-misc/openvpn-2.1.4 - src_install: rmdir: failed to remove ‘/var/tmp/portage/net-misc/openvpn-2.12012-11-07 14:09:59
442616DevelopmentdjcUNCONFIRMEDdev-db/couchdb - /usr/lib/couchdb/bin/couchjs needs pax-mark mr on PaX-enabled systems.2013-01-12 18:34:44
397863EbuildsdjcUNCONFIRMEDnet-misc/openvpn: add /var/run/openvpn to be ok with selinux and openvpn-status.log file2012-01-29 16:29:33
442420ApplicationsdilfridgeUNCONFIRMEDmedia-libs/opencv-2.4.3 with USE=cuda : /opt/cuda/bin/nvcc compiles in /tmp which results in "No spa2013-02-04 21:24:25
440794ApplicationsdilfridgeUNCONFIRMEDmedia-gfx/digikam 2.9.0 - digikam (core): Failed to detect camera with GPhoto2 from Solid (canon ixu2013-01-27 16:08:36
395359DevmanualdevmanualUNCONFIRMEDDevmanual should document the metadata/layout.conf file format in detail2012-11-03 16:37:17
458006Applicationsdev-zeroUNCONFIRMEDx11-drivers/xf86-video-vmware with media-libs/mesa-9.1_rc1 - module fails to load2013-02-20 00:43:23
455320Applicationsdev-zeroUNCONFIRMEDnet-wireless/blueman-1.23-r2 - blueman crashes when theme misses icon gtk-missing-image2013-02-05 11:38:08
447630Unspecifieddev-zeroUNCONFIRMED=net-misc/openvswitch-1.6.1-r2 - /etc/init.d/ovs-controller: ERROR: ovs-controller needs service(s) 2013-02-12 08:26:14
445966Ebuildsdev-zeroUNCONFIRMEDnet-wireless/blueman should unconditionally depend on x11-themes/gnome-icon-theme?2012-12-04 22:59:24
435686Librarydev-zeroUNCONFIRMEDdev-libs/boost-1.49.0-r1 - In file included from [...] libs/date_time/src/gregorian/greg_month.cpp:12012-11-11 05:45:20
458284Core - Dependenciesdev-portageUNCONFIRMEDsys-apps/portage-2.1.11.52: 'emerge --depclean' does not remove old gentoo-sources2013-02-20 11:35:04
438816Coredev-portageUNCONFIRMEDsys-apps/portage-2.1.11.9 : /var/tmp/portage/._unmerge_/ directory not cleaned up2012-10-18 17:51:53
442054Portage Documentationdev-portageUNCONFIRMEDman make.conf should warn users about not using extra spaces in *FLAGS variables2012-11-10 17:44:56
442056Enhancement/Feature Requestsdev-portageUNCONFIRMEDAdditional checks for sanity of user-supplied *FLAGS variables in make.conf2012-11-06 16:12:29
446498Core - Configurationdev-portageUNCONFIRMEDsys-apps/portage should handle typos in make.conf like those at the command line2012-12-08 17:10:05
447118Enhancement/Feature Requestsdev-portageUNCONFIRMEDFEATURES=clean-logs can be dangerous2012-12-13 14:54:27
452172Unclassifieddev-portageUNCONFIRMEDemerge's --jobs does not do full parallelization due to PDEPEND circular dependencies2013-01-15 11:55:26
456270Enhancement/Feature Requestsdev-portageUNCONFIRMEDExpand portage acceptable version specifiers2013-02-18 04:33:36
458148Unclassifieddev-portageUNCONFIRMEDdev-libs/cyrus-sasl-2.1.25-r4: gzip: stdout: Broken pipe - phase-helpers.sh, line 312: Called __as2013-02-20 22:52:41
430102Unclassifieddev-portageUNCONFIRMEDEmerging in a deleted directory outputs lots of "getcwd: cannot access parent directories: No such f2012-08-21 00:22:33
428678Core - Configurationdev-portageUNCONFIRMEDsys-apps/portage-2.1.10.65 omits some variables from cascaded profiles make.defaults2012-08-07 05:00:31
427748Core systemdev-portageUNCONFIRMEDsys-apps/portage-2.2.0_alpha120 crashing when compile fails2012-07-23 18:57:51
428474Enhancement/Feature Requestsdev-portageUNCONFIRMEDPrint a warning after merge with wrong permissions on existing file2012-07-28 22:34:46
425682Enhancement/Feature Requestsdev-portageUNCONFIRMEDTrue parallel fetch for each job running2012-07-14 20:37:13
422491Coredev-portageUNCONFIRMEDemerging updates to nfs-mounted file systems can cause running programs to segfault2012-06-21 02:59:59
420687Enhancement/Feature Requestsdev-portageUNCONFIRMEDemerge --info should include CC, CXX variables and ld type2012-06-11 12:58:34
420459Enhancement/Feature Requestsdev-portageUNCONFIRMEDemerge --keep-going should leave behind --resume state for skipped/failed builds2012-09-07 04:13:06
416635Enhancement/Feature Requestsdev-portageUNCONFIRMEDPlease add new var EMERGE_INFO_OPTS for emerge --info2012-05-19 18:57:47
414249Core - Dependenciesdev-portageUNCONFIRMEDAutomatically keyword/unmask all dependencies with a single entry2012-12-25 21:12:28
406811Coredev-portageUNCONFIRMEDFeature request: enhance portage with "buildsrcpkg" that captures all source files for GPL complianc2012-03-04 07:20:32
401503Enhancement/Feature Requestsdev-portageUNCONFIRMEDemerge please ad short option to autounmask-write, -w suggested2012-01-30 17:48:55
402935Core - Dependenciesdev-portageUNCONFIRMEDemerge bad handle on --exclude with masked packages2012-02-10 18:02:04
399577Core - Dependenciesdev-portageUNCONFIRMEDportage/emerge fails to compute dependencies and fails to report what triggered the problem2012-01-22 15:26:36
395433Core systemdev-portageUNCONFIRMEDdev-libs/libiconv - static archives (*.a) and libtool library files (*.la) do not belong in /2011-12-22 00:37:10
391771Core - Configurationdev-portageUNCONFIRMEDAlternative config (PORTAGE_CONFIGROOT) does not consider PORTAGE_CONFIGROOT/etc/make.profile2011-11-25 17:20:03
391317Enhancement/Feature Requestsdev-portageUNCONFIRMEDsys-apps/portage: Multiple, consistent verbosity levels for emerge2011-11-22 13:28:07
380389Enhancement/Feature Requestsdev-portageUNCONFIRMEDebuild skips EAPI unsupported phases silently2011-08-26 03:07:11
412273Developmentdev-embeddedUNCONFIRMEDdev-embedded/avr-libc-1.8.0 probable preprocessor mistake in inttypes.h2012-04-17 15:26:21
426586Ebuildsdev-embeddedUNCONFIRMEDsci-electronics/sigrok - a portable, cross-platform, Free/Libre/Open-Source signal analysis software2012-11-04 22:54:31
455828Developmentdev-embeddedUNCONFIRMED=dev-embedded/avr-libc - Please add epatch_user to ebuild.2013-02-06 13:29:14
365029Enhancement/Feature Requestsdev-portageUNCONFIRMEDemerge-webrsync incorrect/incomplete proxy error codes handling2011-05-10 11:19:57
367479Enhancement/Feature Requestsdev-portageUNCONFIRMEDemerge fetch function should be mirror-selective depending on ebuild location2012-12-07 05:07:03
420447Applicationsdesktop-miscUNCONFIRMEDx11-misc/xdiskusage-1.48_p20111016 do not display non-ASCII folder/file name properly2012-06-11 10:58:21
382849Prefix Supportdeb-toolsUNCONFIRMEDdev-util/debhelper: please review prefix changes2012-11-13 23:09:06
444798Ebuildsdeb-toolsUNCONFIRMEDapp-arch/dpkg should create a /etc/dpkg/origins directory and appropriate files2013-02-20 19:39:52
427212Core systemcron-bugsUNCONFIRMEDsys-process/cronbase - run-crons executes ._* files2012-07-20 14:47:10
456120Applicationscron-bugsUNCONFIRMEDsys-process/vixie-cron with app-admin/logrotate - cron cannot handle cron.daily file with a dot in i2013-02-15 08:38:29
409259Applicationscron-bugsUNCONFIRMEDsys-process/vixie-cron: sed -i Makefile expands $CFLAGS, $LDFLAGS into sed call, which can confuse s2012-03-22 12:39:21
383867Applicationscron-bugsUNCONFIRMEDsys-process/vixie-cron-4.1-r11 - won't run any scheduled tasks2011-09-21 00:11:06
456792LibrarycppUNCONFIRMEDdev-libs/boost-1.52.0-r5 fails to compile with custom /etc/site-config.jam: could not find main targ2013-02-12 22:13:10
458338DevelopmentcppUNCONFIRMEDdev-libs/boost-1.49.0-r2 with sys-libs/uclibc - In file included from libs/locale/src/posix/codecvt.2013-02-21 02:53:30
404423Unspecifiedcommon-lispUNCONFIRMEDdev-lisp/ecls-12.2.1 fails to run tests - An error occurred during initialization: Module error: Don2013-02-02 10:15:50
432980Applicationscommon-lispUNCONFIRMEDdev-lisp/sbcl-1.0.55-r1 fails to compile with "The value 18446744073 is not of type (UNSIGNED-BYTE 32012-08-29 09:14:51
435740Developmentcommon-lispUNCONFIRMEDdev-lisp/asdf-binary-locations - uninstall should clean up /etc/gentoo-init.lisp2012-09-21 16:42:43
438188Developmentcommon-lispUNCONFIRMEDdev-lisp/clisp-2.48-r1 - fails to compile with ENOMEM, although there is plenty left2013-01-01 04:00:02
374471LibrarycppUNCONFIRMEDdev-libs/Ice-3.4.1 failed to install2011-07-09 03:07:07
381001UnspecifiedcppUNCONFIRMEDdev-libs/boost-1.46.1-r1 failes to build on arm2012-10-31 16:41:29
393595UnspecifiedcppUNCONFIRMEDdev-libs/Ice-3.4.2 failes to build on arm2012-10-20 10:20:55
409119ApplicationscppUNCONFIRMEDdev-libs/STLport-5.2.1 - Fatal error: can't create obj/gcc/so/dll_main.o: No such file or directory2012-03-21 09:41:23
389783Ebuildscommon-lispUNCONFIRMEDdev-lisp/clozurecl-1.7 fails to build (unquoted SVN_REVISION in generated compiler commands)2011-11-08 19:59:04
455418ServerclusterUNCONFIRMEDsys-cluster/libdlm-3.1.5 - In file included from .../work/cluster-3.1.5/dlm/libdlm/libdlm.c:21:0: /2013-02-05 12:39:44
455516Core systemclusterUNCONFIRMEDsys-fs/gfs2-utils with sys-kernel/hardened-sources-3.7.3 - In file included from conftest.c:84: /usr2013-02-08 16:35:19
380693Applicationscommon-lispUNCONFIRMEDdev-lisp/clisp-2.48 - hangs in ./lisp.run -B . -N locale -E UTF-8 -Epathname 1:1 -Emisc 1:1 -norc -m2011-08-28 21:49:06
452842ServerclusterUNCONFIRMEDsys-cluster/ceph: add udev rules for rbd devices2013-01-19 16:19:09
452378ServerclusterUNCONFIRMED>=sys-cluster/ceph-0.55.1 with dev-libs/boost-1.49 - In file included from mds/Dumper.cc:24: /usr/in2013-01-15 17:14:48
436218EbuildsclusterUNCONFIRMEDnet-misc/pssh with dev-lang/python-3.2 - pssh --help: ImportError: No module named version2013-01-04 06:31:50
412767Core systemclusterUNCONFIRMEDsys-block/lio-utils-9999 - python_pkg_setup() not called2012-06-18 20:39:15
405437ServerclusterUNCONFIRMEDsys-cluster/maui-3.3.1-r2 should CONFIG_PROTECT its configuration files2012-05-05 21:12:02
365713ApplicationsclusterUNCONFIRMEDsys-cluster/maui-3.3.1 - mismatching spool dir in different files2011-05-08 19:17:50
387623ApplicationsclusterUNCONFIRMEDsys-infiniband/opensm - Variables in /etc/init.d/opensm and /etc/conf.d/opensm do not match2011-10-19 12:06:50
449166ApplicationscjkUNCONFIRMEDapp-i18n/ibus-table-1.4.99 version bump2013-02-12 09:54:43
449132ApplicationschutzpahUNCONFIRMED>=app-admin/salt-0.11.0 does not install config template files2012-12-29 11:40:31
402891ApplicationscjkUNCONFIRMEDapp-i18n/uim-1.7.1-r1 doesn't honor LINGUAS for locale files2012-05-13 23:28:32
438986EbuildschutzpahUNCONFIRMEDapp-admin/salt-0.10.0 - error: file '.../work/impl_python3_2/salt-0.10.0/scripts/salt-master' does n2012-10-21 14:26:16
410293Keywording and StabilizationchutzpahUNCONFIRMEDStable request for www-plugins/mozplugger-1.14.32013-02-21 08:38:30
384617EbuildschainsawUNCONFIRMEDapp-emulation/dynamips fails to compile (w/ can't find a register in class 'GENERAL_REGS')2011-10-31 10:29:49
418461ApplicationscedkUNCONFIRMEDnet-im/bitlbee initscript should check pidfile2012-09-02 19:44:59
454740LibrarycardoeUNCONFIRMEDx11-drivers/nvidia-drivers-304.64 should not include udev rule to unconditionally load nvidia.ko (ev2013-02-02 16:50:24
442996ApplicationscardoeUNCONFIRMEDmedia-tv/mythtv - logging to a file in /etc/conf.d/mythbackend fails because of hard-wired /etc/ini2012-12-30 16:58:46
433102Core systemcardoeUNCONFIRMEDx11-drivers/nvidia-drivers - CONFIG_AMD_IOMMU causes kernel module to fail?2012-11-13 09:49:39
439540ApplicationscardoeUNCONFIRMEDapp-emulation/qemu fails to handle a usb serial port with a specific vendorid - qdev_prop_set: prope2013-02-10 17:43:13
383895Ebuildsc1pherUNCONFIRMEDapp-admin/gentoo-rsync-mirror file permission problem2012-07-04 17:48:16
403037Applicationsc1pherUNCONFIRMEDmedia-gfx/darktable-0.9.3 doesn't honor LINGUAS for locale files2012-02-23 21:38:44
438248ApplicationscalchanUNCONFIRMEDmedia-video/kino-1.3.4 generates XML DVD indices incompatible with media-video/dvdauthor-0.7.02012-10-15 10:52:33
457782BugzillabugzillaUNCONFIRMEDbugs.gentoo.org (mostly) inaccessible to bots2013-02-16 03:09:26
414049BugzillabugzillaUNCONFIRMEDwww-client/links - links2 has trouble adding extra files to bugs2012-05-03 14:50:59
426450BugzillabugzillaUNCONFIRMEDUsing "File a new bug" on the bugzilla search result page leads to a different bug entry form than "2012-07-13 13:41:26
431082BugzillabugzillaUNCONFIRMEDIt is not possible to set attachment type/patch flag in expert mode enter_bug2012-08-12 13:58:16
408049BugzillabugzillaUNCONFIRMEDplease make "auto select" a default for attachments2012-08-05 10:49:24
458594Applicationsbug-wranglersUNCONFIRMEDlibreoffice-bin: plain text files are opened by default using libreoffice writer, not gedit2013-02-21 14:20:01
458598Applicationsbug-wranglersUNCONFIRMED[media-gfx/asymptote-2.21] emerge failed with USE="doc latex"2013-02-21 14:49:39
458386ApplicationsbugsUNCONFIRMEDapp-admin/collectd-5.2.0 - Assert error in VSM_n_Arg(), [...]/work/varnish-3.0.3/lib/libvarnishapi/v2013-02-20 14:29:22
458544Librarybug-wranglersUNCONFIRMEDdev-tcltk/tcllib-1.15: Detected file collision(s)2013-02-21 08:19:27
458550Applicationsbug-wranglersUNCONFIRMEDmedia-libs/mesa-9.1_rc2 cannot compile2013-02-21 08:35:33
458554Applicationsbug-wranglersUNCONFIRMEDlibarchive-3.0.4-r1 and libarchive-3.1.1 fail compile when using gcc i686-pc-linux-gnu-4.5.4 but not2013-02-21 09:28:12
458578Applicationsbug-wranglersUNCONFIRMEDapp-misc/geneweb-5.02: Fatal error: OCaml and preprocessor have incompatible versions2013-02-21 12:27:58
444918FreeBSDbsdUNCONFIRMEDapp-arch/libarchive-3.0.4-r1 -- getvfsbyname failed error occurs, doesn't work in x86 chroot on amd62013-01-15 12:22:54
454508FreeBSDbsdUNCONFIRMEDfreebsd-rescue-9.1: Fail to link in environment that dev-util/pkgconfig-0.28 is installed.2013-01-29 11:31:19
427430FreeBSDbsdUNCONFIRMEDWhen using latest clang-3.1-r5, sys-freebsd/boot0-9.0/9.1_beta1 will fail to compile2012-11-25 11:39:35
390665FreeBSDbsdUNCONFIRMEDdev-libs/openssl-1.0.0 fails to compile on sparc-fbsd2012-03-19 06:50:59
393039FreeBSDbsdUNCONFIRMEDapp-misc/screen on Gentoo/FBSD9 - os.h:275:20: error: utmp.h: No such file or directory2012-12-04 00:53:30
393057FreeBSDbsdUNCONFIRMEDsys-freebsd/freebsd-lib-9.0 fails to compile on sparc-fbsd2011-12-03 18:20:02
394831FreeBSDbsdUNCONFIRMEDfreebsd9.0 profile for sparc2011-12-16 10:14:43
419515FreeBSDbsdUNCONFIRMED[keywordreq] dev-util/catalyst and deps compile on amd64-fbsd2012-06-19 23:44:29
235785FreeBSDbsdUNCONFIRMEDplease keyword mail-mta/exim ~x86-fbsd2012-05-31 17:09:04
447826Core systembluenessUNCONFIRMEDsys-kernel/hardened-sources-2.6.32-r143 fails to compile for ia64: include/linux/random.h:91:19: err2013-01-18 23:15:20
434916ApplicationsbluenessUNCONFIRMEDapp-admin/webapp-config, SELinux support: set 'server-owned' file as rw content2012-09-21 18:37:35
374505ApplicationsbluenessUNCONFIRMEDdev-util/gperf-3.0.4: compile error collect2: ld returned 1 exit status2012-02-04 01:23:02
401317ApplicationsbluenessUNCONFIRMEDnet-misc/curl-7.24.0: test cases failed: 1007 1009 1049 1093 1094 10992012-03-24 18:04:32
453500ApplicationsbircophUNCONFIRMEDapp-doc/root-docs-5.34.03 - Error: Function Open(filename,"RECREATE") is not defined in current scop2013-02-19 19:12:58
412699libbashbetelgeuseUNCONFIRMEDSet builtin implementation2012-04-19 21:58:38
410831libbashbetelgeuseUNCONFIRMEDRead builtin implementation2012-04-05 01:32:10
458290Core systembase-systemUNCONFIRMEDsys-apps/groff-1.21, sys-apps/man-1.6g: Japanese manpages illegible2013-02-21 02:51:56
458496Core systembase-systemUNCONFIRMEDsys-apps/util-linux-2.22.2 install fails with: unable to read SONAME from libmount.so2013-02-20 20:32:45
455988Core systembase-systemUNCONFIRMEDiproute2-3.3.0 USE=doc installs (useless) files into /usr/share/doc2013-02-07 14:15:33
455990Applicationsbase-systemUNCONFIRMEDapp-shells/bash=4.2_p37 - segfault when script aborted - *** glibc detected *** double free or corru2013-02-08 23:10:35
456906Core systembase-systemUNCONFIRMEDsys-block/open-iscsi iscsiadm fails with sh: /sbin/iscsid: No such file or directory2013-02-13 18:58:13
451622Core systembase-systemUNCONFIRMEDsys-apps/man-db-2.6.3-r1[nls]: Translated manpages will not be installed if app-text/po4a is not ins2013-01-15 12:05:38
452604Eclasses and Profilesbase-systemUNCONFIRMEDCPU_FEATURES: move USE="mmx sse etc..." CPU features to USE expanded variable2013-01-25 05:38:49
453098Core systembase-systemUNCONFIRMEDsys-devel/patch-2.7.1-r1: fails tests crlf-handling and need-filename2013-01-21 11:54:50
448906Miscbase-systemUNCONFIRMEDnet-firewall/iptables-1.4.16.3 upgrade does not preserve state matches2013-01-02 20:09:23
448268Core systembase-systemUNCONFIRMEDsys-apps/less-457 should use elog instead of einfo2012-12-24 08:32:38
447474Core systembase-systemUNCONFIRMEDsys-devel/make-3.82-r4 - fails 1 test in features/parallelism2012-12-17 16:10:34
447530Ebuildsbase-systemUNCONFIRMEDnet-firewall/iptables[netlink] - please add support for loading fingerprint definitions from pf.os f2013-02-16 14:09:37
445744Core systembase-systemUNCONFIRMEDsys-apps/hprofile - Add patch for improving init file.2012-12-04 15:09:20
444086Core systembase-systemUNCONFIRMEDsys-devel/flex-2.5.37 does hardcoded AR calls2012-12-21 18:33:27
439504Core systembase-systemUNCONFIRMEDnet-misc/ethercard-diag - command is called ether-wake but man page is called etherwake2012-10-24 15:15:54
436594Core systembase-systemUNCONFIRMED>=sys-apps/memtest86+-2.00 should make use of/document "console="2012-09-29 15:40:51
432652Applicationsbase-systemUNCONFIRMEDnet-misc/dhcp - dhclient (ipv6) not enabled for ppp devices2012-12-02 10:22:16
432454Applicationsbase-systemUNCONFIRMEDsys-block/open-iscsi - init script has problems with automatic mounting of iSCSI2012-10-22 16:22:50
431054Applicationsbase-systemUNCONFIRMEDnet-misc/icecast-2.3.3 USE=yp - libtool linker mangles CFLAGS ( x86_64-pc-linux-gnu-gcc: error: l1-c2012-08-12 20:10:16
426986Core systembase-systemUNCONFIRMEDsys-fs/cryptsetup-1.4.1: initscript ignores last line of conf. file2013-01-18 11:31:09
424862Core systembase-systemUNCONFIRMEDsys-apps/logwatch - please add support for postscreen postfix service from upstream patch2012-08-28 08:48:18
422877Core systembase-systemUNCONFIRMEDnet-firewall/iptables: ip6tables "state" test fails; will not jump to ACCEPT on ESTABLISHED,RELATED 2013-02-16 13:31:38
419529Applicationsbase-systemUNCONFIRMEDsys-libs/db-4.8.30 fails tests with no space left on device2012-06-04 10:55:39
418177Core systembase-systemUNCONFIRMEDsys-power/apcupsd-3.14.8-r1: apcupsd.powerfail init script runlevel check fails when shutting down2012-10-11 16:58:37
418287Core systembase-systemUNCONFIRMEDsys-boot/grub-0.97-r11 - Failed Running autoconf ! - configure.ac:59: error: possibly undefined macr2012-10-09 04:21:54
414857Core systembase-systemUNCONFIRMEDnet-firewall/iptables-1.4.12.1-r1 and -1.4.13: hack to use saner kernel-headers should be replaced b2013-02-16 14:07:42
413621Core systembase-systemUNCONFIRMEDsys-apps/coreutils-8.15 - src_test(): errors setting up rm/deep-2 and du/long-from-unreadable2012-11-20 03:30:47
410605Core systembase-systemUNCONFIRMEDsys-apps/util-linux-2.20-r1: fsck complains about checking file systems mounted ro2013-02-05 14:52:10
407329Keywording and Stabilizationbase-systemUNCONFIRMEDplease stabilize sys-process/runit-2.*2012-03-07 20:54:07
399491Core systembase-systemUNCONFIRMEDsys-devel/automake-1.11.2-r1 - fails py-compile-basic.test py-compile-basic2.test py-compile-basedir2012-02-06 11:51:29
401501Core systembase-systemUNCONFIRMEDapp-admin/sysklogd-1.5-r2: syslogd: /var/log/news/news.crit: No such file or directory2012-02-05 15:19:16
401849Keywording and Stabilizationbase-systemUNCONFIRMEDPlease stabilize =sys-libs/libraw1394-2.0.72012-04-16 06:43:02
402245Core systembase-systemUNCONFIRMEDsys-fs/dosfstools-3.0.12 dosfslabel does not work if long file names are used in partition2013-01-23 19:12:35
395475Core systembase-systemUNCONFIRMEDsys-devel/libtool-2.4.2 fails tests: 8 failed (5 expected failures).2012-05-23 17:17:13
395537Core systembase-systemUNCONFIRMEDsys-process/procps doesn't prints cgroups correctly (systemd releated)2012-01-24 20:57:29
393201Core systembase-systemUNCONFIRMEDsys-boot/grub-0.97-r10 has a typo in the grub-set-default utility and configuration files2011-12-05 12:38:16
386565Ebuildsbase-systemUNCONFIRMEDsys-devel/libtool-2.4-r1: failed (emake failed)2011-10-11 05:39:18
390245Core systembase-systemUNCONFIRMEDsys-fs/mtools-4.0.15 - mcd fails to mount SD memory card (with all available (tested) card readers)2011-11-20 07:19:18
390829Ebuildsbase-systemUNCONFIRMEDsys-fs/multipath-tools-0.4.8-r1: Problem with init.d script2011-11-17 15:55:55
367553Core systembase-systemUNCONFIRMEDnet-misc/openssh - sshd sessions don't get killed when system goes down or reboots2013-02-11 16:00:41
368835Core systembase-systemUNCONFIRMEDapp-admin/sysklogd - no way to disable startup of klogd when sysklogd is used in a vserver2011-05-31 23:48:08
365263Core systembase-systemUNCONFIRMEDsys-apps/less - auto convert UTF16/UTF32 inputs to active encoding2011-05-02 01:45:04
409641DevelopmentaraujoUNCONFIRMEDdev-lang/io-2009.01.02-r2: Uncomment the IO_USE_SIMD define to turn on SIMD acceleration2012-12-24 08:55:55
368997Ebuildsarmin76UNCONFIRMEDnet-misc/tightvnc: /etc/ini.d/vnc failes to start when media-fonts/font-misc-misc is installed with 2012-06-23 17:45:55
374901Applicationsarmin76UNCONFIRMED[embedded-cross overlay] dev-python/pyxml-0.8.4-r2: multiple Python ABIs in EAPI <=2 is deprecated a2011-11-05 18:47:19
427572Applicationsapp-backupUNCONFIRMEDapp-backup/boxbackup - man pages are installed in /usr/man2012-07-24 14:08:07
429564ApplicationsangelosUNCONFIRMEDgnome-extra/docky-2.1.4 compile error with mono 2.11.12012-09-11 06:58:49
458416ApplicationsangelosUNCONFIRMEDnet-wireless/ndiswrapper-1.58_rc1 with sys-kernel/vanilla-sources-3.8.0 - [...]/work/ndiswrapper-1.52013-02-20 14:35:53
380341Applicationsapp-backupUNCONFIRMEDapp-backup/cdbkup-1.0-r1: make jobserver unavailable2011-08-25 14:00:21
411861Ebuildsapp-backupUNCONFIRMEDapp-backup/backuppc-3.2.1-r1 needs several apache modules: ebuild should enforce that2012-04-14 05:51:11
436596Applicationsandrej.filipcicUNCONFIRMEDnet-fs/openafs-1.6.1-r1: parallel build failure - In file included from db_dump.c:31:0: database.h:12012-09-29 15:38:55
412119Ebuildsandrej.filipcicUNCONFIRMEDnet-fs/openafs-1.6.1 should install user-friendly docs (and not docbook files)2012-09-24 06:59:46
432410FreeBSDamd64-fbsdUNCONFIRMED[keywordreq] some packages compile and works on amd64-fbsd2012-11-09 11:06:06
444808Applicationsandreis.vinogradovsUNCONFIRMEDapp-misc/hivex-1.3.6-r2 USE=ruby - rake aborted! / / cannot load such file -- rake/rdoctask2012-12-05 04:45:09
380959OtheraltUNCONFIRMEDapp-arch/dpkg: failed to compile on Mac OSX2011-10-08 16:59:55
384401OtheraltUNCONFIRMEDapp-text/texlive-core-2011-r4: failed to compile on prefix/Mac OSX2011-09-25 06:48:07
452734OtheraltUNCONFIRMEDwww-client/firefox-18.0-r1 fails to build (prefix) - fatal error: jemalloc.h: No such file or direct2013-01-29 19:41:01
409701Libraryamd64UNCONFIRMEDPlease include sys-auth/sssd nss libraries into emul-linux-x86-baselibs2013-01-26 07:48:37
414549Libraryamd64UNCONFIRMEDapp-emulation/emul-linux-x86-*; support for running PCSX2 32-bit released binary (or own)2012-07-18 15:48:39
417191Ebuildsamd64UNCONFIRMEDapp-emulation/emul-linux-x86-gtklibs-20120520 needs pax marking - gtk-query-immodules-2.0-32: error 2012-12-12 16:42:02
380957OtheraltUNCONFIRMEDdev-libs/newt: failed to compile on Mac OSX2011-09-13 15:59:04
438844Applicationsalsa-bugsUNCONFIRMEDmedia-sound/alsa-utils[pulseaudio]: alsasound init.d script generates pulse state files in /2012-12-16 03:05:14
433455Applicationsalsa-bugsUNCONFIRMEDAlsa Master Volume between 0% and 16% not possible on intel hda2012-09-10 12:32:04
454596ApplicationsalexxyUNCONFIRMEDwww-apps/rutorrent-3.4-r1 - ebuild fault: file '/usr/share/webapps/rutorrent/3.4-r1/htdocs/share/set2013-01-29 23:02:40
402303Applicationsalsa-bugsUNCONFIRMEDmedia-sound/alsa-utils-1.0.25 doesn't honor LINGUAS for locale files2012-02-23 21:38:44
383605Core systemalsa-bugsUNCONFIRMEDmedia-libs/alsa-lib-1.0.23 crash when compiled with sys-devel/gcc-4.4.5 / -O32011-09-20 16:11:19
369327Applicationsalsa-bugsUNCONFIRMEDNo sound with Poulsbo HD Audio Controller2011-06-01 14:12:24
451824ApplicationsalexxyUNCONFIRMEDsci-chemistry/vmd-1.9.1-r2 with tcl/tk-8.6 break g(r) analysis module2013-01-17 20:52:47
431990EbuildsalexxyUNCONFIRMEDnet-wireless/wimax-tools-1.4.5-r1 should have dev-libs/libnl in RDEPEND2013-01-01 21:47:54
431988EbuildsalexxyUNCONFIRMEDnet-wireless/wimax-1.5.2-r1 should not RDEPEND on sys-kernel/linux-headers2013-01-01 21:48:39
431920EbuildsalexxyUNCONFIRMEDnet-wireless/wimax-1.5.2-r1 installs /var/log/wimax with mode 7772013-01-01 21:49:31
427496ApplicationsalexxyUNCONFIRMEDnet-wireless/wimax-1.5.2-r1 with net-wireless/wpa_supplicant-1.0 USE=wimax - undefined reference to 2013-01-05 12:47:50
432224ApplicationsaleUNCONFIRMEDapp-admin/keepass - windows and dialogs have scrambled fonts2013-01-15 16:09:02
392727DevelopmentadaUNCONFIRMEDdev-lang/gnat-gcc-4.3.5: fetch failed missing gnatboot-4.3-amd64.tar.bz22012-02-03 18:23:19
440660Eclasses and ProfilesadaUNCONFIRMEDgnatbuild.eclass: /etc/ada/primary_compilers: No such file or directory2012-10-31 21:52:05
449716ApplicationsaballierUNCONFIRMEDnet-nntp/hellanzb.0.13-r8 - hellanzb.py: ImportError: cannot import name _NO_FILENO2013-01-02 10:57:50
449202Keywording and StabilizationaballierUNCONFIRMED=app-text/ps2pkm-1.5_p20120701: please stabilize2012-12-29 15:32:06
439844EbuildsaballierUNCONFIRMEDmedia-libs/stk-4.4.4 - In file included from RtAudio.cpp:6750:0: include/soundcard.h:106:28: fatal e2013-01-23 16:33:32
449200Keywording and StabilizationaballierUNCONFIRMED=dev-libs/kpathsea-6.1.0_p20120701: please stabilize2013-02-17 13:11:18
431774LibraryaballierUNCONFIRMEDdev-ml/lwt-2.4.0 USE=doc - File "src/text/lwt_text.mli", line 48, characters 41-51: Error: Unbound m2012-08-18 15:06:00
437728Core systema3liUNCONFIRMEDsys-boot/plymouth - static archives (*.a) and libtool library files (*.la) do not belong in /2012-11-15 22:53:53
333285Toolstools-portageUNCONFIRMEDapp-portage/gentoolkit: revdep-rebuild: add variable to make.conf default emerge options for revdep-2013-01-18 16:29:12
399739Libraryrobbat2UNCONFIRMEDdev-db/libdbi-drivers-0.8.3 fails to return column information for empty sqlite3 table2012-10-26 16:54:27
421849UnspecifiedramerethUNCONFIRMEDdev-vcs/gitolite and dev-vcs/gitolite-gentoo - gl-setup fails:Unsuccessful stat on filename containi2012-06-28 20:12:53
346251ApplicationspdaUNCONFIRMEDapp-pda/gtkpod: normalize volume doesn't work for .mp3 files with ApeV2 tags2013-01-11 16:10:10
209617OpenRCopenrcUNCONFIRMEDsys-apps/openrc-0.8.2-r1: user should be able to interrupt service start/stop pressing Ctrl+C2013-02-18 09:41:51
446696Applicationsnet-fsUNCONFIRMEDrevdep-rebuild selectes net-fs/ncpfs - QA Notice: Missing soname symlink(s): usr/lib/libncp.so.2.3 2012-12-10 20:02:00
52076Applicationsnet-mailUNCONFIRMEDdefault maildir location configuration variable2012-03-16 14:33:21
366875Ebuildsmaintainer-wantedUNCONFIRMED[new package] sys-fs/gdatafs - Gdatafs is a FUSE implemtation that mount picassa web and youtube to 2011-12-08 06:16:16
370099Ebuildsmaintainer-neededUNCONFIRMEDmedia-sound/line6usb kernel sources accessed through /lib/modules/`uname -r`2012-12-01 08:18:42
373039EbuildslackUNCONFIRMEDx11-plugins/gkrellmss — gkrellmss.h:23:30: fatal error: gkrellm2/gkrellm.h: No such file or director2011-07-03 16:43:54
127411ApplicationslaniusUNCONFIRMEDscreen and Midnight Commander don't work on a serial console2011-04-20 11:10:20
369923GamesgamesUNCONFIRMEDgames-action/trine-bin Filesize does not match recorded size2011-06-03 17:20:29
383363UnspecifiedbilllUNCONFIRMEDmedia-video/ogmrip-0.13.6 needs threads patch to enable multithreading2011-09-19 18:57:43
327585Eclasses and ProfilesarmUNCONFIRMEDUnmask 'dvb' USE-flag for ARM profiles2011-03-25 23:42:18
436916Keywording and Stabilizationbase-systemUNCONFIRMEDsys-boot/lilo-22.8-r2: Fatal: Setup length exceeds 31 maximum; kernel setup will overwrite boot load2013-01-27 14:59:32
339725EbuildsaballierUNCONFIRMEDmedia-sound/lmms fails to build remote_vst_plugin: winebuild: as --32 failed with status 12011-04-19 16:10:52
434536Core systemtools-portageUNCONFIRMEDapp-portage/gentoolkit: revdep-rebuild doesn't handle USE=multislot2013-01-28 11:04:57
457104KernelsecurityUNCONFIRMEDDriver of cypress corrupts file-system and partition table of external hard drives with M6116 SATA B2013-02-14 15:53:16


back
Please read "Why adblockers are bad".



other Ads
Trace My Cash
Wenn Sie sich schon immer mal gefragt haben, wo eigentlich Ihr geliebtes Bargeld geblieben ist, finden Sie hier vielleicht die Antwort.
www.tracemycash.com
Other free services
toURL.org
Shorten long
URLs to short
links like
http://tourl.org/2
tourl.org
.
Reverse DNS lookup
Find out which hostname(s)
resolve to a
given IP or other hostnames for the server
www.reversednslookup.org

New Packages

- as rdf newsfeed
- as rss newsfeed
- as Atom newsfeed
2017-07-24
asciidoctor - 1.5.6.1
Ebuild name:

dev-ruby/asciidoctor-1.5.6.1

Description

Processor for converting AsciiDoc into HTML 5, DocBook 4.5 and other f

Added to portage

2017-07-24

gparted - 0.28.1
Ebuild name:

sys-block/gparted-0.28.1

Description

Gnome Partition Editor

Added to portage

2017-07-24

icinga2 - 2.6.3-r1
Ebuild name:

net-analyzer/icinga2-2.6.3-r1

Description

Distributed, general purpose, network monitoring engine

Added to portage

2017-07-24

libgdata - 0.17.8-r1
Ebuild name:

dev-libs/libgdata-0.17.8-r1

Description

GLib-based library for accessing online service APIs using the GData pr

Added to portage

2017-07-24

libpipeline - 1.4.2
Ebuild name:

dev-libs/libpipeline-1.4.2

Description

a pipeline manipulation library

Added to portage

2017-07-24

mips-sources - 4.11.12
Ebuild name:

sys-kernel/mips-sources-4.11.12

Description

Linux-Mips GIT sources for MIPS-based machines, dated 20170513

Added to portage

2017-07-24

mips-sources - 4.12.3
Ebuild name:

sys-kernel/mips-sources-4.12.3

Description

Linux-Mips GIT sources for MIPS-based machines, dated 20170703

Added to portage

2017-07-24

mips-sources - 4.4.78
Ebuild name:

sys-kernel/mips-sources-4.4.78

Description

Linux-Mips GIT sources for MIPS-based machines, dated 20160123

Added to portage

2017-07-24

mips-sources - 4.9.39
Ebuild name:

sys-kernel/mips-sources-4.9.39

Description

Linux-Mips GIT sources for MIPS-based machines, dated 20161216

Added to portage

2017-07-24

mysql-init-scripts - 2.2
Ebuild name:

dev-db/mysql-init-scripts-2.2

Description

Gentoo MySQL init scripts.

Added to portage

2017-07-24

nagios-syntax - 1.8
Ebuild name:

app-vim/nagios-syntax-1.8

Description

vim plugin Nagios configuration files syntax

Added to portage

2017-07-24

nettle - 3.3-r2
Ebuild name:

dev-libs/nettle-3.3-r2

Description

Low-level cryptographic library

Added to portage

2017-07-24

openvswitch - 2.7.2
Ebuild name:

net-misc/openvswitch-2.7.2

Description

Production quality, multilayer virtual switch

Added to portage

2017-07-24

rstudio - 1.0.153
Ebuild name:

sci-mathematics/rstudio-1.0.153

Description

Added to portage

2017-07-24

serd - 0.28.0
Ebuild name:

dev-libs/serd-0.28.0

Description

Library for RDF syntax which supports reading and writing Turtle and NTriples

Added to portage

2017-07-24

virt-what - 1.15
Ebuild name:

app-emulation/virt-what-1.15

Description

Detects if the current machine is running in a virtual machine

Added to portage

2017-07-24

2017-07-23
awesome - 4.2
Ebuild name:

x11-wm/awesome-4.2

Description

A dynamic floating and tiling window manager

Added to portage

2017-07-23

bluray_info - 1.0.0
Ebuild name:

media-video/bluray_info-1.0.0

Description

Display information about a Blu-ray disc

Added to portage

2017-07-23

canfep - 1.0-r1
Ebuild name:

app-i18n/canfep-1.0-r1

Description

Canna Japanese kana-kanji frontend processor on console

Added to portage

2017-07-23

cura - 2.6.0
Ebuild name:

media-gfx/cura-2.6.0

Description

A 3D model slicing application for 3D printing

Added to portage

2017-07-23

curaengine - 2.6.0
Ebuild name:

media-gfx/curaengine-2.6.0

Description

A 3D model slicing engine for 3D printing

Added to portage

2017-07-23

eselect-ruby - 20170723
Ebuild name:

app-eselect/eselect-ruby-20170723

Description

Manages multiple Ruby versions

Added to portage

2017-07-23

ghc - 8.2.1
Ebuild name:

dev-lang/ghc-8.2.1

Description

The Glasgow Haskell Compiler

Added to portage

2017-07-23

im-canna - 0.3.2.2-r1
Ebuild name:

app-i18n/im-canna-0.3.2.2-r1

Description

Japanese Canna input method module for GTK+2

Added to portage

2017-07-23

im-chooser - 1.7.0
Ebuild name:

app-i18n/im-chooser-1.7.0

Description

Desktop Input Method configuration tool

Added to portage

2017-07-23

im-freewnn - 0.0.2-r3
Ebuild name:

app-i18n/im-freewnn-0.0.2-r3

Description

Japanese FreeWnn input method module for GTK+2

Added to portage

2017-07-23

imsettings - 1.7.2
Ebuild name:

app-i18n/imsettings-1.7.2

Description

Delivery framework for general Input Method configuration

Added to portage

2017-07-23

kdelibs - 4.14.34
Ebuild name:

kde-frameworks/kdelibs-4.14.34

Description

Libraries needed for programs by KDE

Added to portage

2017-07-23

libarcus - 2.6.0
Ebuild name:

dev-libs/libarcus-2.6.0

Description

This library facilitates communication between Cura and its backend

Added to portage

2017-07-23

mbedtls - 2.5.2
Ebuild name:

net-libs/mbedtls-2.5.2

Description

Cryptographic library for embedded systems

Added to portage

2017-07-23

memcached - 1.5.0
Ebuild name:

net-misc/memcached-1.5.0

Description

High-performance, distributed memory object caching system

Added to portage

2017-07-23

meson - 0.41.2
Ebuild name:

dev-util/meson-0.41.2

Description

Open source build system

Added to portage

2017-07-23

mkvtoolnix - 13.0.0-r1
Ebuild name:

media-video/mkvtoolnix-13.0.0-r1

Description

Tools to create, alter, and inspect Matroska files

Added to portage

2017-07-23

mlterm - 3.8.2
Ebuild name:

x11-terms/mlterm-3.8.2

Description

A multi-lingual terminal emulator

Added to portage

2017-07-23

nagios-plugins - 2.2.1
Ebuild name:

net-analyzer/nagios-plugins-2.2.1

Description

Official plugins for Nagios

Added to portage

2017-07-23

rr - 1.2.1
Ebuild name:

dev-ruby/rr-1.2.1

Description

A double framework featuring a selection of double techniques and a terse syntax

Added to portage

2017-07-23

ruby - 2.2.7-r3
Ebuild name:

dev-lang/ruby-2.2.7-r3

Description

An object-oriented scripting language

Added to portage

2017-07-23

ruby - 2.3.4-r3
Ebuild name:

dev-lang/ruby-2.3.4-r3

Description

An object-oriented scripting language

Added to portage

2017-07-23

ruby_parser - 3.10.1
Ebuild name:

dev-ruby/ruby_parser-3.10.1

Description

A ruby parser written in pure ruby

Added to portage

2017-07-23

spotify - 1.0.59
Ebuild name:

media-sound/spotify-1.0.59

Description

Spotify is a social music platform

Added to portage

2017-07-23

uranium - 2.6.0
Ebuild name:

dev-python/uranium-2.6.0

Description

A Python framework for building 3D printing related applications

Added to portage

2017-07-23

vim-spell-de - 20080213-r1
Ebuild name:

app-vim/vim-spell-de-20080213-r1

Description

Added to portage

2017-07-23

rdf newsfeed | rss newsfeed | Atom newsfeed
- Powered by LeopardCMS - Running on Gentoo -
Copyright 2004-2017 Sascha Nitsch Unternehmensberatung UG(haftungsbeschänkt)
Valid XHTML1.1 : Valid CSS : buttonmaker
- Level Triple-A Conformance to Web Content Accessibility Guidelines 1.0 -
- Copyright and legal notices -
Time to create this page: 14.0 ms
system status display