from small one page howto to huge articles all in one place

search text in:




Other .linuxhowtos.org sites: www.linuxhowtos.org
toolsntoys.linuxhowtos.org



Last additions:
How to make X listen on port 6000

How to make X listen on port 6000

words:

34

views:

89606

userrating:

average rating: 1.2 (52 votes) (1=very good 6=terrible)


May, 25th 2007:
April, 26th 2007:
Apr, 10th. 2007:
Druckversion . pdf icon
You are here: Portage


Details of app-arch/par:

available versions:

releasesalphaamd64armhppaia64mipsppcppc64ppc macoss390shsparcx86USE-Flagsdependenciesebuild warnings
Legend:
+ stable
~ testing
- not available
some ebuild warning depend on specific use-flags or architectures, all ebuild-warnings are shown.

Known bugs:
bug IDcomponentassigned tostatusdescriptionlast change
368731ApplicationsgnomeUNCONFIRMEDx11-libs/gdk-pixbuf-2.22.1: parallel install fails sometimes2012-01-30 10:16:01
368847Ebuildsmaintainer-wantedUNCONFIRMEDnet-proxy/andiparos ebuild request2011-05-27 08:47:21
373845Librarymaintainer-wantedUNCONFIRMEDdev-perl/PAR-Packer: new package2011-07-03 16:26:29
374149DevelopmentperlUNCONFIRMEDMoose-2.1.0 conflicts with all existent versions of File-ChangeNotify, MooseX-Params-Validate, and M2011-07-10 03:47:03
378645DevelopmentperlUNCONFIRMEDdev-perl/math-pari ignores profile, and fails when compiling on2011-08-20 17:10:38
381279Servernet-imUNCONFIRMEDnet-im/jabberd2-2.2.4: error: XML parse error (not well-formed (invalid token)) in c2s log for some 2012-10-20 06:45:03
382631Ebuildsmaintainer-wantedUNCONFIRMEDNew ebuild: dev-perl/HTML-StripScripts-Parser2011-09-13 20:33:24
383699ApplicationslackUNCONFIRMEDx11-plugins/screenlets-0.1.2 some parts depend on gconf-python2011-09-20 04:04:24
384137EbuildsperlUNCONFIRMEDdev-perl/Inline-0.480.0: fails tests with parallel make2011-09-27 16:26:48
384309Keywording and StabilizationperlUNCONFIRMEDadd ~sparc keyword for dev-perl/Crypt-PasswdMD52011-09-27 22:38:41
386019ApplicationsgraphicsUNCONFIRMEDmedia-gfx/openclipart-2.3 version bump2012-06-19 16:44:15
390665FreeBSDbsdUNCONFIRMEDdev-libs/openssl-1.0.0 fails to compile on sparc-fbsd2012-03-19 06:50:59
393057FreeBSDbsdUNCONFIRMEDsys-freebsd/freebsd-lib-9.0 fails to compile on sparc-fbsd2011-12-03 18:20:02
393391KDEvoyageurUNCONFIRMED[kde overlay] kde-base/katepart-9999 fails to compile with sys-devel/dragonegg-3.02012-09-28 13:05:52
394831FreeBSDbsdUNCONFIRMEDfreebsd9.0 profile for sparc2011-12-16 10:14:43
395801Applicationsmedia-videoUNCONFIRMEDmedia-video/libav-0.8_pre20111222 produces white noise with part of some music files2012-03-08 07:44:03
396179ApplicationspatrickUNCONFIRMEDdev-lang/nqp-2011.10 - /usr/bin/parrot: symbol lookup error: dynext/nqp_group.so: undefined symbol: 2011-12-27 21:15:43
396353Prefix SupportnetmonUNCONFIRMEDnet-analyzer/nmap fails with LDFLAGS="-Wl,--as-needed" on sparc64-solaris2013-01-15 17:08:42
398961Ebuildsnet-imUNCONFIRMEDnet-im/pidgin-2.10.1: please separate dbus-python dependency into a USE-flag2013-01-01 23:11:04
400721Installation Handbookdocs-teamUNCONFIRMEDPart about bonding should be reworked2012-09-05 11:11:12
402245Core systembase-systemUNCONFIRMEDsys-fs/dosfstools-3.0.12 dosfslabel does not work if long file names are used in partition2013-01-23 19:12:35
403119Core systembase-systemUNCONFIRMEDReplace sys-apps/microcode-data with a separate sys-kernel/intel-ucode2013-01-01 21:57:37
403249Core systembase-systemUNCONFIRMEDsys-apps/coreutils-8.14: Fails test-parse-datetime (exit: 134)2012-03-29 07:20:53
403283GNOMEgnomeUNCONFIRMEDgnome-base/gdm-3.2.1.1-r2 partially loads2013-01-22 22:52:56
405855Keywording and StabilizationjerUNCONFIRMEDx11-terms/rxvt-unicode-9.15 USE=-xft disables background transparency?2012-06-02 15:58:37
406583ApplicationschithanhUNCONFIRMEDwww-plugins/lightspark-0.5.4.1-r1 build fails - error regarding some ffmpeg stuff (?)2012-03-03 01:49:39
406895Ebuildsmaintainer-wantedUNCONFIRMEDmedia-gfx/psdparse-9999 - tools to parse Photoshop PSD/PSB format files2012-03-06 14:26:15
406937Ebuildsmaintainer-wantedUNCONFIRMEDdev-libs/rapidxml-1.13 - an attempt to create the fastest XML parser possible2012-03-05 20:41:21
407169Ebuildsfreedesktop-bugsUNCONFIRMEDsys-fs/udisks-1.0.4-r2 - file:///etc/xml/docbook:1: parser make[3]: *** [udisks.7] Fehler 4 parser e2012-10-03 07:06:31
408139Core systembase-systemUNCONFIRMEDsys-fs/mdadm-3.2.1 sends ioctl 1261 (BLKFLSBUF) to partition when displaying array details2012-11-11 22:39:56
409181Applicationsrobbat2UNCONFIRMEDapp-misc/g15stats - script does not parse extra options2013-01-31 19:03:48
409571Ebuildsmaintainer-wantedUNCONFIRMEDapp-vim/rainbow_paranthsis - assigns each pair of parentheses a different colour2012-03-24 17:42:11
410037Core systemmaintainer-neededUNCONFIRMEDsys-power/cpufreqd config parser prevents usage of multi-cpu profile support2012-11-18 12:15:58
410065ServererasUNCONFIRMEDnet-mail/dovecot-2.1.3 fails at parallel make: fatal error: ../../../src/plugins/quota/rquota.h: No 2012-07-12 15:51:16
410339Ebuildsmaintainer-wantedUNCONFIRMEDnew ebuild: net-libs/http-parser2012-12-20 09:45:17
411099GamesgamesUNCONFIRMEDgames-simulation/tpt_merbo-1.0 - A mod of The Powder Toy, a particle simulator2012-04-07 15:00:08
411471ServerpatrickUNCONFIRMEDapp-admin/apache-tools-2.2.22 fails on '--param keyword=value' in CFLAGS2013-02-16 13:33:09
411515Ebuildsmaintainer-wantedUNCONFIRMEDdev-util/peg - tools for generating recursive-descent parsers.2012-06-30 09:24:16
411815OpenRCopenrcUNCONFIRMEDsys-apps/openrc-0.9.8.4 does not install ethtool_ring and txqueuelen params for network cards in bon2012-05-05 17:48:36
412217LibrarysoundUNCONFIRMEDdev-libs/redland-1.0.15 has malformed Makefile, won't emerge: "missing separator"2012-04-16 17:47:14
413467Applicationspolynomial-cUNCONFIRMEDapp-emulation/virtualbox-4.1.12: parallel build sometimes fails2013-01-07 06:25:45
415367ApplicationsopenofficeUNCONFIRMEDapp-office/libreoffice selecting part of a file name does not work when using "LibreOffice file dial2012-05-10 13:37:24
415829Ebuildsmaintainer-wantedUNCONFIRMEDsci-chemistry/cclib-1.0.1 - Library for parsing and interpreting the results of computational chemis2012-05-15 15:01:01
416903ApplicationslivecdUNCONFIRMEDsys-block/parted-3.1 fails tests [t8001-loop-blkpg.sh t2100-zerolen.sh]2012-05-21 14:59:50
417365OpenRCopenrcUNCONFIRMEDsys-apps/openrc: parameter "-1" passed to dhclient, causing dhclient not to retry when failing2012-12-07 11:49:41
418007DevelopmentmaksbotanUNCONFIRMEDdev-python/scrapy-0.14.4 fails in setup while parsing urlparse_monkeypatches.py2012-06-14 16:40:49
418195Ebuildsmaintainer-wantedUNCONFIRMEDsci-misc/hets - the Heterogeneous Tool Set, a parsing, static analysis and proof management tool2012-05-30 12:49:44
418211Ebuildsmaintainer-wantedUNCONFIRMEDsys-process/xjobs - reads job descriptions line by line and executes them in parallel2012-06-01 14:23:50
418285Ebuildsmaintainer-wantedUNCONFIRMEDmedia-libs/dcmtk - DCMTK - a collection of libraries and applications implementing large parts the D2012-05-30 18:44:00
419685ServererasUNCONFIRMED=net-proxy/squid-3.1.19: eautoreconf in src_prepare() fails in libltdl/2013-01-08 02:24:49
419963DevelopmentperlUNCONFIRMEDdev-lang/perl-5.16.0 should PDEPEND virtual/perl-ExtUtils-ParseXS2012-06-07 02:24:27
421677JavajavaUNCONFIRMEDdev-java/ant-commons-net-1.8.4 - *** Semantic Error: The abstract method "int compareTo(java.lang.Ob2012-06-19 02:39:45
423399EbuildssciUNCONFIRMEDsci-libs/parmetis-3.2.0: fails tests2012-09-25 10:57:08
424445GamesgamesUNCONFIRMEDufo-ai-2.4 fails with Com_EParseValue: Illegal color statement '1 .874 .294 1'2012-08-02 20:55:27
425682Enhancement/Feature Requestsdev-portageUNCONFIRMEDTrue parallel fetch for each job running2012-07-14 20:37:13
426338genkernelgenkernelUNCONFIRMEDgenkernel 3.4.24_p2: missing separator between old and new kernel version2012-12-03 20:03:30
426358Core systembase-systemUNCONFIRMEDsys-block/partimage server crashes with pthread error when client attempts to download image2012-07-18 00:00:36
426444ApplicationsemacsUNCONFIRMEDapp-editors/emacs-23.4-r3 fails to build in parallel (--jobs=64)2012-07-18 15:26:44
427768ApplicationsgstreamerUNCONFIRMEDmedia-plugins/gst-plugins-ffmpeg-0.10.13-r2 - gstffmpegutils.c:42:40: error: parameter 1 ('smp_fmt')2012-07-24 15:31:30
428138ApplicationsjdhoreUNCONFIRMEDwww-client/seamonkey-bin-2.10.1: png icon has no transparency2012-07-26 17:38:00
429646GamesreavertmUNCONFIRMEDdev-games/openscenegraph-3.0.1 with sys-devel/clang-3.1 - error: cannot initialize a parameter of ty2012-08-04 00:29:11
429674Libraryamd64UNCONFIRMEDapp-emulation/emul-linux-x86-medialibs: move media-libs/faac to a separate package due to license "i2012-11-02 18:16:56
430102Unclassifieddev-portageUNCONFIRMEDEmerging in a deleted directory outputs lots of "getcwd: cannot access parent directories: No such f2012-08-21 00:22:33
430190Coredev-portageUNCONFIRMEDSlot conflict because of "no parents that aren't satisfied by other packages in this slot"2012-08-07 14:41:13
430938KDEkdeUNCONFIRMEDkde-base/plasma-workspace-4.8.5 fails with parallel build: fatal error: ui_killrunner_config.h: No s2012-10-24 16:55:05
431912InstallCDreleaseUNCONFIRMEDinstall-x86-minimal-20120710.iso - boot hangs while looking for cdrom when encounters swap partition2013-02-21 02:38:59
433003LibrarypythonUNCONFIRMEDdev-libs/libxml2 - File "/usr/lib/python2.7/xml/sax/__init__.py", line 93, in make_parser raise 2012-09-09 04:48:34
433070KDEkdeUNCONFIRMEDapp-editors/kile-2.1.2-r1 - index.docbook:124: parser error : Entity 'ged.vertaald' not defined2013-02-17 22:53:14
435690Applicationsmysql-bugsUNCONFIRMEDdev-db/mysql-5.1.62-r1 - Makefile:186: *** missing separator. Stop.2013-02-04 23:51:03
436448Applicationsdesktop-miscUNCONFIRMEDx11-misc/parcellite-1.0.2_rc5 generates too many interrupts (as seen in powertop)2012-10-08 19:44:07
436596Applicationsandrej.filipcicUNCONFIRMEDnet-fs/openafs-1.6.1-r1: parallel build failure - In file included from db_dump.c:31:0: database.h:12012-09-29 15:38:55
437446ApplicationsgraphicsUNCONFIRMEDmedia-gfx/nip2-7.26.4 - parser.h:57:12: error: conflicting types for ‘yyleng’ lex.c:275:11: note: pr2013-02-16 13:23:10
437494Core - Interface (emerge)dev-portageUNCONFIRMEDProvide a parameter for emerge so that 'emerge -pv' can display package description along with other2012-10-08 19:09:40
437704Applicationsmedia-videoUNCONFIRMEDmedia-video/gpac-0.4.5-r5: wxOsmo4.o: undefined reference to symbol 'gtk_widget_get_parent_window'2012-10-09 15:40:38
441862ApplicationsalexxyUNCONFIRMEDsys-apps/gptfdisk-0.8.5 - In function `GPTPart::GetDescription()': gptpart.cc:(.text+0x179): undefin2013-02-12 11:55:19
442222Ebuildsmaintainer-wantedUNCONFIRMEDdev-libs/thrust - a parallel algorithms library which resembles the C++ Standard Template Library2012-11-07 17:53:54
442320InstallCDreleaseUNCONFIRMEDinstall-cd (sparc) - errors at boot2012-12-16 05:42:05
442662Ebuildsmysql-bugsUNCONFIRMEDdev-db/mysql-connector-c++ - Output from mysql_config is parsed in in ugly way.2012-11-19 15:55:25
446142EbuildsmattschUNCONFIRMEDnet-misc/openconnect-4.07 - after 30 minutes the VPN reconnects but only has a partially working con2013-01-09 13:33:21
446198Ebuildsmaintainer-wantedUNCONFIRMEDdev-python/python-xcaplib-1.0.17 - Client for managing full or partial XML documents on XCAP servers2012-12-06 21:23:53
446204Core systemvapierUNCONFIRMEDsys-devel/crossdev: cross-emerge: support multiple parallel SYSROOTs for a single target2012-12-06 22:15:24
447006Enhancement/Feature Requestsportage-utilsUNCONFIRMEDapp-portage/portage-utils' "qgrep" should parse multiple args over entire file for broader search re2012-12-12 17:20:02
447044Ebuildsmaintainer-wantedUNCONFIRMEDdev-perl/Parse-DebianChangelog - Parse Debian changelogs and output them in other formats2012-12-26 21:51:22
447064ApplicationssgmlUNCONFIRMEDapp-text/build-docbook-catalog - file:///etc/xml/docbook:1: parser error : Document is empty2012-12-13 16:31:25
447474Core systembase-systemUNCONFIRMEDsys-devel/make-3.82-r4 - fails 1 test in features/parallelism2012-12-17 16:10:34
447502LibrarysciUNCONFIRMEDdev-python/numpy-1.6.2 - FAIL: test_pareto (test_random.TestRandomDist)2013-01-05 08:15:18
447882Keywording and Stabilizationweb-appsUNCONFIRMEDKeyword request: Please add the sparc keyword to www-apps/gallery2012-12-20 14:52:24
448334Core systembase-systemUNCONFIRMEDsys-apps/hdparm: add support for disk id in /etc/init.d/hdparm2013-01-09 18:41:41
448470Core systemrobbat2UNCONFIRMEDsys-process/audit-2.2.2 incorrectly suggests removal of /lib/libauparse.so.02013-02-03 19:08:30
449652Ebuildsmaintainer-wantedUNCONFIRMEDmedia-video/enzyme-0.2.ebuild - Video metadata parser2013-01-22 02:24:26
451054LibrarycjkUNCONFIRMEDdev-libs/oniguruma-5.9.2-r1 - autotools-utils_src_prepare: Cannot find the latest automake! Tried 1.2013-01-09 14:27:12
451316ApplicationscedkUNCONFIRMEDnet-firewall/conntrack-tools-0.9.14 - parse.c:230:34: error: ‘NULL’ undeclared (first use in this fu2013-01-11 16:17:24
451532GNOMEgnomeUNCONFIRMEDnet-libs/webkit-gtk-1.10.2 - ALT parameter is not shown instead of the image2013-01-13 09:53:12
452172Unclassifieddev-portageUNCONFIRMEDemerge's --jobs does not do full parallelization due to PDEPEND circular dependencies2013-01-15 11:55:26
453002LibrarypatrickUNCONFIRMEDsci-libs/openfoam-2.1.1 - Patches to make paraFoam work with Paraview 3.98.02013-02-18 18:55:08
453122ApplicationsperlUNCONFIRMEDPlease stabilize =app-text/po4a-0.42 (was: 0.38 misparses CDATA section)2013-02-19 20:59:42
453804JavajavaUNCONFIRMEDCreate ebuilds for jdk 8 (early access release), a current Java 8 partial implementation2013-01-24 12:02:05
453842GNOMEgnomeUNCONFIRMED[PATCH] gnome-base/gnome-shell-3.6.2-r1: Fix partialy memory leaks issues2013-02-12 09:35:27
454746Core systemrobbat2UNCONFIRMEDsys-fs/lvm2-2.02.97-r1, sys-fs/udev-197-r4: /dev/mapper entries absent for dm-crypt partitions mount2013-02-04 01:37:50
455104DevelopmentpythonUNCONFIRMEDdev-python/nose-1.2.1_p2012 fails tests (fails to parse coverage output)2013-02-06 10:00:25
455210DevelopmentpythonUNCONFIRMEDdev-lang/python-3.2.3 fails to build native Parser/pgen while crosscompiling2013-02-04 19:42:53
455816Librarynet-p2pUNCONFIRMEDnet-libs/gupnp-igd - src_prepare(): libgupnp-igd/Makefile.am:64: HAVE_INTROSPECTION does not appear 2013-02-06 13:54:26
455890Core systemlivecdUNCONFIRMEDsys-block/parted - parted binary should be installed in /usr/bin2013-02-07 02:12:12
456308Core systembase-systemUNCONFIRMEDgrub2 won't launch memtest86 and memtest86+ if / and /boot are separated partitions and grub2 graphi2013-02-13 22:19:39
456796Keywording and Stabilizationnet-imUNCONFIRMEDnet-im/pyicq-t: sparc keyword request2013-02-11 17:00:43
456798ApplicationsmozillaUNCONFIRMEDwww-client/firefox and mail-client/thunderbird 17.0.2 - parallel build issues2013-02-12 22:15:37
456938DevelopmentperlUNCONFIRMEDdev-perl/XML-SAX-0.990.0, dev-perl/XML-SAX-Base-1.80.0: Fail to remove vendor_perl/.../ParserDetails2013-02-13 19:14:50
457104KernelsecurityUNCONFIRMEDDriver of cypress corrupts file-system and partition table of external hard drives with M6116 SATA B2013-02-14 15:53:16
457546Ebuildsmaintainer-wantedUNCONFIRMEDNew ebuild: dev-db/torndb-0.1 - A lightweight wrapper around MySQLdb. Originally part of the Tornado2013-02-14 15:34:22
458074OpenRCopenrcUNCONFIRMEDsys-apps/openrc-0.11.8 doesn't parse correctly options contained two words abreast self2013-02-18 13:35:38


back



Support us on Content Nation

New Packages

- as rdf newsfeed
- as rss newsfeed
- as Atom newsfeed
2026-10-27
apparmor - 4.1.8
Ebuild name:

sys-apps/apparmor-4.1.8

Description

Userspace utils and init scripts for the AppArmor application security syst

Added to portage

2026-10-27

apparmor - 5.0.2-r1
Ebuild name:

sys-apps/apparmor-5.0.2-r1

Description

Userspace utils and init scripts for the AppArmor application security s

Added to portage

2026-10-27

apparmor-profiles - 4.1.8
Ebuild name:

sec-policy/apparmor-profiles-4.1.8

Description

A collection of profiles for the AppArmor application security s

Added to portage

2026-10-27

apparmor-utils - 4.1.8
Ebuild name:

sys-apps/apparmor-utils-4.1.8

Description

Additional userspace utils to assist with AppArmor profile management

Added to portage

2026-10-27

aws-c-auth - 1.0.2
Ebuild name:

dev-libs/aws-c-auth-1.0.2

Description

AWS C Auth C99 library implementation of AWS client-side authentication

Added to portage

2026-10-27

aws-c-io - 1.1.1
Ebuild name:

dev-libs/aws-c-io-1.1.1

Description

AWS C IO It handles all IO and TLS work for application protocols

Added to portage

2026-10-27

aws-c-s3 - 1.4.1
Ebuild name:

dev-libs/aws-c-s3-1.4.1

Description

AWS C S3 async library

Added to portage

2026-10-27

bpftool - 7.7.0-r2
Ebuild name:

dev-util/bpftool-7.7.0-r2

Description

Tool for inspection and simple manipulation of eBPF programs and maps

Added to portage

2026-10-27

bpftool - 7.8.1-r1
Ebuild name:

dev-util/bpftool-7.8.1-r1

Description

Tool for inspection and simple manipulation of eBPF programs and maps

Added to portage

2026-10-27

c-blosc2 - 3.4.0
Ebuild name:

dev-libs/c-blosc2-3.4.0

Description

Blocking, shuffling and lossless compression library

Added to portage

2026-10-27

cachetools - 7.2.6
Ebuild name:

dev-python/cachetools-7.2.6

Description

Extensible memoizing collections and decorators

Added to portage

2026-10-27

closure-compiler-bin - 20261021
Ebuild name:

dev-lang/closure-compiler-bin-20261021

Description

JavaScript optimizing compiler

Added to portage

2026-10-27

dist-kernel - 6.18.59
Ebuild name:

virtual/dist-kernel-6.18.59

Description

Virtual to depend on any Distribution Kernel

Added to portage

2026-10-27

dist-kernel - 7.2.13
Ebuild name:

virtual/dist-kernel-7.2.13

Description

Virtual to depend on any Distribution Kernel

Added to portage

2026-10-27

django-js-asset - 5.0.0
Ebuild name:

dev-python/django-js-asset-5.0.0

Description

Script tag with additional attributes for django.forms.Media

Added to portage

2026-10-27

dulwich - 1.2.20
Ebuild name:

dev-python/dulwich-1.2.20

Description

Pure-Python implementation of the Git file formats and protocols

Added to portage

2026-10-27

fractal - 14.3
Ebuild name:

net-im/fractal-14.3

Description

Matrix messaging app for GNOME written in Rust

Added to portage

2026-10-27

genshi - 0.7.12
Ebuild name:

dev-python/genshi-0.7.12

Description

Python toolkit for stream-based generation of output for the web

Added to portage

2026-10-27

gentoo-kernel - 6.18.59
Ebuild name:

sys-kernel/gentoo-kernel-6.18.59

Description

Linux kernel built with Gentoo patches

Added to portage

2026-10-27

gentoo-kernel - 7.2.13
Ebuild name:

sys-kernel/gentoo-kernel-7.2.13

Description

Linux kernel built with Gentoo patches

Added to portage

2026-10-27

gentoo-kernel-bin - 6.18.59
Ebuild name:

sys-kernel/gentoo-kernel-bin-6.18.59

Description

Pre-built Linux kernel with Gentoo patches

Added to portage

2026-10-27

gentoo-kernel-bin - 7.2.13
Ebuild name:

sys-kernel/gentoo-kernel-bin-7.2.13

Description

Pre-built Linux kernel with Gentoo patches

Added to portage

2026-10-27

gentoo-kernel-modprep - 6.18.59
Ebuild name:

sys-kernel/gentoo-kernel-modprep-6.18.59

Description

Minimal subset of gentoo-kernel-bin for building modules,

Added to portage

2026-10-27

gentoo-kernel-modprep - 7.2.13
Ebuild name:

sys-kernel/gentoo-kernel-modprep-7.2.13

Description

Minimal subset of gentoo-kernel-bin for building modules, f

Added to portage

2026-10-27

gentoo-sources - 6.18.59
Ebuild name:

sys-kernel/gentoo-sources-6.18.59

Description

Full sources including the Gentoo patchset for the . kernel tree

Added to portage

2026-10-27

grpcio - 1.85.0
Ebuild name:

dev-python/grpcio-1.85.0

Description

HTTP/2-based RPC framework

Added to portage

2026-10-27

grpcio-status - 1.85.0
Ebuild name:

dev-python/grpcio-status-1.85.0

Description

Reference package for GRPC Python status proto mapping

Added to portage

2026-10-27

highlight-indentation - 0.7.0_p20210221
Ebuild name:

app-emacs/highlight-indentation-0.7.0_p20210221

Description

Minor modes to highlight indentation guides in Emac

Added to portage

2026-10-27

highline - 7.2.2
Ebuild name:

app-emacs/highline-7.2.2

Description

Minor mode to highlight current line in buffer

Added to portage

2026-10-27

hl-todo - 3.9.3
Ebuild name:

app-emacs/hl-todo-3.9.3

Description

Highlight TODO and similar keywords in comments and strings

Added to portage

2026-10-27

hl-todo - 3.9.5
Ebuild name:

app-emacs/hl-todo-3.9.5

Description

Highlight TODO and similar keywords in comments and strings

Added to portage

2026-10-27

jellyfin-bin - 12.4
Ebuild name:

www-apps/jellyfin-bin-12.4

Description

Jellyfin puts you in control of managing and streaming your media

Added to portage

2026-10-27

jsonpatch - 1.38
Ebuild name:

dev-python/jsonpatch-1.38

Description

Apply JSON-Patches like http

Added to portage

2026-10-27

jsonpath-ng - 1.14.0
Ebuild name:

dev-python/jsonpath-ng-1.14.0

Description

Python JSONPath Next-Generation

Added to portage

2026-10-27

jsonpointer - 3.6
Ebuild name:

dev-python/jsonpointer-3.6

Description

Identify specific nodes in a JSON document (according to draft 08)

Added to portage

2026-10-27

libapparmor - 4.1.8
Ebuild name:

sys-libs/libapparmor-4.1.8

Description

Library to support AppArmor userspace utilities

Added to portage

2026-10-27

libheif - 1.23.7
Ebuild name:

media-libs/libheif-1.23.7

Description

ISO/IEC 23008-12 HEIF file format decoder and encoder

Added to portage

2026-10-27

lxml-html-clean - 0.4.6
Ebuild name:

dev-python/lxml-html-clean-0.4.6

Description

Separate project for HTML cleaning functionalities copied from lxm

Added to portage

2026-10-27

msgpack - 1.2.4
Ebuild name:

dev-python/msgpack-1.2.4

Description

MessagePack (de)serializer for Python

Added to portage

2026-10-27

org-mode - 9.8.12
Ebuild name:

app-emacs/org-mode-9.8.12

Description

An Emacs mode for notes and project planning

Added to portage

2026-10-27

pandoc-bin - 3.13
Ebuild name:

app-text/pandoc-bin-3.13

Description

Conversion between markup formats (binary package)

Added to portage

2026-10-27

pdns-recursor - 5.4.9
Ebuild name:

net-dns/pdns-recursor-5.4.9

Description

The PowerDNS Recursor

Added to portage

2026-10-27

pycurl - 7.49.0
Ebuild name:

dev-python/pycurl-7.49.0

Description

Python bindings for curl/libcurl

Added to portage

2026-10-27

sqlglot - 30.25.0
Ebuild name:

dev-python/sqlglot-30.25.0

Description

An easily customizable SQL parser and transpiler

Added to portage

2026-10-27

stripe - 16.0.1
Ebuild name:

dev-python/stripe-16.0.1

Description

Stripe Python bindings

Added to portage

2026-10-27

uv - 0.13.6
Ebuild name:

dev-python/uv-0.13.6

Description

A Python package installer and resolver, written in Rust

Added to portage

2026-10-27

uv-build - 0.13.6
Ebuild name:

dev-python/uv-build-0.13.6

Description

PEP517 uv build backend

Added to portage

2026-10-27

vanilla-kernel - 6.18.59
Ebuild name:

sys-kernel/vanilla-kernel-6.18.59

Description

Linux kernel built from vanilla upstream sources

Added to portage

2026-10-27

vanilla-kernel - 7.2.13
Ebuild name:

sys-kernel/vanilla-kernel-7.2.13

Description

Linux kernel built from vanilla upstream sources

Added to portage

2026-10-27

yt-dlp - 2026.10.26
Ebuild name:

net-misc/yt-dlp-2026.10.26

Description

youtube-dl fork with additional features and fixes

Added to portage

2026-10-27

2026-10-26
active - 0.2.1.1
Ebuild name:

dev-haskell/active-0.2.1.1

Description

Abstractions for animation

Added to portage

2026-10-26

aeson - 2.2.5.1
Ebuild name:

dev-haskell/aeson-2.2.5.1

Description

Fast JSON parsing and encoding

Added to portage

2026-10-26

alex - 3.5.4.2
Ebuild name:

dev-haskell/alex-3.5.4.2

Description

Alex is a tool for generating lexical analysers in Haskell

Added to portage

2026-10-26

aria2 - 1.37.0-r1
Ebuild name:

net-misc/aria2-1.37.0-r1

Description

A download utility with segmented downloading with BitTorrent support

Added to portage

2026-10-26

array-api-compat - 1.16.0
Ebuild name:

dev-python/array-api-compat-1.16.0

Description

Array API standard compatibility wrapper over NumPy and others

Added to portage

2026-10-26

asciidoc - 0.1.1.1
Ebuild name:

dev-haskell/asciidoc-0.1.1.1

Description

AsciiDoc parser

Added to portage

2026-10-26

async - 2.2.6
Ebuild name:

dev-haskell/async-2.2.6

Description

Run IO operations asynchronously and wait for their results

Added to portage

2026-10-26

cachetools - 7.2.5
Ebuild name:

dev-python/cachetools-7.2.5

Description

Extensible memoizing collections and decorators

Added to portage

2026-10-26

compose-tables - 1.8.14
Ebuild name:

x11-misc/compose-tables-1.8.14

Description

X.Org Compose Key tables from libX11

Added to portage

2026-10-26

curl - 8.23.0-r1
Ebuild name:

net-misc/curl-8.23.0-r1

Description

A Client that groks URLs

Added to portage

2026-10-26

deepmerge - 4.0.0
Ebuild name:

dev-python/deepmerge-4.0.0

Description

Tools to handle merging of nested data structures in python

Added to portage

2026-10-26

eduvpn-common - 5.0.3
Ebuild name:

net-vpn/eduvpn-common-5.0.3

Description

Linux client and Python client API for eduVPN

Added to portage

2026-10-26

efivar - 39-r2
Ebuild name:

sys-libs/efivar-39-r2

Description

Tools and library to manipulate EFI variables

Added to portage

2026-10-26

fastfetch - 2.70.0
Ebuild name:

app-misc/fastfetch-2.70.0

Description

Fast neofetch-like system information tool

Added to portage

2026-10-26

gawk - 5.4.1c
Ebuild name:

sys-apps/gawk-5.4.1c

Description

GNU awk pattern-matching language

Added to portage

2026-10-26

gcc - 14.4.1_p20261022
Ebuild name:

sys-devel/gcc-14.4.1_p20261022

Description

The GNU Compiler Collection

Added to portage

2026-10-26

gcc - 15.3.1_p20261023
Ebuild name:

sys-devel/gcc-15.3.1_p20261023

Description

The GNU Compiler Collection

Added to portage

2026-10-26

gcc - 16.2.1_p20261024
Ebuild name:

sys-devel/gcc-16.2.1_p20261024

Description

The GNU Compiler Collection

Added to portage

2026-10-26

gcc - 17.0.0_p20261025
Ebuild name:

sys-devel/gcc-17.0.0_p20261025

Description

The GNU Compiler Collection

Added to portage

2026-10-26

generic-deriving - 1.14.7
Ebuild name:

dev-haskell/generic-deriving-1.14.7

Description

Generic programming library for generalised deriving

Added to portage

2026-10-26

gentoo-sources - 7.2.13
Ebuild name:

sys-kernel/gentoo-sources-7.2.13

Description

Full sources including the Gentoo patchset for the . kernel tree

Added to portage

2026-10-26

hypothesis - 6.170.11
Ebuild name:

dev-python/hypothesis-6.170.11

Description

A library for property based testing

Added to portage

2026-10-26

johntheripper - 1.8.0-r2
Ebuild name:

app-crypt/johntheripper-1.8.0-r2

Description

fast password cracker

Added to portage

2026-10-26

johntheripper - 1.9.0
Ebuild name:

app-crypt/johntheripper-1.9.0

Description

fast password cracker

Added to portage

2026-10-26

johntheripper-jumbo - 1.9.0_p20240102
Ebuild name:

app-crypt/johntheripper-jumbo-1.9.0_p20240102

Description

Fast password cracker, community enhanced version

Added to portage

2026-10-26

johntheripper-jumbo - 1.9.0_p20250216-r1
Ebuild name:

app-crypt/johntheripper-jumbo-1.9.0_p20250216-r1

Description

Fast password cracker, community enhanced version

Added to portage

2026-10-26

johntheripper-jumbo - 1.9.0_p20250703
Ebuild name:

app-crypt/johntheripper-jumbo-1.9.0_p20250703

Description

Fast password cracker, community enhanced version

Added to portage

2026-10-26

johntheripper-jumbo - 9999
Ebuild name:

app-crypt/johntheripper-jumbo-9999

Description

Fast password cracker, community enhanced version

Added to portage

2026-10-26

kali-archive-keyring - 2020.2
Ebuild name:

app-crypt/kali-archive-keyring-2020.2

Description

GnuPG archive keys of the Kali archive

Added to portage

2026-10-26

kbfs - 6.0.2
Ebuild name:

app-crypt/kbfs-6.0.2

Description

Keybase Filesystem (KBFS)

Added to portage

2026-10-26

kbfs - 6.2.4
Ebuild name:

app-crypt/kbfs-6.2.4

Description

Keybase Filesystem (KBFS)

Added to portage

2026-10-26

ktexteditor - 6.31.0-r1
Ebuild name:

kde-frameworks/ktexteditor-6.31.0-r1

Description

Framework providing a full text editor component

Added to portage

2026-10-26

kwin-type - 0.1
Ebuild name:

kde-misc/kwin-type-0.1

Description

Autotype on KDE's KWin Wayland compositor

Added to portage

2026-10-26

kwin-x11 - 6.7.5-r2
Ebuild name:

kde-plasma/kwin-x11-6.7.5-r2

Description

Flexible, composited X window manager

Added to portage

2026-10-26

language-c - 0.10.2
Ebuild name:

dev-haskell/language-c-0.10.2

Description

Analysis and generation of C code

Added to portage

2026-10-26

libplacebo - 7.387.0
Ebuild name:

media-libs/libplacebo-7.387.0

Description

Reusable library for GPU-accelerated image processing primitives

Added to portage

2026-10-26

lldpd - 1.0.23
Ebuild name:

net-misc/lldpd-1.0.23

Description

Implementation of IEEE 802.1ab (LLDP)

Added to portage

2026-10-26

merge3 - 1.0.0
Ebuild name:

dev-python/merge3-1.0.0

Description

Python implementation of 3-way merge

Added to portage

2026-10-26

mitmproxy - 12.3.1
Ebuild name:

net-proxy/mitmproxy-12.3.1

Description

An interactive, SSL-capable, man-in-the-middle HTTP proxy

Added to portage

2026-10-26

nodejs - 22.23.4-r1
Ebuild name:

net-libs/nodejs-22.23.4-r1

Description

A JavaScript runtime built on Chrome's V8 JavaScript engine

Added to portage

2026-10-26

openrgb - 1.1
Ebuild name:

app-misc/openrgb-1.1

Description

Open source RGB lighting control

Added to portage

2026-10-26

openrgb-plugin-effects - 1.1
Ebuild name:

app-misc/openrgb-plugin-effects-1.1

Description

Plugin for OpenRGB with various Effects that can be synced acro

Added to portage

2026-10-26

openrgb-plugin-skin - 1.0
Ebuild name:

app-misc/openrgb-plugin-skin-1.0

Description

Plugin for OpenRGB that allows you to customize the look and feel

Added to portage

2026-10-26

openssh-legacy - 9.9_p2-r1
Ebuild name:

net-misc/openssh-legacy-9.9_p2-r1

Description

Old versions of OpenSSH installed separately for legacy machines

Added to portage

2026-10-26

pbs-installer - 2026.10.25
Ebuild name:

dev-python/pbs-installer-2026.10.25

Description

Installer for Python Build Standalone

Added to portage

2026-10-26

pgbouncer - 1.26.1
Ebuild name:

dev-db/pgbouncer-1.26.1

Description

Lightweight connection pooler for PostgreSQL

Added to portage

2026-10-26

pylru - 1.3.3
Ebuild name:

dev-python/pylru-1.3.3

Description

A least recently used (LRU) cache for Python

Added to portage

2026-10-26

pytest-asyncio - 1.4.1
Ebuild name:

dev-python/pytest-asyncio-1.4.1

Description

Library for testing asyncio code with pytest

Added to portage

2026-10-26

python - 0.3.13.18
Ebuild name:

dev-lang/python-0.3.13.18

Description

Freethreading (no-GIL) version of Python programming language

Added to portage

2026-10-26

python - 0.3.14.10
Ebuild name:

dev-lang/python-0.3.14.10

Description

Freethreading (no-GIL) version of Python programming language

Added to portage

2026-10-26

python - 0.3.15.2
Ebuild name:

dev-lang/python-0.3.15.2

Description

Freethreading (no-GIL) version of Python programming language

Added to portage

2026-10-26

python - 3.11.18
Ebuild name:

dev-lang/python-3.11.18

Description

An interpreted, interactive, object-oriented programming language

Added to portage

2026-10-26

python - 3.12.16
Ebuild name:

dev-lang/python-3.12.16

Description

An interpreted, interactive, object-oriented programming language

Added to portage

2026-10-26

python - 3.13.18
Ebuild name:

dev-lang/python-3.13.18

Description

An interpreted, interactive, object-oriented programming language

Added to portage

2026-10-26

python - 3.14.10
Ebuild name:

dev-lang/python-3.14.10

Description

An interpreted, interactive, object-oriented programming language

Added to portage

2026-10-26

python - 3.15.2
Ebuild name:

dev-lang/python-3.15.2

Description

An interpreted, interactive, object-oriented programming language

Added to portage

2026-10-26

python-tests - 0.3.14.10
Ebuild name:

dev-python/python-tests-0.3.14.10

Description

Test modules from dev-lang/python

Added to portage

2026-10-26

python-tests - 0.3.15.2
Ebuild name:

dev-python/python-tests-0.3.15.2

Description

Test modules from dev-lang/python

Added to portage

2026-10-26

python-tests - 3.12.16
Ebuild name:

dev-python/python-tests-3.12.16

Description

Test modules from dev-lang/python

Added to portage

2026-10-26

python-tests - 3.13.18
Ebuild name:

dev-python/python-tests-3.13.18

Description

Test modules from dev-lang/python

Added to portage

2026-10-26

python-tests - 3.14.10
Ebuild name:

dev-python/python-tests-3.14.10

Description

Test modules from dev-lang/python

Added to portage

2026-10-26

python-tests - 3.15.2
Ebuild name:

dev-python/python-tests-3.15.2

Description

Test modules from dev-lang/python

Added to portage

2026-10-26

qt-docs - 6.11.3_p202610220312
Ebuild name:

dev-qt/qt-docs-6.11.3_p202610220312

Description

Qt6 documentation and examples for Qt Creator and other tools

Added to portage

2026-10-26

qt3d - 6.11.3
Ebuild name:

dev-qt/qt3d-6.11.3

Description

3D rendering module for the Qt6 framework

Added to portage

2026-10-26

qt5compat - 6.11.3
Ebuild name:

dev-qt/qt5compat-6.11.3

Description

Qt module containing the unsupported Qt 5 APIs

Added to portage

2026-10-26

qtbase - 6.11.3
Ebuild name:

dev-qt/qtbase-6.11.3

Description

Cross-platform application development framework

Added to portage

2026-10-26

qtcharts - 6.11.3
Ebuild name:

dev-qt/qtcharts-6.11.3

Description

Chart component library for the Qt6 framework

Added to portage

2026-10-26

qtconnectivity - 6.11.3
Ebuild name:

dev-qt/qtconnectivity-6.11.3

Description

Bluetooth and NFC support library for the Qt6 framework

Added to portage

2026-10-26

qtdeclarative - 6.11.3
Ebuild name:

dev-qt/qtdeclarative-6.11.3

Description

Qt Declarative (Quick 2)

Added to portage

2026-10-26

qtgraphs - 6.11.3
Ebuild name:

dev-qt/qtgraphs-6.11.3

Description

Graphs component library for the Qt6 framework

Added to portage

2026-10-26

qthttpserver - 6.11.3
Ebuild name:

dev-qt/qthttpserver-6.11.3

Description

HTTP server functionality for the Qt6 framework

Added to portage

2026-10-26

qtimageformats - 6.11.3
Ebuild name:

dev-qt/qtimageformats-6.11.3

Description

Additional format plugins for the Qt image I/O system

Added to portage

2026-10-26

qtlanguageserver - 6.11.3
Ebuild name:

dev-qt/qtlanguageserver-6.11.3

Description

Implementation of the Language Server Protocol for Qt

Added to portage

2026-10-26

qtlocation - 6.11.3
Ebuild name:

dev-qt/qtlocation-6.11.3

Description

Location (places, maps, navigation) library for the Qt6 framework

Added to portage

2026-10-26

qtmultimedia - 6.11.3
Ebuild name:

dev-qt/qtmultimedia-6.11.3

Description

Multimedia (audio, video, radio, camera) library for the Qt6 framework

Added to portage

2026-10-26

qtnetworkauth - 6.11.3
Ebuild name:

dev-qt/qtnetworkauth-6.11.3

Description

Network authorization library for the Qt6 framework

Added to portage

2026-10-26

qtpositioning - 6.11.3
Ebuild name:

dev-qt/qtpositioning-6.11.3

Description

Physical position determination library for the Qt6 framework

Added to portage

2026-10-26

qtquick3d - 6.11.3
Ebuild name:

dev-qt/qtquick3d-6.11.3

Description

Qt module and API for defining 3D content in Qt QuickTools

Added to portage

2026-10-26

qtquicktimeline - 6.11.3
Ebuild name:

dev-qt/qtquicktimeline-6.11.3

Description

Qt module for keyframe-based timeline construction

Added to portage

2026-10-26

qtremoteobjects - 6.11.3
Ebuild name:

dev-qt/qtremoteobjects-6.11.3

Description

Inter-Process Communication (IPC) library for the Qt6 framework

Added to portage

2026-10-26

qtscxml - 6.11.3
Ebuild name:

dev-qt/qtscxml-6.11.3

Description

State Chart XML (SCXML) support library for the Qt6 framework

Added to portage

2026-10-26

qtsensors - 6.11.3
Ebuild name:

dev-qt/qtsensors-6.11.3

Description

Hardware sensor access library for the Qt6 framework

Added to portage

2026-10-26

qtserialbus - 6.11.3
Ebuild name:

dev-qt/qtserialbus-6.11.3

Description

Qt module to access CAN, ModBus, and other industrial serial buses and pr

Added to portage

2026-10-26

qtserialport - 6.11.3
Ebuild name:

dev-qt/qtserialport-6.11.3

Description

Serial port abstraction library for the Qt6 framework

Added to portage

2026-10-26

qtshadertools - 6.11.3
Ebuild name:

dev-qt/qtshadertools-6.11.3

Description

Qt APIs and Tools for Graphics Pipelines

Added to portage

2026-10-26

qtspeech - 6.11.3
Ebuild name:

dev-qt/qtspeech-6.11.3

Description

Text-to-speech library for the Qt6 framework

Added to portage

2026-10-26

qtsvg - 6.11.3
Ebuild name:

dev-qt/qtsvg-6.11.3

Description

SVG rendering library for the Qt6 framework

Added to portage

2026-10-26

qttasktree - 6.11.3
Ebuild name:

dev-qt/qttasktree-6.11.3

Description

Module to compose and execute asynchronous task workflows for the Qt6 fram

Added to portage

2026-10-26

qttools - 6.11.3
Ebuild name:

dev-qt/qttools-6.11.3

Description

Qt Tools Collection

Added to portage

2026-10-26

qttranslations - 6.11.3
Ebuild name:

dev-qt/qttranslations-6.11.3

Description

Translation files for the Qt6 framework

Added to portage

2026-10-26

qtvirtualkeyboard - 6.11.3
Ebuild name:

dev-qt/qtvirtualkeyboard-6.11.3

Description

Customizable input framework and virtual keyboard for Qt

Added to portage

2026-10-26

qtwayland - 6.11.3
Ebuild name:

dev-qt/qtwayland-6.11.3

Description

Toolbox for making Qt based Wayland compositors

Added to portage

2026-10-26

qtwebchannel - 6.11.3
Ebuild name:

dev-qt/qtwebchannel-6.11.3

Description

Qt WebChannel

Added to portage

2026-10-26

qtwebengine - 6.11.3
Ebuild name:

dev-qt/qtwebengine-6.11.3

Description

Library for rendering dynamic web content in Qt6 C++ and QML applications

Added to portage

2026-10-26

qtwebsockets - 6.11.3
Ebuild name:

dev-qt/qtwebsockets-6.11.3

Description

Implementation of the WebSocket protocol for the Qt6 framework

Added to portage

2026-10-26

qtwebview - 6.11.3
Ebuild name:

dev-qt/qtwebview-6.11.3

Description

Module for displaying web content in a QML application using the Qt6 framew

Added to portage

2026-10-26

ruff - 0.17.2
Ebuild name:

dev-util/ruff-0.17.2

Description

An extremely fast Python linter, written in Rust

Added to portage

2026-10-26

rutorrent - 5.3.19
Ebuild name:

www-apps/rutorrent-5.3.19

Description

ruTorrent is a front-end for the popular Bittorrent client rTorrent

Added to portage

2026-10-26

swt - 4.38-r1
Ebuild name:

dev-java/swt-4.38-r1

Description

GTK based SWT Library

Added to portage

2026-10-26

systemd - 262.1
Ebuild name:

sys-apps/systemd-262.1

Description

System and service manager for Linux

Added to portage

2026-10-26

tasty-golden - 2.3.6
Ebuild name:

dev-haskell/tasty-golden-2.3.6

Description

Golden tests support for tasty

Added to portage

2026-10-26

time-machine - 3.6.0
Ebuild name:

dev-python/time-machine-3.6.0

Description

Travel through time in your tests

Added to portage

2026-10-26

tls - 2.0.1
Ebuild name:

dev-tcltk/tls-2.0.1

Description

TLS OpenSSL extension to Tcl

Added to portage

2026-10-26

vanilla-sources - 6.18.59
Ebuild name:

sys-kernel/vanilla-sources-6.18.59

Description

Full sources for the Linux kernel

Added to portage

2026-10-26

vanilla-sources - 7.2.13
Ebuild name:

sys-kernel/vanilla-sources-7.2.13

Description

Full sources for the Linux kernel

Added to portage

2026-10-26

vcrpy - 9.2.0
Ebuild name:

dev-python/vcrpy-9.2.0

Description

Automatically mock your HTTP interactions to simplify and speed up testing

Added to portage

2026-10-26

webkit-gtk - 2.54.2-r400
Ebuild name:

net-libs/webkit-gtk-2.54.2-r400

Description

Open source web browser engine

Added to portage

2026-10-26

webkit-gtk - 2.54.2-r600
Ebuild name:

net-libs/webkit-gtk-2.54.2-r600

Description

Open source web browser engine

Added to portage

2026-10-26

xmlunit - 2.14.0
Ebuild name:

dev-java/xmlunit-2.14.0

Description

XMLUnit extends JUnit and NUnit to enable unit testing of XML

Added to portage

2026-10-26

xmlunit-assertj - 2.14.0
Ebuild name:

dev-java/xmlunit-assertj-2.14.0

Description

XMLUnit with AssertJ fluent API

Added to portage

2026-10-26

xmlunit-core - 2.14.0
Ebuild name:

dev-java/xmlunit-core-2.14.0

Description

XMLUnit extends JUnit and NUnit to enable unit testing of XML

Added to portage

2026-10-26

xmlunit-matchers - 2.14.0
Ebuild name:

dev-java/xmlunit-matchers-2.14.0

Description

XMLUnit for Java Hamcrest Matchers

Added to portage

2026-10-26

z3 - 5.3.2
Ebuild name:

sci-mathematics/z3-5.3.2

Description

An efficient theorem prover

Added to portage

2026-10-26

rdf newsfeed | rss newsfeed | Atom newsfeed
Copyright 2004-2025 Sascha Nitsch Unternehmensberatung GmbH
- Copyright and legal notices -
Time to create this page: 28.6 ms