from small one page howto to huge articles all in one place
 

search text in:




Other .linuxhowtos.org sites: www.linuxhowtos.org
toolsntoys.linuxhowtos.org



Last additions:
How to make X listen on port 6000

How to make X listen on port 6000

words:

34

views:

55598

userrating:

average rating: 1.5 (4 votes) (1=very good 6=terrible)


May, 25th 2007:
April, 26th 2007:
Apr, 10th. 2007:
Druckversion . pdf icon
You are here: Portage


Details of acct-user/tor:

Description: user for tor daemon

available versions:

releasesalphaamd64armhppaia64mipsppcppc64ppc macoss390shsparcx86USE-Flagsdependenciesebuild warnings
tor-0 -------------none
show
show
Legend:
+ stable
~ testing
- not available
some ebuild warning depend on specific use-flags or architectures, all ebuild-warnings are shown.

Known bugs:
bug IDcomponentassigned tostatusdescriptionlast change
416919ApplicationsxfceUNCONFIRMEDxfce-base/xfce4-session causes X to crash on login with external monitor2012-05-23 13:59:46
373281ApplicationsxemacsUNCONFIRMEDapp-editors/xemacs-21.5.31 fails to emerge, because check-features.el can not be loaded2013-02-17 11:58:08
435750ApplicationsxemacsUNCONFIRMEDapp-editors/xemacs-21.4.22-r2 crashes if syntax highlighting in current buffer is used2012-09-28 09:57:26
421363Applicationsx11UNCONFIRMEDx11-apps/xinput_calibrator-0.7.5[-gtk] installs incorrect desktop entry2012-06-19 11:43:59
403301Applicationsx11UNCONFIRMEDx11-apps/intel-gpu-tools-1.1 - work/intel-gpu-tools-1.1/tests/testdisplay.c:760:38: error: storage s2012-02-14 18:04:33
428628EbuildswschlichUNCONFIRMEDsys-block/megacli monitoring script2013-01-07 17:05:25
455956ApplicationswxwidgetsUNCONFIRMEDapp-editors/wxhexeditor-0.21 version bump2013-02-07 11:28:22
453208ApplicationswiredUNCONFIRMEDwww-client/uzbl-9999 - src/uzbl-core.h:16:25: fatal error: glib/gstdio.h: No such file or directory2013-01-21 19:18:42
441778DevelopmentvoyageurUNCONFIRMEDsys-devel/clang-3.1 ICE's when a type with multiple copy-ctors is in a union2012-11-04 23:13:59
444602ApplicationsvirtualizationUNCONFIRMEDapp-emulation/virtinst-0.600.3 - Exception in thread Checking storage allocation2013-02-16 18:03:56
448472ApplicationsvimUNCONFIRMEDapp-editors/gvim - segmentation fault when using clang_complete2012-12-25 15:39:05
453418ApplicationsvimUNCONFIRMEDapp-editors/vim-core-7.3.762 Opened file gets modified when mapping g to some other value2013-01-22 02:03:25
455480ApplicationsvimUNCONFIRMEDapp-editors/vim-7.3.762 - Symlinks to gz manpages are dangling because my system uses bzip2 manpages2013-02-04 19:35:50
455914ApplicationsvimUNCONFIRMEDapp-editors/{g,}vim-7.3.806 version bump2013-02-07 03:13:05
457564ApplicationsvimUNCONFIRMEDapp-editors/vim-core-7.3.762 fails with ncurses[tinfo]2013-02-14 18:18:53
441864ApplicationsvimUNCONFIRMEDapp-editors/vim-7.3.646 vim: stack smashing attack in function - terminated2012-11-05 13:04:29
440564ApplicationsvimUNCONFIRMEDapp-editors/vim-7.3.409: some elog messages should only be shown when upgrading from an old enough p2012-10-31 16:25:37
440542ApplicationsvimUNCONFIRMEDapp-editors/vim-core-7.3.409: some elog messages should only be shown when upgrading from an old eno2012-10-31 16:23:55
440414ApplicationsvimUNCONFIRMEDapp-editors/vim-7.3.409: some elog messages should only be shown right after the relevant use flag i2012-10-31 15:58:55
423137ApplicationsvimUNCONFIRMEDapp-editors/vim-7.3.409: Misleading and outdated hint on solving a problem2012-06-26 14:55:41
417921ApplicationsvimUNCONFIRMEDapp-editors/vim - bash completion fails with paths containing spaces2012-05-28 11:50:58
400585ApplicationsvimUNCONFIRMEDapp-editors/vim-7.3: broken unicode while copy/paste with X PRIMARY and CLIPBOARD2012-01-25 13:56:18
374259Core systemvimUNCONFIRMEDapp-editors/vim: confirm function in .vimrc causes cpu 100% & process lockup2011-08-12 18:52:09
420675ApplicationstuponeUNCONFIRMEDapp-misc/geneweb-5.02 - File "srcfile.ml", line 195, characters 4-56: Error: Unbound constructor Std2013-02-21 12:35:28
421287Toolstools-portageUNCONFIRMEDgentoolkit 0.3.0.6 euse -i option causes a lot of no such file or directory with app-admin/eselect-12012-06-20 16:02:59
452410DevelopmenttommyUNCONFIRMEDdev-vcs/subversion-1.7.7 - AutoSplit: Can't open blib/lib/SVN/Client.pm: No such file or directory2013-01-16 16:06:49
433457Core systemsystemdUNCONFIRMEDsys-apps/systemd should not store coredumps in its journal yet2012-10-27 21:52:30
444390ServersysadminUNCONFIRMEDnet-analyzer/nagios - Directory permissions for /etc/nagios are wrong, apache can't start2012-11-23 17:41:24
412217LibrarysoundUNCONFIRMEDdev-libs/redland-1.0.15 has malformed Makefile, won't emerge: "missing separator"2012-04-16 17:47:14
454062Applicationsshell-toolsUNCONFIRMEDapp-misc/byobu-5.27 - create window failed: /bin/bash no such file or directory2013-02-06 16:13:05
426346Applicationsshell-toolsUNCONFIRMEDapp-shells/bash-completion - cd autocomplete's non-directories2012-07-17 20:17:44
454298Ebuildssci-mathematicsUNCONFIRMEDsci-mathematics/maxima - maxima cannot be started from wxmaxima or cantor2013-02-04 03:36:37
368473Applicationssci-biologyUNCONFIRMEDsci-biology/hmmer-3.0 fails to build with "mpi.c:27:23: error: impl_dummy.: No such file or director2011-06-21 09:31:43
448824ApplicationssciUNCONFIRMEDsci-visualization/ggobi-2.1.9-r1 - autom4te-2.69: ../../m4/lt~obsolete.m4: no such file or directory2012-12-27 14:07:04
419995ApplicationssciUNCONFIRMED[science overlay] media-gfx/librecad-9999 - fix for changed directory structure2012-07-19 04:53:04
395007Prefix SupportryaoUNCONFIRMEDImport net-misc/tor-0.2.2.34-r1 on x64-macos2012-08-10 18:51:21
438708ApplicationsroxUNCONFIRMED2012-10-17 14:29:58
395929EbuildsroxUNCONFIRMEDrox-base/mime-editor-0.6: uses still python_mod_optimize()2011-12-24 20:01:06
457910Developmentrobbat2UNCONFIRMEDqt-creator should RDEPEND on something providing ssh-askpass for git push2013-02-21 12:40:02
377339EbuildsroxUNCONFIRMEDNew Version rox-base/zeroinstall-injector-1.22011-08-02 10:52:56
451966Applicationsrobbat2UNCONFIRMEDapp-misc/g15daemon start-stop-daemon: fopen `/var/run/g15daemon.pid': No such file or directory2013-01-15 12:27:28
437718Core systemrobbat2UNCONFIRMEDsys-fs/lvm2-2.02.97 /etc/init.d/lvm-monitoring slows down boot and shutdown on systems with multiple2012-12-23 09:48:04
442220ApplicationsqtUNCONFIRMEDapp-editors/focuswriter - segmentation fault in Xfce42013-01-06 15:59:32
439724ApplicationspythonUNCONFIRMED>app-editors/leo-4.9 USE =tk is not needed anymore2012-10-26 16:26:57
431388ApplicationspythonUNCONFIRMEDdev-python/ipython-0.13 -AttributeError: 'StoreMagics' object has no attribute 'db'2012-08-14 15:08:54
451668ApplicationsproaudioUNCONFIRMEDmedia-sound/lash-0.5.4-r1 with sys-devel/gcc-4.7.2 - lash.c:203:19: error: storage size of ‘max_fds’2013-02-03 22:16:12
413623ApplicationsproaudioUNCONFIRMEDmedia-sound/terminatorx 3.82 and 3.84 - tX_midiin.cc:452:2: error: cannot convert ‘gzFile_s**’ to ‘g2013-01-06 04:23:20
458104PrintingprintingUNCONFIRMEDapp-text/acroread-9.5.1-r1 - acroread creates $HOME/fontconfig directory on startup2013-02-18 13:45:46
399741PrintingprintingUNCONFIRMEDmedia-libs/plotutils-2.6 - g_miscmi.c:26:58: fatal error: xmi.h: No such file or directory2013-02-12 05:34:31
435044Prefix SupportprefixUNCONFIRMEDbootstrap-prefix.txt fails on comilation of portage/app-editors/nano-2.3.1-r22012-10-01 14:08:25
416269Prefix SupportprefixUNCONFIRMEDdev-python/reportlab-2.5-r1 fails to build : libart.h : No such file or directory2012-05-23 15:49:39
412773Prefix SupportprefixUNCONFIRMEDapp-editors/emacs-vcs: Includes incorrect libpng header file2012-04-22 13:12:19
384581Mac OSXprefixUNCONFIRMEDapp-editors/emacs-23.3-r2: emerge failed with error unexec: my_endbss_static is not in section __bss2011-10-31 03:04:33
376435Prefix SupportprefixUNCONFIRMEDnet-libs/libpcap-1.1.1-r1 - ./pcap-usb-linux.c:228: error: storage size of 'ctrl' isn't known2011-12-19 02:04:51
438494Conceptual/Abstract Ideaspms-bugsUNCONFIRMEDHave configuration file protection against new files in conf.d/ directories2012-10-16 15:46:11
414813PMS/EAPIpms-bugsUNCONFIRMED[Future EAPI] REPOSITORY variable set in ebuild environment2013-01-12 13:12:38
414815PMS/EAPIpms-bugsUNCONFIRMED[Future EAPI] Support for repository dependencies in DEPEND, PDEPEND and RDEPEND and atoms passed to2013-01-12 13:12:54
425214PMS/EAPIpms-bugsUNCONFIRMED'dohtml -r ${directory}/' has undocumented behavior2012-07-08 06:59:50
417991Developmentphp-bugsUNCONFIRMEDdev-php/phpunit-3.5.13 should RDEPEND on 2012-10-14 15:29:54
396307EbuildsperlUNCONFIRMEDmail-filter/spamassassin-3.3.1-r4 sa-update tool does not create sa-update-keys directory2011-12-28 16:27:41
445120LibrarypatrickUNCONFIRMEDsys-libs/tdb-1.2.10 - Compilatin phase failed - [Errno 2] No such file or directory: '/var/tmp/porta2012-12-08 15:46:16
406187LibrarypatrickUNCONFIRMEDsys-libs/talloc-2.0.7 - [Errno 2] No such file or directory: '/var/tmp/portage/sys-libs/talloc-2.0.72012-03-29 20:03:40
403439ServerpatrickUNCONFIRMEDwww-servers/apache: remove deprecated AddDirectoryIndex from default config2013-02-16 14:05:28
398755ApplicationspatrickUNCONFIRMEDnet-misc/elliptics-2.11.0.12 - a fault tolerant key/value storage2012-12-25 19:11:17
402355Applicationspam-bugsUNCONFIRMEDsys-auth/pam_keystore HOMEPAGE outdated (404)2012-02-06 20:31:29
444610OpenRCopenrcUNCONFIRMEDsys-apps/openrc output is unfriendly on high resolution/wide monitors2012-11-24 19:46:03
457656ApplicationsnikoliUNCONFIRMEDmedia-sound/clementine (while scanning media) - segfault in TagLib::File::find(TagLib::ByteVector co2013-02-15 15:57:13
427146ApplicationsnetmonUNCONFIRMEDnet-analyzer/ntop - Segfaulting with high load netFlow monitoring2012-09-25 17:27:26
430628ApplicationsnetmonUNCONFIRMED=net-analyzer/metasploit-4.3.0 add revdep-rebuild directory masks2012-08-13 00:54:27
367375EbuildsnetmonUNCONFIRMEDnet-analyzer/ndoutils-1.4_beta9: "db/" directory from source code is not installed to system2012-02-09 10:57:19
437970Servernet-proxyUNCONFIRMEDnet-proxy/http-replicator-3.0-r3 - ERROR: HttpClient 1 caught an exception in __getattr__: HttpClien2012-10-11 13:53:15
442874Applicationsnet-proxyUNCONFIRMEDnet-proxy/http-replicator - local rsync server reports install flash player as wrong size2012-11-14 00:16:31
446184Applicationsnet-p2pUNCONFIRMEDnet-libs/libtorrent-0.13.2: fails to cross compile2012-12-06 05:02:50
446186Applicationsnet-p2pUNCONFIRMEDnet-p2p/rtorrent-0.9.2: bad configure check prevents cross-compilation2012-12-06 05:03:19
449818Applicationsnet-p2pUNCONFIRMEDnet-p2p/deluge-1.3.5 with >=net-libs/rb_libtorrent-0.16 - metadata for torrents added using a magnet2013-01-03 12:09:55
444700Applicationsnet-p2pUNCONFIRMEDnet-p2p/rtorrent-0.9.2 could not start initscript2012-12-29 14:14:37
426912Librarynet-p2pUNCONFIRMEDnet-p2p/deluge unicode casting problems with net-libs/rb_torrent 0.16.x2013-01-26 06:22:29
401681Applicationsnet-p2pUNCONFIRMEDnet-misc/curl-7.24.0 with net-p2p/rtorrent-* leads to 100% CPU load.2013-01-01 14:36:36
406685Ebuildsnet-p2pUNCONFIRMEDapp-arch/torrentzip-0.9 version bump request2012-12-30 07:20:56
394885Applicationsnet-p2pUNCONFIRMEDnet-p2p/rtorrent-0.8.9 fails to link because of missing lpthread for LIBS2011-12-16 02:48:12
399115Ebuildsnet-p2pUNCONFIRMEDnet-p2p/rtorrent-0.8.9 - .../work/rtorrent-0.8.9/src/core/download.h:76:84: error: ‘class core::Down2012-04-08 10:10:28
442662Ebuildsmysql-bugsUNCONFIRMEDdev-db/mysql-connector-c++ - Output from mysql_config is parsed in in ugly way.2012-11-19 15:55:25
435690Applicationsmysql-bugsUNCONFIRMEDdev-db/mysql-5.1.62-r1 - Makefile:186: *** missing separator. Stop.2013-02-04 23:51:03
409415Eclasses and ProfilesmgornyUNCONFIRMEDgit-2.eclass fails to clone bare repository into working directory using specific EGIT_REPO_URI2012-04-03 10:30:48
438928Applicationsmedia-videoUNCONFIRMEDmedia-video/vlc should open directories in KDE2012-10-19 14:47:58
404539Applicationsmedia-tvUNCONFIRMEDapp-misc/lirc-0.9.0 - /usr/src/linux-3.2.1-gentoo/arch/amd64/Makefile: No such file or directory mak2012-09-27 19:15:55
390233Ebuildsmedia-tvUNCONFIRMEDmedia-tv/tvtime : request for patch merge (for wide monitors)2011-11-15 00:33:44
457546Ebuildsmaintainer-wantedUNCONFIRMEDNew ebuild: dev-db/torndb-0.1 - A lightweight wrapper around MySQLdb. Originally part of the Tornado2013-02-14 15:34:22
453658Ebuildsmaintainer-wantedUNCONFIRMEDdev-util/jenkins - application that monitors executions of repeated jobs, such as building a softwar2013-01-30 11:30:11
453472Ebuildsmaintainer-wantedUNCONFIRMEDgames-emulation/handheld-quake-0.7.ebuild - Handheld Quake (aka HQ) is a simulator of soviet, russia2013-01-23 03:26:50
452850Ebuildsmaintainer-wantedUNCONFIRMEDwww-apps/snorby - Ruby on Rails application for network security monitoring2013-01-18 17:12:00
450440Core systemmaintainer-wantedUNCONFIRMEDnet-fs/xtreemfs - XtreemFS is a fault-tolerant distributed file system for all storage needs2013-01-07 02:42:31
450300Ebuildsmaintainer-wantedUNCONFIRMEDx11-misc/menulibre - An advanced menu editor that provides modern features in a clean, easy-to-use i2013-01-27 17:35:31
449794Ebuildsmaintainer-wantedUNCONFIRMEDapp-emulation/tilem-2.0 - an emulator and debugger for Texas Instruments Z80-based graphing calculat2013-01-03 00:16:42
445736Ebuildsmaintainer-wantedUNCONFIRMEDdev-libs/weston-1.0.2 - Wayland reference compositor2013-02-19 12:11:30
445614Ebuildsmaintainer-wantedUNCONFIRMEDapp-editors/retext - New package. - Qt-based text-editor for Markdown written in Python2013-01-02 12:40:40
442920Ebuildsmaintainer-wantedUNCONFIRMEDmedia-sound/laditools - Control and monitor a LADI system the easy way.2012-11-13 12:30:44
443476Ebuildsmaintainer-wantedUNCONFIRMEDapp-admin/reprepro - Tool for creating a Debian APT repository with a pool structure2012-11-16 16:10:46
442388Ebuildsmaintainer-wantedUNCONFIRMEDapp-backup/storebackup - Storebackup is a backup suite that stores files on other disks.2012-11-08 23:28:56
439060Ebuildsmaintainer-wantedUNCONFIRMEDsci-electronics/openhantek-0.2.0 and -9999 - Digital Storage Osziloscope2012-10-20 15:41:18
439396Ebuildsmaintainer-wantedUNCONFIRMEDmedia-sound/postfish - The Postfish is a digital audio post-processing, restoration, filtering and m2012-10-26 06:43:41
436278Librarymaintainer-wantedUNCONFIRMEDnet-analyzer/nagios-afs-monitor - Nagios plugins to monitor openafs server status2012-09-26 13:37:17
434828Ebuildsmaintainer-wantedUNCONFIRMEDapp-editors/gedit-collaboration-9999 - GNOME Text Editor Collaboration Plugin2012-09-18 23:55:14
433060Ebuildsmaintainer-wantedUNCONFIRMED[science overlay] sci-physics/herwig++ - High-Energy Physics event generator2013-02-08 01:03:07
432712Ebuildsmaintainer-wantedUNCONFIRMEDsci-geosciences/gpx2svg – Convert GPX formatted geodata to Scalable Vector Graphics (SVG)2012-08-26 20:33:26
431976Core systemmaintainer-wantedUNCONFIRMEDnet-fs/pup-volume-monitor - another disk mounter2012-08-20 12:03:46
431872Ebuildsmaintainer-wantedUNCONFIRMEDx11-terms/kmscon - Linux KMS/DRM based virtual Console Emulator2012-12-13 01:07:28
430862Ebuildsmaintainer-wantedUNCONFIRMEDx11-misc/pdfpc - a presenter console with multi-monitor support for PDF files2012-08-12 20:07:52
425202Ebuildsmaintainer-wantedUNCONFIRMEDx11-plugins/torchat - Pidgin plugin for p2p instant messaging through Tor hidden service tunnels2012-07-08 14:10:34
424830Ebuildsmaintainer-wantedUNCONFIRMEDnet-p2p/couchpotatoserver - an automatic NZB and torrent downloader2012-10-07 03:34:59
417009Ebuildsmaintainer-wantedUNCONFIRMEDwww-misc/monitorix-2.5.2 version bump2012-05-22 06:37:42
415443Ebuildsmaintainer-wantedUNCONFIRMEDnet-fs/junglediskworkgroup-3.16 - Networked storage/backup using Amazon's S3 service2012-07-28 23:06:49
412549Applicationsmaintainer-wantedUNCONFIRMEDapp-editors/vim-qt - An experimental Qt gui for Vim2012-06-01 05:52:22
407589Ebuildsmaintainer-wantedUNCONFIRMEDdev-python/factory_boy : A versatile test fixtures replacement2012-03-12 12:07:45
403579Ebuildsmaintainer-wantedUNCONFIRMEDdev-tex/latexdraw - a graphical drawing editor for LaTeX2012-04-29 18:30:43
403667Ebuildsmaintainer-wantedUNCONFIRMEDapp-vim/ropevim-0.3_rc0 - vim plugin for using rope python refactoring library2012-02-14 21:15:54
403913Gamesmaintainer-wantedUNCONFIRMEDgames-emulation/fs-uae - a multi-platform Amiga emulator based on WinUAE/E-UAE/PUAE, with a focus on2012-02-15 17:27:10
405461Ebuildsmaintainer-wantedUNCONFIRMEDapp-editors/sublime-text - a sophisticated text editor for code, html and prose2012-11-18 12:37:09
405643Ebuildsmaintainer-wantedUNCONFIRMEDapp-misc/stackapplet-1.5.1 - a small application that uses the new AppIndicator framework to display2012-02-26 17:22:22
398491Ebuildsmaintainer-wantedUNCONFIRMEDmedia-sound/qloud-0.30 - Tool to measure loudspeaker frequency and step response, distortions' SPL a2012-01-11 17:10:33
398731Ebuildsmaintainer-wantedUNCONFIRMEDnet-analyzer/slowhttptest-1.3.ebuild Application Layer DoS attack simulator2012-01-13 14:35:35
399711Ebuildsmaintainer-wantedUNCONFIRMED[ebuild request] sys-process/ulatencyd - monitors the system and categorizes the running processes i2012-04-09 14:20:31
398485Ebuildsmaintainer-wantedUNCONFIRMEDmedia-sound/eko-0.6.0.ebuild simple sound editor2012-01-11 17:11:12
398487Ebuildsmaintainer-wantedUNCONFIRMEDmedia-sound/coquillo-1.9 - a metadata editor / tagger for various audio file formats2012-01-11 17:10:51
394375Ebuildsmaintainer-wantedUNCONFIRMEDdev-vcs/rhodecode - Mercurial repository browser/management with build in push/pull server and full 2013-01-29 16:31:11
389151Ebuildsmaintainer-wantedUNCONFIRMEDnet-misc/justwifiindicator-0.1 - Simple WiFi signal strength tray indicator2011-11-20 12:10:03
389055Ebuildsmaintainer-wantedUNCONFIRMEDapp-admin/gpw - Trigraph Password Generator2011-11-13 06:59:34
387345Ebuildsmaintainer-wantedUNCONFIRMEDnet-misc/gateone - an HTML5 web-based terminal emulator and SSH client.2011-10-18 18:27:36
386557Ebuildsmaintainer-wantedUNCONFIRMEDOctopussy log aggregator (new package)2011-10-11 01:05:58
385483Ebuildsmaintainer-wantedUNCONFIRMEDnew ebuild: app-editors/x22012-05-04 15:36:31
382339Ebuildsmaintainer-wantedUNCONFIRMED[ebuild request] app-office/dunnart - constraint-based diagram editor2011-09-09 07:53:17
381487Ebuildsmaintainer-wantedUNCONFIRMEDdev-python/DerApproximator - A python module for numerical optimization2011-09-05 11:36:51
379701Ebuildsmaintainer-wantedUNCONFIRMEDfeedgenerator-1.2.1.ebuild(New Package)2011-09-16 05:46:30
376869Ebuildsmaintainer-wantedUNCONFIRMEDnew ebuild - dev-util/motor-3.4.2 IDE2011-07-29 10:10:39
443856Applicationsmaintainer-neededUNCONFIRMEDmedia-gfx/splashutils-1.5.4.4-r2 failed to build - asm/posix_types.h: No such file or directory2013-01-27 08:05:31
410343Ebuildsmaintainer-neededUNCONFIRMEDnet-wireless/broadcom-sta - modprobe wl: ERROR: could not insert 'wl': No such file or directory2013-02-03 13:03:43
402681Applicationsmaintainer-neededUNCONFIRMEDapp-editors/cooledit-3.17.17-r1 doesn't honor LINGUAS for locale files2012-02-23 21:38:44
444394Core systemlu_zeroUNCONFIRMEDsys-apps/dtc-1.3.0-r1 - /usr/bin/install: cannot stat 'fdtdump': No such file or directory2012-12-21 15:58:17
447626Applicationslu_zeroUNCONFIRMEDmedia-gfx/blender should not use environment variables to set installation directories2013-01-31 09:26:50
436442Eclasses and Profileskernel-miscUNCONFIRMEDkernel-2.eclass - Offer a mean to install the kernel distribution under a tunable directory name2012-09-28 14:34:11
425316Applicationskernel-miscUNCONFIRMEDapp-misc/fdutils-5.5-r2 - fdmount.c:25:27: fatal error: linux/ext2_fs.h: No such file or directory2012-12-12 05:51:37
390293Unspecifiedkernel-miscUNCONFIRMED[enhancement] sys-fs/sshfs-fuse: Improve remote permissions when files and directories are created2011-11-15 00:36:35
366733Eclasses and Profileskernel-miscUNCONFIRMEDkernel-2.eclass enhancement proposal: removing unnecessary arch directories to save space2012-04-16 11:29:25
456388KDEkdeUNCONFIRMEDkde-misc/krename-4.0.9: fatal error: freetype/config/ftheader.h: No such file or directory2013-02-19 06:44:46
435584KDEkdeUNCONFIRMEDkde-base/kdelibs - patch to fix directory icon breakage for NFS mounts since KDE 4.7.42012-09-28 17:48:44
433070KDEkdeUNCONFIRMEDapp-editors/kile-2.1.2-r1 - index.docbook:124: parser error : Entity 'ged.vertaald' not defined2013-02-17 22:53:14
457534ServerjsbronderUNCONFIRMEDsys-cluster/torque-2.4.16: mv: cannot stat `libtool': No such file or directory2013-02-14 14:39:41
453644Core systemjsbronderUNCONFIRMEDsys-cluster/torque-2.5.12 - qstat-qstat.o: In function `tcl_run': qstat.c:(.text+0x1ac5): undefined 2013-02-06 16:34:18
452676ServerjsbronderUNCONFIRMEDsys-cluster/torque - new HOMEPAGE2013-01-17 15:39:49
414623Core systemjsbronderUNCONFIRMEDsys-cluster/torque-4.0.1 version bump2012-05-04 21:38:17
415701Core systemjsbronderUNCONFIRMEDsys-cluster/torque-3.x[cpusets] fails on 3.2.x kernels2012-11-02 17:51:04
387567ApplicationsjlecUNCONFIRMEDx11-terms/terminator-0.96: Segmentation fault when starting2011-10-24 05:16:07
371947CVS/SVN/Gitinfra-bugsUNCONFIRMEDDo not allow commits of packages with no ebuilds (eg. empty directories.)2011-09-25 06:48:23
454916DevelopmenthwoarangUNCONFIRMEDdev-util/qt-creator: apply patch to make ~arm work2013-02-17 11:25:06
455498ApplicationshaubiUNCONFIRMEDdev-db/tora-2.1.4 version bump2013-02-21 10:45:19
403841EbuildshwoarangUNCONFIRMEDdev-embedded/openocd-9999 - refactor and improve device support2012-11-05 12:32:05
430308DevelopmenthwoarangUNCONFIRMEDdev-util/qt-creator-2.5.0: cannot find/use tool chain2012-10-24 14:46:48
454934GameshasufellUNCONFIRMEDgames-rpg/grimrock-20121222 segfault loading dungeon editor with USE=system-libs2013-02-05 01:39:36
431368ApplicationshaskellUNCONFIRMEDx11-misc/xmobar-0.14 - src/Plugins/Monitors/CoreCommon.hs:139:30: No instance for (Applicative (Cont2012-08-14 13:16:12
456970Applicationshardened-kernelUNCONFIRMEDapp-editors/emacs-24.2 failed to emerge with a segmentation fault on hardened-sources-3.7.4-r12013-02-12 22:17:52
447702Core systemhardened-kernelUNCONFIRMEDsys-kernel/hardened-sources-3.7.0 fails to crosscompile for Ski-Simulator: include/linux/gfp.h:295:22012-12-19 09:10:48
442372ApplicationshannoUNCONFIRMEDmail-mta/courier : init.d file lacks "checkpath --directory /var/run/courier" for openrc-0.11.52012-12-12 15:30:37
430870ApplicationshannoUNCONFIRMEDnet-analyzer/openvas-administrator - .../work/openvas-administrator-1.1.1/src/admin.c:877:3: error: 2012-08-12 14:12:23
419841ApplicationshannoUNCONFIRMEDsci-geosciences/merkaartor-0.17.2 - In member function 'virtual void QGPSDDevice::run()': GPS/qgpsde2012-06-08 15:52:51
389861ApplicationsgnustepUNCONFIRMEDgnustep-base/gnustep-make-2.6.1-r1[doc] - mkdir: cannot create directory `gnustep-howto.t2d': File e2011-11-08 15:59:39
457624GNOMEgnomeUNCONFIRMEDgnome-extra/gnome-system-monitor-3.6.1 has incorrect dependency on dev-cpp/glibmm2013-02-14 21:52:35
452648GNOMEgnomeUNCONFIRMEDgnome-base/gnome-panel-3.4.2.1: dconf-client.h: No such file or directory2013-01-21 13:53:08
454474GNOMEgnomeUNCONFIRMEDnet-im/empathy-3.6.3: history uses wrong encoding to show utf8 logs2013-01-28 22:49:52
443282GNOMEgnomeUNCONFIRMEDgnome-base/gnome-shell-3.6.1-r1 : text-scaling-factor doesn't return as user choice after using the 2012-11-16 09:57:17
426676GNOMEgnomeUNCONFIRMEDmail-client/evolution-2.32.3-r1 deleted whole directory with calendars2012-07-21 12:09:48
378931GNOMEgnomeUNCONFIRMEDmail-client/evolution-2.32.3: Changes in Account Editor windows cannot be submitted because of the d2012-03-05 08:17:37
426338genkernelgenkernelUNCONFIRMEDgenkernel 3.4.24_p2: missing separator between old and new kernel version2012-12-03 20:03:30
449726GamesgamesUNCONFIRMEDgames-board/raptor: request for ebuild2013-01-08 08:29:48
411099GamesgamesUNCONFIRMEDgames-simulation/tpt_merbo-1.0 - A mod of The Powder Toy, a particle simulator2012-04-07 15:00:08
407983GamesgamesUNCONFIRMEDsave/restore bug on games-roguelike/rogue-5.4.42012-08-27 09:29:55
402741GamesgamesUNCONFIRMEDNew ebuild: games-rpg/analogue-demo - Analogue: A Hate Story2012-02-08 19:14:06
398167GamesgamesUNCONFIRMEDNew ebuild - games-arcade/steelstorm-br2012-06-07 01:47:17
394625GamesgamesUNCONFIRMEDgames-action/cavestory+ (new ebuild)2013-01-03 05:34:18
380887GamesgamesUNCONFIRMEDgames-emulation/ssnes (plus libsnes) - SNES emulator based on bsnes (new ebuild)2012-09-04 21:28:30
368413GamesgamesUNCONFIRMED(new package) for the games-fps/enemy-territory-cqb2012-04-30 19:23:59
430854GNOMEford_prefectUNCONFIRMEDmedia-sound/pulseaudio-2.1: won't store volume level on gnome 3.2012-08-27 21:33:07
410663Applicationsford_prefectUNCONFIRMEDmedia-sound/pulseaudio - without "flat-volumes = no" in daemon.conf pulseaudio doesn't restore mixer2012-04-04 07:10:48
457010ApplicationsfloppymUNCONFIRMEDnet-misc/flexget-1.0.3344: BUG: Unhandled error in plugin --series: Only '='/'!=' operators can be u2013-02-17 18:32:40
411367EbuildsevermindUNCONFIRMED[pro-audio overlay] media-sound/glashctl-0.4.[2|3] - lashserverinterface.cpp: In constructor 'LASHSe2012-04-11 01:40:34
414829Applicationseric.joshua.martinUNCONFIRMEDwww-apps/rt-4.0.5: Generated.pm configured directories point to /usr/share/webapps instaed of webapp2012-05-06 22:45:45
419685ServererasUNCONFIRMED=net-proxy/squid-3.1.19: eautoreconf in src_prepare() fails in libltdl/2013-01-08 02:24:49
426444ApplicationsemacsUNCONFIRMEDapp-editors/emacs-23.4-r3 fails to build in parallel (--jobs=64)2012-07-18 15:26:44
455302Coredev-portageUNCONFIRMEDdispatch-conf broken: OSError: [Errno 21] Is a directory2013-02-03 17:22:38
430102Unclassifieddev-portageUNCONFIRMEDEmerging in a deleted directory outputs lots of "getcwd: cannot access parent directories: No such f2012-08-21 00:22:33
438816Coredev-portageUNCONFIRMEDsys-apps/portage-2.1.11.9 : /var/tmp/portage/._unmerge_/ directory not cleaned up2012-10-18 17:51:53
410677Ebuildsdev-embeddedUNCONFIRMEDdev-embedded/libftdi-9999.1.0: install docs from cmake build directory2012-04-03 20:37:04
409119ApplicationscppUNCONFIRMEDdev-libs/STLport-5.2.1 - Fatal error: can't create obj/gcc/so/dll_main.o: No such file or directory2012-03-21 09:41:23
442522EbuildscppUNCONFIRMEDboost::unordered_multimap<>::erase(iterator, iterator) broken in boost1.49-1.512012-11-10 11:44:20
450956LibrarycppUNCONFIRMEDdev-libs/boost USE=icu - sub-slot operator causes downgrade to dev-libs/icu-49.1.22013-01-12 13:32:41
444798Ebuildsdeb-toolsUNCONFIRMEDapp-arch/dpkg should create a /etc/dpkg/origins directory and appropriate files2013-02-20 19:39:52
432462ApplicationschainsawUNCONFIRMEDnet-im/jabber-base should not provide /var/run/jabber directory2012-08-24 13:26:45
458546Ebuildsbug-wranglersUNCONFIRMEDtortoisehg requires "svg" use flag2013-02-21 07:58:25
393039FreeBSDbsdUNCONFIRMEDapp-misc/screen on Gentoo/FBSD9 - os.h:275:20: error: utmp.h: No such file or directory2012-12-04 00:53:30
445578ApplicationsbluenessUNCONFIRMEDnet-p2p/bitcoind - Hardcoded paths (/var/run/bitcoind.pid, /usr/bin/bitcoind, var directory) in init2013-02-12 03:34:41
443020ApplicationsbluenessUNCONFIRMEDnet-misc/tor-0.2.4.5_alpha USE=bufferevents [err] channel_closed(): Bug: src/or/channel.c:1315: chan2012-12-12 03:45:35
432206ApplicationsbluenessUNCONFIRMEDnet-misc/arm with dev-lang/python:3.2 - SyntaxError: invalid syntax in print "TorCtl successfully in2013-01-15 13:00:59
456906Core systembase-systemUNCONFIRMEDsys-block/open-iscsi iscsiadm fails with sh: /sbin/iscsid: No such file or directory2013-02-13 18:58:13
416361Core systembase-systemUNCONFIRMEDapp-arch/dump-0.4.44-r1 restore crashes restoring UNIX-domain socket with very long name2012-05-18 14:49:10
401501Core systembase-systemUNCONFIRMEDapp-admin/sysklogd-1.5-r2: syslogd: /var/log/news/news.crit: No such file or directory2012-02-05 15:19:16
376125Applicationsbase-systemUNCONFIRMEDnet-misc/keychain-2.7.1 does not store gpg keys2012-09-19 20:23:16
367325Eclasses and Profilesbase-systemUNCONFIRMEDInconsist save/restore path in savedconfig.eclass2013-01-24 16:21:26
436598Applicationsandrej.filipcicUNCONFIRMEDnet-fs/openafs-1.6.1-r1 USE=doc - dodoc: doc/txt/winnotes is a directory2012-11-19 13:16:17
454242Core systemandrej.filipcicUNCONFIRMEDnet-fs/openafs-1.6.2_pre3 USE=doc - !!! dodoc: doc/txt/winnotes is a directory2013-02-06 16:08:22
454596ApplicationsalexxyUNCONFIRMEDwww-apps/rutorrent-3.4-r1 - ebuild fault: file '/usr/share/webapps/rutorrent/3.4-r1/htdocs/share/set2013-01-29 23:02:40
445550ApplicationsalexxyUNCONFIRMEDwww-apps/rutorrent-3.4-r1: outputs garbage to Apache error.log if PHP is running in strict mode2012-12-02 06:13:37
440660Eclasses and ProfilesadaUNCONFIRMEDgnatbuild.eclass: /etc/ada/primary_compilers: No such file or directory2012-10-31 21:52:05
283819VulnerabilitiessecurityUNCONFIRMEDnet-p2p/bittorrent: Web interface DoS (CVE-2008-7166)2011-09-15 07:37:49
398399ApplicationsvimUNCONFIRMEDapp-editors/vim-7.3.393 - if_perl.c:1102:1: error: static declaration of 'XS_VIM_Msg' follows non-st2012-09-29 14:38:20
373039EbuildslackUNCONFIRMEDx11-plugins/gkrellmss — gkrellmss.h:23:30: fatal error: gkrellm2/gkrellm.h: No such file or director2011-07-03 16:43:54


back



Support us on Content Nation

New Packages

- as rdf newsfeed
- as rss newsfeed
- as Atom newsfeed
2020-04-07
2020-04-06
rdf newsfeed | rss newsfeed | Atom newsfeed
- Powered by LeopardCMS - Running on Gentoo -
Copyright 2004-2020 Sascha Nitsch Unternehmensberatung GmbH
Valid XHTML1.1 : Valid CSS : buttonmaker
- Level Triple-A Conformance to Web Content Accessibility Guidelines 1.0 -
- Copyright and legal notices -
Time to create this page: 15.1 ms