from small one page howto to huge articles all in one place
 

search text in:




Other .linuxhowtos.org sites: www.linuxhowtos.org
toolsntoys.linuxhowtos.org



Last additions:
How to make X listen on port 6000

How to make X listen on port 6000

words:

34

views:

37021

userrating:

average rating: 1.5 (4 votes) (1=very good 6=terrible)


May, 25th 2007:
April, 26th 2007:
Apr, 10th. 2007:
Druckversion . pdf icon
You are here: Portage


Details of mail-client/mo:

available versions:

releasesalphaamd64armhppaia64mipsppcppc64ppc macoss390shsparcx86USE-Flagsdependenciesebuild warnings
Legend:
+ stable
~ testing
- not available
some ebuild warning depend on specific use-flags or architectures, all ebuild-warnings are shown.

Known bugs:
bug IDcomponentassigned tostatusdescriptionlast change
440380Core systembase-systemUNCONFIRMEDsys-boot/lilo: unmerging when /boot isn't mounted cleans /boot2012-11-02 08:21:22
434702ApplicationsspingUNCONFIRMEDmedia-sound/mp3splt-gtk-0.7.3: QA Notice: This package installs one or more .desktop files that do n2012-11-21 18:48:15
441720PrintingprintingUNCONFIRMEDnet-print/cups-1.6.1: QA Notice: This package installs one or more .desktop files that do not pass v2012-11-27 16:02:55
453772OpenRCopenrcUNCONFIRMEDsystemwide use of taskset for pinning daemons to cpus on multicore systems2013-02-02 14:39:49
436992GNOMEgnomeUNCONFIRMEDgnome-base/gvfs-1.12.3-r1 - /usr/share/applications/mount-archive.desktop: warning: key "Encoding" i2012-11-21 18:48:43
441718GNOMEgnomeUNCONFIRMEDgnome-base/libbonoboui-2.24.5: QA Notice: This package installs one or more .desktop files that do n2012-11-21 18:48:50
434704ApplicationsgpeUNCONFIRMEDx11-misc/matchbox-keyboard-0.1: QA Notice: This package installs one or more .desktop files that do 2012-11-21 18:48:19
451946ApplicationszerochaosUNCONFIRMEDdev-ruby/metasploit_data_models-0.4.0 version bump request2013-01-15 12:25:13
453964ApplicationsyngwinUNCONFIRMEDapp-admin/eselect-lcdfilter fails to remove symlink /etc/env.d/99lcdfilter@ upon removal.2013-01-26 15:34:37
455098ApplicationsxmwUNCONFIRMEDx11-wm/xpra-0.8.0 tries to remove non-existing files and fails2013-02-05 08:03:17
412779EbuildsxmwUNCONFIRMEDx11-misc/remoot: new package2012-04-23 12:04:22
416919ApplicationsxfceUNCONFIRMEDxfce-base/xfce4-session causes X to crash on login with external monitor2012-05-23 13:59:46
450664Applicationsx11UNCONFIRMEDapp-emulation/wine-1.4.1 with >=x11-base/xorg-server-1.11 - mouse behaves erratically2013-01-08 04:22:22
447862Applicationsx11UNCONFIRMEDx11-drivers/xf86-video-ati, x11-base/xorg-server or related components memory leak2013-01-03 13:26:06
444566Unspecifiedx11UNCONFIRMEDx11-drivers/ati-drivers-12.11_beta: fglrx(0): unable to query kernel module!2012-11-24 15:58:50
427632Applicationsx11UNCONFIRMEDx11-drivers/xf86-input-evdev-2.7.0 breaks y-direction emulateWheel for Kensington Expert Mouse2012-07-25 22:35:22
420733Applicationsx11UNCONFIRMEDx11-drivers/ati-drivers-12.4 - fgrlx module crash on startx2012-06-13 09:46:44
419985Ebuildsx11UNCONFIRMEDx11-drivers/xf86-video-intel - Add plymouth integration2012-09-11 07:58:49
417967Applicationsx11UNCONFIRMED>=x11-drivers/xf86-input-synaptics-1.6.0: click-and-drag does not work anymore2012-05-28 13:28:24
403277Applicationsx11UNCONFIRMEDwww-client/firefox 1080p html5 videos do not play smoothly2012-02-13 01:14:15
368161Applicationsx11UNCONFIRMEDx11-apps/xinit w/ sys-apps/openrc-0.8.2-r1 start-stop-daemon ignores PAM settings for user root2011-05-24 18:46:56
367319Applicationsx11UNCONFIRMEDx11-base/xorg-server: After a change my keyboard to USB model, no X-programs starts and Xorg log con2011-05-16 08:42:50
457858Core systemwschlichUNCONFIRMEDsys-fs/inotify-tools moved from SourceForge to GitHub2013-02-17 17:03:51
455080Core systemwschlichUNCONFIRMEDsys-process/fcron-3.1.1 - Files were moved without updating default selinux file context policies, p2013-02-02 17:38:34
428628EbuildswschlichUNCONFIRMEDsys-block/megacli monitoring script2013-01-07 17:05:25
424161ApplicationswltUNCONFIRMEDdev-db/firebird ebuild should not remove MSG_NOSIGNAL flag on x862012-07-03 13:51:46
392379ApplicationsvmwareUNCONFIRMEDapp-emulation/vmware-modules-238.5: vmmon-only/linux/hostif.c:2749:4: error: implicit declaration of2012-03-26 11:36:37
388983EbuildsvmwareUNCONFIRMEDapp-emulation/vmware-modules-238.5 with sys-kernel/hardened-sources-3.0.4-r4 - work/vmci-only/linux/2013-01-18 22:06:24
453418ApplicationsvimUNCONFIRMEDapp-editors/vim-core-7.3.762 Opened file gets modified when mapping g to some other value2013-01-22 02:03:25
423551EbuildsvimUNCONFIRMEDapp-vim/matrix - high memory usage / memory leak2012-07-11 01:20:36
439280LibraryvadimkUNCONFIRMEDapp-emulation/vmware-modules-264.4 - missing return carriage in printk in VNetUserIfSetUplinkState()2012-10-23 10:12:15
455276DevelopmentvapierUNCONFIRMEDdev-cpp/gmock-1.6.9 with python3 fails to execute test suite2013-02-05 11:28:28
457694ApplicationsultrabugUNCONFIRMED>=dev-db/mongodb-2.0.7 does not build and install libmongoclient.so anymore2013-02-15 17:20:16
421289ApplicationsultrabugUNCONFIRMEDdev-db/mongodb-2.0.6: Add support for USE="ssl"2012-12-23 14:34:12
424189Core systemudev-bugsUNCONFIRMEDsys-fs/udev-171-r6: all modules are loaded even with rc_coldplug="NO"2013-02-08 17:46:29
398089ApplicationstristanUNCONFIRMEDx11-misc/revelation-0.4.11-r2 USE=applet - configure:13842: error: failed to find module gnomeapplet2012-01-10 00:03:01
457726Third-Party Toolstools-portageUNCONFIRMEDapp-portage/layman-2.0.0 - buggy quiet mode2013-02-15 16:56:10
456912Core systemtoolchainUNCONFIRMEDsys-libs/glibc-2.17 - remove patch 6600_mips_librt-mips.patch2013-02-18 19:15:45
454200Core systemtoolchainUNCONFIRMEDsys-libs/glibc-2.17 breaks almost all binaries - error while loading shared libraries: libgcc_s.so.12013-02-09 05:39:00
453514Core systemtoolchainUNCONFIRMEDsys-libs/glibc-2.15-r3: nscd initscript fails while daemon starts2013-01-22 22:51:57
437316Core systemtoolchainUNCONFIRMEDsys-devel/prelink-20120628: read-only files (mounts) trigger abort: Could not rename temporary to ..2013-01-23 11:03:37
434452EbuildstoolchainUNCONFIRMED[4.5/ICE] www-client/firefox-15.0.1 - .../work/mozilla-release/js/src/vm/ObjectImpl.cpp:485:1: inter2012-12-07 08:28:56
409041Core systemtoolchainUNCONFIRMEDcross-x86_64-linux-uclibc/gcc-4.6.2: fails on gcc-stage1 - work/gcc-4.6.2/libgcc/generic-morestack-t2012-03-20 21:02:01
435426ApplicationstommyUNCONFIRMEDdev-vcs/subversion-1.6.17-r7 USE=-perl still depends on dev-lang/perl through perl-module.eclass2012-11-05 09:43:38
414429EbuildstommyUNCONFIRMEDdev-vcs/subversion-1.7.4 mod_dav_svn UTF8 patch2012-05-03 03:43:46
450662ApplicationsThyArmageddon+GentooUNCONFIRMEDmedia-video/subdownloader - /usr/bin/subdownloader: File "/usr/share/subdownloader/modules/configura2013-02-16 19:47:24
415423EbuildstexUNCONFIRMEDupdate moderncv (included in dev-texlive/texlive-latexextra)2013-01-09 16:50:56
452910Core systemsystemdUNCONFIRMEDsys-apps/systemd-196[python] needs dev-python/pygobject:3 - ImportError: No module named gi.reposito2013-01-20 17:07:04
434090Core systemsystemdUNCONFIRMEDsys-apps/systemd - mount and df list devices multiple times2012-09-19 18:51:11
444022ApplicationssysadminUNCONFIRMEDnet-analyzer/nagios-plugins-1.4.16-r{2,3}: check_ping CRITICAL - You need more args!!!2012-11-21 09:27:19
458018ServerswegenerUNCONFIRMEDnet-dns/pdns need more strict permissions for pdns.conf (security threat)2013-02-17 18:26:06
418185ApplicationssoundUNCONFIRMEDmedia-sound/xmp-3.5.0 fails to play LZMA compressed module2012-06-03 13:36:25
437186LibrarysoundUNCONFIRMEDmedia-libs/libclthreads has wrong DESCRIPTION and HOMEPAGE and should be moved to different category2012-10-04 17:21:28
453748EbuildssoundUNCONFIRMEDmedia-libs/fmod-4.44.04 version bump2013-01-24 02:59:38
455162DevelopmentssuominenUNCONFIRMEDdev-util/catfish-0.4.0.2 needs dev-python/pygobject:3 in RDEPEND - Error: The required module gi.rep2013-02-04 02:33:15
415305EbuildssoundUNCONFIRMEDmedia-sound/shoutcast-server-bin - update HOMEPAGE so that pkg_nofetch() is more helpful2012-10-28 04:33:12
432378Applicationsshell-toolsUNCONFIRMEDapp-shells/bash-completion - hard-coded path "/sbin/modinfo" in /usr/share/bash-completion/module-in2012-11-03 18:30:08
424041ApplicationssgmlUNCONFIRMEDapp-text/sgml-common-0.6.3-r5 fails with automake-1.12 - mkdir -p2012-10-13 18:56:21
402023KernelsecurityUNCONFIRMEDThe Linux kernel, when using IPv6, allows remote attackers to determine whether a host is sniffing t2012-02-03 04:38:20
418281Applicationssci-mathematicsUNCONFIRMED[sci-overlay] sci-mathematics/scilab-5.3.3-r1 - .../work/scilab-5.3.3/modules/renderer/src/java/org/2012-12-25 13:20:36
439438Ebuildssci-chemistryUNCONFIRMEDsci-chemistry/wxmacmolplt-7.4.3 version bump2012-10-23 19:24:23
421417Ebuildssci-electronicsUNCONFIRMEDsci-electronics/kicad-99999999 - .../work/kicad-99999999/include/common.h:50:9: error: #error "You m2012-07-07 20:05:00
449320LibrarysciUNCONFIRMEDsci-libs/cholmod-2.0.1 - configure: .../temp/ccKrajc0.o: In function `main': conftest.c:(.text+0x7):2013-01-05 00:28:07
449232ApplicationssciUNCONFIRMED[science overlay] sci-libs/cholmod-2.0.1: pkg-config fails to find lapack libraries installed from s2013-01-29 19:26:55
419921LibrarysciUNCONFIRMED[science overlay] sci-libs/framewave-1.3.1 - At global scope: domain/common/include/fe.h:1305:19: er2012-06-26 07:30:08
405807ApplicationssciUNCONFIRMEDsci-libs/blas-reference-20120215-r1 - eselect: Can't load module blas2012-02-27 15:25:26
435570ApplicationssambaUNCONFIRMED>=net-fs/cifs-utils-5.5-r1 - users cannot mount shares2012-09-24 13:00:56
448780DevelopmentrubyUNCONFIRMED=dev-ruby/webmock-1.7.4 - Many tests failed.2013-02-20 06:24:05
454562ApplicationsroxUNCONFIRMEDrox-extra/archive - deprecation warning about python_mod_cleanup()2013-01-29 19:23:09
395929EbuildsroxUNCONFIRMEDrox-base/mime-editor-0.6: uses still python_mod_optimize()2011-12-24 20:01:06
425758EbuildsroxUNCONFIRMEDrox-base/rox-lib - Deprecation Warning: Usage of python_mod_optimize() in packages not support......2012-07-18 09:48:32
392463EbuildsroxUNCONFIRMEDrox-extra/roxcd: Deprecation Warning about of python_mod_cleanup()2012-09-09 01:16:09
458262baselayoutrobbat2UNCONFIRMEDsys-fs/lvm2 Failed to find sysfs mount point when starting2013-02-20 16:20:15
454746Core systemrobbat2UNCONFIRMEDsys-fs/lvm2-2.02.97-r1, sys-fs/udev-197-r4: /dev/mapper entries absent for dm-crypt partitions mount2013-02-04 01:37:50
451966Applicationsrobbat2UNCONFIRMEDapp-misc/g15daemon start-stop-daemon: fopen `/var/run/g15daemon.pid': No such file or directory2013-01-15 12:27:28
448470Core systemrobbat2UNCONFIRMEDsys-process/audit-2.2.2 incorrectly suggests removal of /lib/libauparse.so.02013-02-03 19:08:30
437718Core systemrobbat2UNCONFIRMEDsys-fs/lvm2-2.02.97 /etc/init.d/lvm-monitoring slows down boot and shutdown on systems with multiple2012-12-23 09:48:04
434186Applicationsrobbat2UNCONFIRMEDmedia-gfx/monica: HOMEPAGE and SRC_URI change2012-09-07 08:58:39
435304Unspecifiedrobbat2UNCONFIRMEDapp-portage/g-cpan-0.16.4-r1 generates broken ebuild depending on perl-g-cpan instead of dev-perl mo2013-02-21 07:50:32
417785Ebuildsrobbat2UNCONFIRMEDapp-portage/g-cpan-0.16.4 broken regexp building for some cpan modules2012-05-30 09:21:46
454652StagesreleaseUNCONFIRMEDcurrent stage3-amd64-nomultilib has an immediate block between sys-apps/module-init-tools and sys-ap2013-01-30 14:46:25
421239EbuildsrafaelmartinsUNCONFIRMEDdev-lua/luadoc - lua: /usr/bin/luadoc:7: module 'luadoc' not found: ...2013-02-03 13:14:21
458278DevelopmentqtUNCONFIRMEDdev-util/eric-5.2.7 - RuntimeError: the sip module implements API v9.0 to v9.1 but the PyKDE4.kdeui 2013-02-21 12:24:07
457024LibraryqtUNCONFIRMED[qt overlay] add Qt5 tools module2013-02-13 10:20:17
448178LibraryqtUNCONFIRMED[qt overlay] x11-libs/qt-webkit-5.0.0: Project ERROR: Unknown module(s) in QT: opengl2013-01-09 08:46:26
433944KDEqtUNCONFIRMEDdev-python/PyQt4 does not install phonon-module2013-01-02 12:49:56
375879Ebuildsqmail-bugsUNCONFIRMED[PATCH] mail-mta/netqmail: Add SMTP authentication support (AUTH LOGIN) to qmail-remote2012-02-24 13:11:27
457676DevelopmentpythonUNCONFIRMEDdev-python/pymad-0.6 madmodule.so is segfaulting as soon as it is invoked2013-02-15 17:17:34
439724ApplicationspythonUNCONFIRMED>app-editors/leo-4.9 USE =tk is not needed anymore2012-10-26 16:26:57
427244DevelopmentpythonUNCONFIRMEDdev-python/networkx 1.7 - Syntax errors / warnings in Python modules for CPython 3.2: File "/usr/lib2013-01-22 11:57:15
425152ApplicationspythonUNCONFIRMEDdev-python/genshi-0.6: ebuild does not expose speedups c module2012-07-27 20:44:20
402659DevelopmentpythonUNCONFIRMEDdev-python/pydb-1.26-r1 - ImportError: No module named fns2012-04-24 16:19:54
412715EbuildsproaudioUNCONFIRMEDmedia-plugins/swh-plugins: please remove obsolete DEPEND="dev-vcs/cvs"2012-04-21 17:31:26
389633Unspecifiedproxy-maintUNCONFIRMEDx11-drivers/xf86-input-wacom / sys-kernel/linuxwacom-module - missing udev rules for wacom2013-02-16 14:37:56
455238LibraryprintingUNCONFIRMEDmedia-libs/vigra-1.7.1-r1 failed (compile phase): ImportError: No module named nose2013-02-05 01:00:18
445278PrintingprintingUNCONFIRMED>=net-print/cups-1.5.3 - Broken for some printer models [prints half last page]2013-02-19 17:40:28
403327PrintingprintingUNCONFIRMEDnet-print/foomatic-db-ppds-4.0.20120117-r1: Missing NickName and ModelName in /usr/share/cups/model/2012-02-14 21:13:08
433972Prefix SupportprefixUNCONFIRMEDapp-text/tree-1.6.0-r1: failed to compile on Mac OSX Mountain Lion2012-10-10 01:23:24
404207Prefix SupportprefixUNCONFIRMEDcheck-reqs.eclass fails to check memory size2012-02-19 13:27:22
447534Applicationspolynomial-cUNCONFIRMEDapp-emulation/virtualbox-4.1.22-r1 - VBox/Runtime/common/string/strformatrt.cpp:829:19: internal com2012-12-23 18:30:14
444464Applicationspolynomial-cUNCONFIRMEDapp-emulation/virtualbox-4.1.22 - .../work/VirtualBox-4.1.22/src/VBox/Runtime/common/err/errmsg.sed 2012-12-23 18:15:49
447302Applicationspolynomial-cUNCONFIRMEDapp-emulation/virtualbox-modules-4.2.4 with gentoo-sources-3.7.0 - Header files were moved and re-or2013-02-03 19:32:07
447356Unspecifiedpolynomial-cUNCONFIRMEDapp-emulation/virtualbox-modules-4.2.4 with kernel 3.7 - modprobe: FATAL: Error inserting vboxdrv (/2013-02-14 10:04:16
442876Applicationspolynomial-cUNCONFIRMEDapp-emulation/virtualbox-4.2.4: after upgrade some VMs do not start anymore2013-01-02 19:55:58
440532Applicationspolynomial-cUNCONFIRMEDapp-emulation/virtualbox-modules-4.1.22: some elog messages should only be shown when upgrading from2012-10-31 16:22:12
438930Ebuildspolynomial-cUNCONFIRMEDapp-emulation/virtualbox-4.2 USE=vnc - vnc module is built but not installed2012-12-21 18:07:10
432884Ebuildspolynomial-cUNCONFIRMEDapp-emulation/virtualbox-modules: undeclared 'VM_RESERVED'2013-01-24 15:45:20
436360Applicationspolynomial-cUNCONFIRMEDwww-client/seamonkey-2.12.1 - /bin/sh: line 1: 24652 Aborted .../work/comm-release/seamonk/suite/ins2012-09-28 14:44:46
438164Unspecifiedpolynomial-cUNCONFIRMEDapp-emulation/virtualbox - EQ overflow in X server when virtualbox starts with Wacom tablet's mouse 2012-10-14 18:22:06
401823Applicationspolynomial-cUNCONFIRMEDseamonkey desktop file lists unhandled mimetype associations2012-02-16 12:48:55
404345Applicationspolynomial-cUNCONFIRMEDapp-emulation/virtualbox-modules-4.1.4 - work/vboxpci/linux/VBoxPci-linux.c:989:9: Fehler: Zu wenige2012-02-18 16:57:37
423355Applicationspolynomial-cUNCONFIRMEDapp-emulation/virtualbox - remove `-f' from VBox_load_modules2012-07-26 14:30:14
426898Applicationspolynomial-cUNCONFIRMED=app-emulation/virtualbox-modules-4.1.12 with sys-kernel/vanilla-sources-3.4.5 - src_test(): .../wor2012-11-13 17:18:09
427228Applicationspolynomial-cUNCONFIRMED>=www-client/seamonkey-2.10: cannot install any more addons dictionaries2012-07-26 07:50:15
395429Ebuildspolynomial-cUNCONFIRMEDapp-emulation/virtualbox-modules: need check CONFIG_HZ=value2011-12-21 02:10:58
379967Applicationspolynomial-cUNCONFIRMEDapp-emulation/virtualbox-modules-4.0.12 doesn't check kernel config on compatibility2011-08-22 12:36:13
453412Developmentphp-bugsUNCONFIRMEDdev-php/PHPUnit_MockObject-1.2.3 - Version Bump2013-02-19 17:42:20
449264Libraryphp-bugsUNCONFIRMEDdev-php/pecl-mongo-1.3.2 version bump2013-01-08 14:42:51
456938DevelopmentperlUNCONFIRMEDdev-perl/XML-SAX-0.990.0, dev-perl/XML-SAX-Base-1.80.0: Fail to remove vendor_perl/.../ParserDetails2013-02-13 19:14:50
448198DevelopmentperlUNCONFIRMEDdev-lang/perl/perl-5.12.4-r1 ebuild should not print missing symlinks warnings when package is remov2012-12-25 15:04:45
440142LibraryperlUNCONFIRMEDdev-perl/XML-LibXML - Segmentation fault when removing child nodes with entity or namespace subnodes2012-10-29 19:19:42
438660Eclasses and ProfilesperlUNCONFIRMEDperl-module.eclass should not delete .packlist files2012-10-17 12:43:39
420033DevelopmentperlUNCONFIRMEDdev-perl/MooseX-Types-DateTimeX fails tests with MooseX-Types-DateTime-ButMaintained-0.140.02012-06-07 09:09:11
400659DevelopmentperlUNCONFIRMEDperl-core/Module-Build and dependencies on it are unnecessary2012-01-29 00:25:09
374149DevelopmentperlUNCONFIRMEDMoose-2.1.0 conflicts with all existent versions of File-ChangeNotify, MooseX-Params-Validate, and M2011-07-10 03:47:03
455268DevelopmentpchristUNCONFIRMED=dev-lisp/sbcl-1.1.3 - WARNING! Some of the contrib modules did not build successfully or pass the2013-02-05 16:16:54
447774Core systempatrickUNCONFIRMEDsys-libs/tdb-1.2.11: tdb.h uses mode_t but does not include relevant system header2012-12-19 02:24:08
438758ServerpatrickUNCONFIRMEDwww-servers/apache-2.4 - Syntax error on line 60 of /etc/apache2/modules.d/40_mod_ssl.conf: Invalid 2013-02-16 13:32:50
432910ApplicationspatrickUNCONFIRMEDapache2-2.2.22 mod_proxy_ftp segfaults on IPv4 requests to hosts with DNS AAAA records2013-02-16 14:06:24
432326EbuildspatrickUNCONFIRMEDapp-emulation/virtualbox-guest-additions should add group "vboxsf" to support automount shared folde2012-10-23 10:19:47
430274EbuildspatrickUNCONFIRMEDwww-servers/apache-2.2.22-r1: modules aren't compiled with -fPIC2013-02-16 13:34:26
427946Eclasses and ProfilespatrickUNCONFIRMEDapache-2.eclass: Proposed enhancement: USE_EXPAND of APACHE2_MODULES should support IUSE-DEFAULTS2013-02-17 09:25:03
403439ServerpatrickUNCONFIRMEDwww-servers/apache: remove deprecated AddDirectoryIndex from default config2013-02-16 14:05:28
379003LibrarypatrickUNCONFIRMEDsys-libs/tevent-0.9.12 fails on portage-multilib because of waflib module's python support2012-12-25 21:03:18
373979EbuildspatrickUNCONFIRMEDapp-emulation/virtualbox-modules-4.0.10 does not compile if KBUILD_OUTPUT != KERNEL_DIR2012-09-11 09:29:19
456934Other documentsoverlaysUNCONFIRMEDSince the 2012-09-09-make.conf-and-make.profile-move the overlay instructions are out of date2013-02-13 10:03:36
455458OpenRCopenrcUNCONFIRMEDsys-apps/openrc - netmount fuser timeout - stopping the netmount script on shutdown. cifs shares won2013-02-06 12:18:47
452776OpenRCopenrcUNCONFIRMEDsys-apps/openrc-0.11.*: system fails to shutdown with automount+nfs2013-02-16 13:44:26
447678OpenRCopenrcUNCONFIRMEDsys-apps/openrc-0.11.8 - rm: cannot remove /run/openrc: Read-only file system2012-12-19 17:54:11
444610OpenRCopenrcUNCONFIRMEDsys-apps/openrc output is unfriendly on high resolution/wide monitors2012-11-24 19:46:03
443480OpenRCopenrcUNCONFIRMEDsys-apps/openrc: iproute2 net module: add xfrm ( ipsec ) support2012-11-17 08:02:46
442594OpenRCopenrcUNCONFIRMEDsys-apps/openrc-0.11.4: ifconfig module doesn't support ipv6 routes without explicit prefix2012-12-25 09:18:25
427998OpenRCopenrcUNCONFIRMEDsys-apps/openrc: The root script does not work correctly if root or any filesystems it remounts are 2012-10-18 17:42:12
430318OpenRCopenrcUNCONFIRMEDsys-apps/openrc-0.10.5 fails to remounts reiserfs root file system read only on reboot: failed becau2012-11-07 11:40:40
375597OpenRCopenrcUNCONFIRMEDsys-apps/openrc: netmount hangs with dead remotes2012-11-18 21:55:02
456980ApplicationsopenofficeUNCONFIRMEDapp-office/libreoffice-4.0.0.3 - inserting movie or sound in impress fails with "The format of the s2013-02-13 19:08:21
366779OpenRCopenrcUNCONFIRMEDsys-apps/openrc - "cannot allocate memory" when overcommit is disabled2012-02-27 14:07:23
369811ApplicationsopenrcUNCONFIRMEDsys-apps/openrc: Patch to measure time required for starting daemons (was: delay to sys-auth/console2012-05-20 13:25:32
449104GNOMEopenofficeUNCONFIRMEDThe variable OOO_FORCE_DESKTOP=gnome don't work anymore with Libreoffice and Openbox2012-12-30 16:53:23
445492ApplicationsnirbheekUNCONFIRMEDgnome-extra/nm-applet-0.9.6.4 leaks memory2012-12-01 16:22:15
440466ApplicationsnirbheekUNCONFIRMEDnet-misc/modemmanager-0.5.2.0-r3: some elog messages should only be shown for the first install.2012-10-31 16:16:29
429372EbuildsnirbheekUNCONFIRMEDdev-python/pypy-1.9-r1 FEATURES=sandbox - Fatal error during initialization: out of memory2012-08-02 11:53:03
456024ApplicationsnikoliUNCONFIRMEDmedia-sound/clementine 1.1.1 crashes with 0 size .mood file when moodbar is enabled in the playlist2013-02-07 14:14:11
427146ApplicationsnetmonUNCONFIRMEDnet-analyzer/ntop - Segfaulting with high load netFlow monitoring2012-09-25 17:27:26
366159EbuildsnetmonUNCONFIRMEDnet-analyzer/hping: Patch to make hping's traceroute mode increment TTL after N retries2011-05-10 20:33:04
425196Developmentnet-proxyUNCONFIRMEDnet-proxy/adzapper needs flush.pl (removed from dev-lang/perl-5.16.0)2012-09-30 19:55:13
387009Applicationsnet-mailUNCONFIRMEDnet-mail/fetchmail - modified initscript to allow multiple daemons AND inlined configuration2011-11-08 12:12:48
409425Applicationsnet-imUNCONFIRMED>=net-im/ejabberd-2.1.0: add USE=mod_admin_extra2012-03-23 15:19:46
410017Ebuildsnet-imUNCONFIRMEDnet-im/ejabberd - add patch for remote roster2013-01-24 10:41:29
458024Applicationsnet-fsUNCONFIRMEDnet-nds/rpcbind with sys-libs/uclibc - security.c:23:26: fatal error: rpcsvc/mount.h: No such file o2013-02-20 11:38:41
453778Ebuildsnet-fsUNCONFIRMEDnet-fs/autofs - sandbox violation in `mount -s' touching /run/mount2013-02-16 13:20:27
453962Core systemnet-fsUNCONFIRMEDnet-fs/autofs-5.0.6-r5: umount automounted NFS share fails2013-02-16 13:31:29
453306Applicationsnet-fsUNCONFIRMEDnet-fs/nfs-utils-1.2.6: mount.nfs: Cannot allocate memory2013-01-31 15:57:57
443636Core systemnet-fsUNCONFIRMEDnet-fs/davfs2-1.4.7 - User mount does not work, no entry for http://HOST/owncloud/files/webdav.php f2013-02-13 22:40:25
440286Ebuildsnet-fsUNCONFIRMEDnet-nds/rpcbind - add support for warm restarts of rpcbind daemon2013-01-10 20:33:08
439660Ebuildsnet-fsUNCONFIRMEDnet-fs/nfs-utils nfsmount init script should drop need net2012-11-19 20:31:41
413173Applicationsnet-fsUNCONFIRMEDnet-fs/nfs-utils - /etc/init.d/nfs and /etc/init.d/nfsmount calculate their dependencies incorrectly2012-05-18 05:15:48
402343Servernet-fsUNCONFIRMEDnet-fs/netatalk /etc/init.d/afpd needs avahi-daemon even if called with -nozeroconf2012-04-08 21:14:32
448958Ebuildsnet-dialupUNCONFIRMEDnet-dialup/gtk-imonc description should say "GTK+ 2" not "GTK+-2"2012-12-28 14:39:28
364941Ebuildsnet-dialupUNCONFIRMEDnet-dialup/rp-pppoe kernel-mode PPPoE support2011-04-26 19:48:13
383405Servermysql-bugsUNCONFIRMEDmod-auth-mysql: version bump and enhancements2012-11-27 20:00:29
371369Applicationsmysql-bugsUNCONFIRMEDmod-auth-mysql-4.3.9: LoadModule statement is wrong (with solution)2012-11-27 19:59:19
382055Servermysql-bugsUNCONFIRMEDmod-auth-mysql-4.3.9: The module crashes when the web service is under heavy concurrent load2012-11-27 20:00:04
456904ApplicationsmozillaUNCONFIRMED[mozilla overlay] dev-lang/spidermonkey-1.8.8 - ./dist/include/js/HashTable.h:898:9: error: size of 2013-02-12 16:50:39
451504ApplicationsmozillaUNCONFIRMEDwww-client/firefox-18.0/www-client/seamonkey-2.15 failed (install phase) [to emerge]; incorrect pag2013-02-07 15:47:44
439558EbuildsmozillaUNCONFIRMEDdev-lang/spidermonkey-1.8.5-r1 x32 fails to build2012-10-24 21:49:59
442692ApplicationsmozillaUNCONFIRMEDwww-client/firefox-16.0.2 mail-client/thunderbird-16.0.1-r1 - comm-release/tbird/mozi - Segmentation2012-11-30 06:41:13
434542ApplicationsmozillaUNCONFIRMEDwww-client/firefox-bin-15.0 is trying to automatically upgrade via Mozilla Upgrade path2013-02-20 21:53:50
439148LibrarymozillaUNCONFIRMED{www-client/firefox,mail-clientthunderbird}-bin-{15,16},seamonkey-bin-2.13.2 with net-libs/libproxy-2013-01-22 19:39:26
439244UnspecifiedmozillaUNCONFIRMEDwww-client/firefox-16.0.1 - .../work/mozilla-release/memory/jemalloc/src/src/jemalloc.c:1736:1: erro2013-01-14 08:53:52
431560DevelopmentmozillaUNCONFIRMEDdev-lang/spidermonkey-1.8.2.15: building w/uClibc fails due to finite() vs isfinite()2013-02-18 06:26:46
422447ApplicationsmozillaUNCONFIRMEDwww-client/firefox 10.0.5 creates /tmp/mozilla-media-cache2012-06-20 12:56:08
417687ApplicationsmozillaUNCONFIRMEDmail-client/thunderbird www-client/seamonkey segfault at startup if nss_ldap/openldap are installed2012-10-22 16:13:48
415805Eclasses and ProfilesmozillaUNCONFIRMEDmozcoreconf-2 eclass should filter MOZCONFIG env variable in moz_pkgsetup()2012-05-24 01:55:40
388647Eclasses and ProfilesmozillaUNCONFIRMEDmozextension.eclass: Add new function for installing extensions in new standard install location2012-05-23 18:22:51
409295ApplicationsmozillaUNCONFIRMEDmail-client/thunderbird-bin-10.0.2 - HTTP links cannot be opened - Failed to load native module at p2012-03-23 15:08:47
435674Applicationsmobile-phoneUNCONFIRMEDapp-mobilephone/gnome-phone-manager-0.68: phonemgr.c:47:2: error: too many arguments to function 'bl2012-12-18 08:29:47
398113Ebuildsmobile-phoneUNCONFIRMEDapp-mobilephone/obexftp: disable unnecessary dev-lang/perl[-build] dependency2013-01-01 22:54:07
417525Ebuildsmobile-phoneUNCONFIRMEDapp-mobilephone/dfu-util-0.7 version bump2013-01-25 02:12:45
391705Applicationsmobile-phoneUNCONFIRMEDapp-mobilephone/kannel-1.5.0 version bump2011-11-24 17:47:28
453338LibrarymlUNCONFIRMEDdev-ml/lablgl-1.04 - File "togl.mli", line 4, characters 14-29: Error: Unbound module Widget2013-02-01 06:27:17
411829Applicationsmirror-adminUNCONFIRMEDwww-apps/mirmon-2.5 version bump2012-04-24 16:58:27
455048Eclasses and ProfilesmgornyUNCONFIRMED[git-2.eclass] Add support for submodules in non-bare clones.2013-02-02 21:35:22
411521ApplicationsmgornyUNCONFIRMEDapp-arch/zpaq-4.04 execution attempt in: 2013-01-12 17:31:30
455058Applicationsmedia-videoUNCONFIRMEDmedia-video/gxine with dev-lang/spidermonkey-1.8.8 - build fails to find mozjs2013-02-05 11:27:23
437704Applicationsmedia-videoUNCONFIRMEDmedia-video/gpac-0.4.5-r5: wxOsmo4.o: undefined reference to symbol 'gtk_widget_get_parent_window'2012-10-09 15:40:38
412457Librarymedia-videoUNCONFIRMEDmedia-video/gpac-0.4.5-r4 - ld: wxOsmo4.o: in function wxCreateApp():wxOsmo4.cpp(.text+0x1c): error:2012-04-18 15:19:39
405173Applicationsmedia-videoUNCONFIRMEDmedia-video/vlc-2.0.0 - /bin/sh: line 4: 2215 Segmentation fault ./vlc-cache-gen ../modules2012-09-19 13:09:28
370275Applicationsmedia-videoUNCONFIRMEDmedia-video/libav-0.7_pre20110327 error: selected processor does not support ARM mode2011-10-26 17:48:22
406775Applicationsmedia-tvUNCONFIRMEDapp-misc/lirc - lircd reports "read invalid data from device /dev/lirc0" and no more output afterwar2012-03-05 19:44:56
367699Ebuildsmedia-videoUNCONFIRMEDmedia-video/winki - winki: [..] ImportError: No module named gnome (missing RDEPEND?)2011-05-17 23:55:09
390233Ebuildsmedia-tvUNCONFIRMEDmedia-tv/tvtime : request for patch merge (for wide monitors)2011-11-15 00:33:44
377641Applicationsmedia-tvUNCONFIRMEDapp-misc/lirc-0.9.0 doesn't work with most keys in imon_pad2012-04-27 12:09:04
457172Eclasses and ProfilesmaxUNCONFIRMEDssl-cert.eclass should use more secure defaults for crypto functions / keylengths2013-02-19 06:49:28
418007DevelopmentmaksbotanUNCONFIRMEDdev-python/scrapy-0.14.4 fails in setup while parsing urlparse_monkeypatches.py2012-06-14 16:40:49
438530ApplicationsmaksbotanUNCONFIRMEDx11-wm/awesome-3.4.13 USE=gnome - add application file for gdu-notification-daemon2013-02-06 12:31:57
458336Ebuildsmaintainer-wantedUNCONFIRMEDdev-db/libodb - ODB common runtime library (dev-db/odb dependency)2013-02-19 22:12:23
457096Ebuildsmaintainer-wantedUNCONFIRMEDapp-admin/isohost-tools-0.1 - isoho.st remote management tools2013-02-15 15:04:21
456698Ebuildsmaintainer-wantedUNCONFIRMED[ebuild] net-proxy/c-icap-modules new ebuild2013-02-11 17:28:54
453658Ebuildsmaintainer-wantedUNCONFIRMEDdev-util/jenkins - application that monitors executions of repeated jobs, such as building a softwar2013-01-30 11:30:11
452850Ebuildsmaintainer-wantedUNCONFIRMEDwww-apps/snorby - Ruby on Rails application for network security monitoring2013-01-18 17:12:00
450300Ebuildsmaintainer-wantedUNCONFIRMEDx11-misc/menulibre - An advanced menu editor that provides modern features in a clean, easy-to-use i2013-01-27 17:35:31
447194Ebuildsmaintainer-wantedUNCONFIRMEDapp-misc/wiimotedev-1.4.0 - Wii Remote utilities2012-12-15 08:58:36
447222Applicationsmaintainer-wantedUNCONFIRMEDAdd standalone xulrunner for MonoDevelop.2013-01-15 08:03:00
446076Developmentmaintainer-wantedUNCONFIRMEDdev-lua/tir-0.9.3.3 - simple Lua+Mongrel2 web framework2012-12-05 14:16:08
445724Ebuildsmaintainer-wantedUNCONFIRMEDnet-p2p/armory - New package. - Full-featured Bitcoin client, offering a dozen innovative features..2012-12-04 14:45:46
445376Ebuildsmaintainer-wantedUNCONFIRMEDdev-libs/sgml-data - Common SGML and XML data2012-12-01 05:27:15
445370Ebuildsmaintainer-wantedUNCONFIRMEDapp-emacs/visual-basic-mode - VisualBasicMode2012-12-01 05:25:21
442920Ebuildsmaintainer-wantedUNCONFIRMEDmedia-sound/laditools - Control and monitor a LADI system the easy way.2012-11-13 12:30:44
441652Ebuildsmaintainer-wantedUNCONFIRMEDdev-python/pybird-1.0.8 - class for talking to bird bgp daemon2012-11-04 18:50:37
438490Ebuildsmaintainer-wantedUNCONFIRMEDwww-plugins/mozilla-gnome-keyring-0.6.4 - A firefox extension that enables Gnome Keyring integration2012-10-15 18:59:37
439408Ebuildsmaintainer-wantedUNCONFIRMEDdev-db/rockmongo-1.1.5 - Web-based administration for Mongo database in PHP2013-02-07 14:35:09
439578Ebuildsmaintainer-wantedUNCONFIRMEDPlease add x11-libs/libxkbcommon-0.2.0 to the tree2012-12-09 21:13:33
436278Librarymaintainer-wantedUNCONFIRMEDnet-analyzer/nagios-afs-monitor - Nagios plugins to monitor openafs server status2012-09-26 13:37:17
434124Ebuildsmaintainer-wantedUNCONFIRMEDdev-perl/Cache-FastMmap - Uses an mmap'd file to act as a shared memory interprocess cache2012-09-06 14:41:46
431928Ebuildsmaintainer-wantedUNCONFIRMEDapp-benchmarks/mmtests - a configurable test suite that runs a number of common workloads of interes2012-08-20 02:07:01
431976Core systemmaintainer-wantedUNCONFIRMEDnet-fs/pup-volume-monitor - another disk mounter2012-08-20 12:03:46
430862Ebuildsmaintainer-wantedUNCONFIRMEDx11-misc/pdfpc - a presenter console with multi-monitor support for PDF files2012-08-12 20:07:52
431358Ebuildsmaintainer-wantedUNCONFIRMEDdev-util/lttng-modules - lttng kernel modules2012-08-14 12:55:20
428798Ebuildsmaintainer-wantedUNCONFIRMEDNew ebuild: dev-perl/Mozilla-CA (biber dependency)2012-10-05 18:58:57
427730Ebuildsmaintainer-wantedUNCONFIRMEDNew: dev-python/django-mptt-0.4.2 - Utilities for implementing a modified pre-order traversal tree i2012-12-12 11:46:23
425508Ebuildsmaintainer-wantedUNCONFIRMEDdev-games/caelum - atmospheric effects OGRE plugin2012-07-16 00:55:34
425132Ebuildsmaintainer-wantedUNCONFIRMEDdev-db/riak - "the most powerful open-source, distributed database you'll ever put into production."2012-07-08 14:09:00
425302Gamesmaintainer-wantedUNCONFIRMEDgames-strategy/p6014 - Project 6014 Mod sequel to Star Control II: The Ur-Quan Masters2012-07-09 11:21:25
424818Ebuildsmaintainer-wantedUNCONFIRMEDnet-nntp/moviegrabber - a fully automated way of downloading movies from usenet2012-11-29 03:18:46
421011Ebuildsmaintainer-wantedUNCONFIRMEDapp-i18n/uim-mozc-9999 - mozc input method for uim2012-06-13 19:04:07
420013Ebuildsmaintainer-wantedUNCONFIRMEDnet-dns/ndjbdns - djbdns without daemontools2012-09-17 08:34:43
418353Ebuildsmaintainer-wantedUNCONFIRMEDdev-php/pecl-dbase - DBASE support removed from PHP 5.32012-05-31 14:59:48
417009Ebuildsmaintainer-wantedUNCONFIRMEDwww-misc/monitorix-2.5.2 version bump2012-05-22 06:37:42
417295Ebuildsmaintainer-wantedUNCONFIRMEDmedia-video/sview-12.05 - a universal stereoscopic player which supports image viewing and movie pla2012-10-14 10:12:17
417681Ebuildsmaintainer-wantedUNCONFIRMEDmedia-plugins/gimp-apng-0.1.0 - provides Animated PNG (APNG) image file load and save modules for th2012-07-06 20:09:12
408349Applicationsmaintainer-wantedUNCONFIRMEDEbuild request: sys-block/xnbd, another much more advanced NBD server2012-03-15 15:11:46
408217Ebuildsmaintainer-wantedUNCONFIRMEDdev-python/meliae-0.4.0: Profile python's memory footprint2012-03-15 01:15:55
408013Ebuildsmaintainer-wantedUNCONFIRMEDdev-python/netzob - Network protocol modelization by reverse engineering2012-05-09 15:21:42
401273Ebuildsmaintainer-wantedUNCONFIRMED[EBUILD] www-apache/mod_authn_otp2012-02-01 20:02:36
399711Ebuildsmaintainer-wantedUNCONFIRMED[ebuild request] sys-process/ulatencyd - monitors the system and categorizes the running processes i2012-04-09 14:20:31
398137Ebuildsmaintainer-wantedUNCONFIRMEDitap rdp client - a closed source rdp client that supports (among other things) TS-Gateway servers2012-01-10 15:05:30
396557Ebuildsmaintainer-wantedUNCONFIRMEDsys-power/upsmon-usb (new package)2011-12-31 09:27:47
394569Ebuildsmaintainer-wantedUNCONFIRMEDsys-auth/pam_yubico - Yubico PAM module2012-10-25 13:45:09
390169Ebuildsmaintainer-wantedUNCONFIRMEDebuild for ADMB (Automatic Differentiation Model Builder) software suite2011-11-11 15:42:12
388645Applicationsmaintainer-wantedUNCONFIRMEDapp-office/moneyguru - a personal finance management application2011-10-27 17:51:06
389489Ebuildsmaintainer-wantedUNCONFIRMEDmedia-video/smoviecat - Simple Movie Catalog2011-11-05 15:49:59
381969Ebuildsmaintainer-wantedUNCONFIRMEDAsus Notebook keyboard/backlight support kernel modules package2011-09-08 16:02:28
381487Ebuildsmaintainer-wantedUNCONFIRMEDdev-python/DerApproximator - A python module for numerical optimization2011-09-05 11:36:51
381563Librarymaintainer-wantedUNCONFIRMEDSISL - "The SINTEF Spline Library", a comprehensive NURBS library for the modeling and interrogation2011-10-07 01:01:21
377833Ebuildsmaintainer-wantedUNCONFIRMEDNew ebuild for RTAI-lib modules for RTAI2011-08-05 22:24:39
376869Ebuildsmaintainer-wantedUNCONFIRMEDnew ebuild - dev-util/motor-3.4.2 IDE2011-07-29 10:10:39
376803Ebuildsmaintainer-wantedUNCONFIRMED[ebuild proposal] sci-geosciences/monav-0.32013-02-17 19:58:45
375717Ebuildsmaintainer-wantedUNCONFIRMEDpash - powershell for mono ebuild request2011-07-22 12:20:31
374849Ebuildsmaintainer-wantedUNCONFIRMEDnet-wireless/kismon ebuild request2011-07-11 15:49:17
373179Ebuildsmaintainer-wantedUNCONFIRMEDPackage Request: Mozilla Mobile2012-02-03 16:13:16
367027Ebuildsmaintainer-wantedUNCONFIRMEDnet-analyzer/amun - Low-interaction honeypot, capture autonomous spreading malware in an automated f2012-03-08 02:09:36
454816Librarymaintainer-neededUNCONFIRMEDwww-apache/mod_auth_kerb-5.4-r1: doesn't build against heimdal kerberos2013-01-31 19:51:21
447352Unspecifiedmaintainer-neededUNCONFIRMEDapp-laptop/tp_smapi-0.41 with kernel 3.7 - modprobe: FATAL: Error inserting tp_smapi (/lib/modules/32013-01-02 20:30:53
448742Ebuildsmaintainer-neededUNCONFIRMEDapp-misc/multimon-1.0-r3: fails to build2013-01-12 22:37:15
450156Applicationsmaintainer-neededUNCONFIRMEDmedia-gfx/splashutils-1.5.4.4-r2 unable to switch from silent mode to verbose using F2 with the 2nd 2013-01-20 10:25:23
417439Core systemmaintainer-neededUNCONFIRMEDmedia-gfx/splashutils should move cachedir /lib/splash/cache to /run2013-01-20 10:21:52
410343Ebuildsmaintainer-neededUNCONFIRMEDnet-wireless/broadcom-sta - modprobe wl: ERROR: could not insert 'wl': No such file or directory2013-02-03 13:03:43
389391Servermaintainer-neededUNCONFIRMEDwww-apache/mod_authnz_external-3.2.6 fails with method checkpassword2013-01-01 19:43:11
379475Applicationsmaintainer-neededUNCONFIRMEDwww-apache/mod_dnssd - Avahi: "invalid host name" error, always uses "localhost" no matter what2013-01-01 20:35:50
370761Ebuildsmaintainer-neededUNCONFIRMEDwww-apache/mod_auth_imap2 patch to fix compilation2013-01-04 14:14:29
380399ApplicationsljakabUNCONFIRMEDnet-misc/vpnc-0.5.3: couldn't set up connection to remote server ...2013-02-07 15:22:30
449340ApplicationslackUNCONFIRMEDwww-client/firefox-17.0.1 crashed while watching movie online2013-01-02 22:09:55
410371ApplicationslackUNCONFIRMEDwww-plugins/adobe-flash-11.2.202.228 segmentation fault in mozalloc_abort(char const*) () from /usr/2012-12-15 19:35:06
453780Applicationskondor6cUNCONFIRMEDwww-client/elinks-0.12_pre5-r2 USE=javascript with spidermonkey-1.8.5-r1 - elinks freezes on startup2013-02-01 11:12:46
434710Eclasses and Profileskernel-miscUNCONFIRMEDlinux-mod.eclass should set KERNEL_DIR and KBUILD_OUTPUT if not present2012-09-12 21:59:45
438730Core systemkernel-miscUNCONFIRMEDSandbox violations when emerging kernel modules from /etc/kernel/postinst.d hook against a kernel bu2012-11-05 03:29:40
438734Eclasses and Profileskernel-miscUNCONFIRMEDlinux-mod.eclass - KERNEL_DIR/KBUILD_OUTPUT version mismatch is not detected, KERNEL_DIR is not infe2012-10-18 07:40:38
438784Eclasses and Profileskernel-miscUNCONFIRMEDlinux-mod.eclass - kernel modules packages are incompatible with using multiple kernels2012-10-18 14:18:50
425316Applicationskernel-miscUNCONFIRMEDapp-misc/fdutils-5.5-r2 - fdmount.c:25:27: fatal error: linux/ext2_fs.h: No such file or directory2012-12-12 05:51:37
427052Eclasses and Profileskernel-miscUNCONFIRMEDlinux-mod.eclass needs a fix for ABI x322012-08-08 15:24:14
428728Core systemkernel-miscUNCONFIRMEDsys-kernel/ksymoops-2.4.11-r1 - In file included from ksymoops.h:9:0, from ksymoops.c:14: /usr/inclu2012-12-17 16:12:54
377049Eclasses and Profileskernel-miscUNCONFIRMEDlinux-mod.eclass should warn of bad permission into ${KV_OUT_DIR}2011-08-02 13:51:54
390293Unspecifiedkernel-miscUNCONFIRMED[enhancement] sys-fs/sshfs-fuse: Improve remote permissions when files and directories are created2011-11-15 00:36:35
410923Core systemkernel-miscUNCONFIRMEDsys-kernel/module-rebuild - command line options are consistent (should be "module-rebuild --action"2012-04-06 14:44:25
392247Core systemkernel-miscUNCONFIRMEDsys-kernel/module-rebuild-0.7 doesn't respect EMERGE_DEFAULT_OPTS variable2011-12-04 02:58:30
366733Eclasses and Profileskernel-miscUNCONFIRMEDkernel-2.eclass enhancement proposal: removing unnecessary arch directories to save space2012-04-16 11:29:25
456118Core systemkernelUNCONFIRMEDsys-kernel/gentoo-sources-3.7.4 - memory exhaustion in AS firmware//lib/firmware/.gen.o2013-02-12 03:36:33
445222Core systemkernelUNCONFIRMEDsys-kernel/vanilla-sources uli526x module incompatible with GART_IOMMU2012-12-11 12:37:18
444742ApplicationskernelUNCONFIRMEDnet-fs/autofs-5.0.6-r3 unable to mount NFS on HPPA: do_mount_indirect: path to be mounted is to long2013-02-06 04:36:10
456230KDEkdeUNCONFIRMEDapp-cdr/k3b-2.0.2-r4: complains about "process can't started. Calling of In/Output module not possib2013-02-10 15:13:30
455286UnspecifiedkdeUNCONFIRMED=media-libs/gstreamer-0.10.36 upgrade causes kde-base/dragon-4.9.5 to crash when playing movies2013-02-04 17:58:38
455274KDEkdeUNCONFIRMED[kde overlay] =kde-base/blogilo-9999 fails to build because kdepim-common-libs doesn't build and ins2013-02-15 15:52:57
435584KDEkdeUNCONFIRMEDkde-base/kdelibs - patch to fix directory icon breakage for NFS mounts since KDE 4.7.42012-09-28 17:48:44
433876KDEkdeUNCONFIRMEDkde-base/marble-4.9.0: cannot move globe with mouse2012-09-18 13:46:27
403923KDEkdeUNCONFIRMEDKDE device notifier does not show USB devices after umounting2012-02-16 18:07:10
434242DevelopmentjohnnyUNCONFIRMEDdev-vcs/monotone-1.0-r3 with dev-lang/lua-5.2.1: src/lua.hh:41:23: error: ‘LUA_GLOBALSINDEX’ was not2013-01-29 06:21:50
372703UnspecifiedjmbsvicettoUNCONFIRMEDnet-misc/vde service script unloads module when it is still needed2012-06-08 13:14:11
428138ApplicationsjdhoreUNCONFIRMEDwww-client/seamonkey-bin-2.10.1: png icon has no transparency2012-07-26 17:38:00
438834JavajavaUNCONFIRMEDdev-java/icedtea-6.1.11.4 fails to build with java.lang.OutOfMemoryError2012-10-18 18:57:31
440994JavajavaUNCONFIRMEDdev-java/xmlgraphics-commons-1.5 version bump2012-11-03 20:31:14
398689EbuildsjavaUNCONFIRMEDRemove dev-java/servletapi replace with java-virtuals/servlet-api2012-09-29 09:01:54
420605DevelopmentjavaUNCONFIRMEDdev-util/eclipse-sdk-3.5.1-r1 No more handles [MOZILLA_FIVE_HOME='/usr/lib64/xulrunner-devel-1.9.2']2013-02-04 12:41:42
421077JavajavaUNCONFIRMEDdev-java/icedtea-7.2.2 compilation fails with Unrecognised option: -XX:-PrintVMOptions2012-10-18 16:15:26
421677JavajavaUNCONFIRMEDdev-java/ant-commons-net-1.8.4 - *** Semantic Error: The abstract method "int compareTo(java.lang.Ob2012-06-19 02:39:45
368229DevelopmentjavaUNCONFIRMEDdev-util/eclipse-sdk - eclipse crashes on libmozjs.so2013-02-04 12:39:45
447102Applicationsidl0rUNCONFIRMEDnet-analyzer/nagstamon-0.9.9 throws glib.GError: Couldn't recognize the image file format for file '2012-12-13 14:34:59
447628Applicationsidl0rUNCONFIRMEDmedia-plugins/vdr-imonlcd-1.0.0 version bump2012-12-17 18:54:12
410453Ebuildsidl0rUNCONFIRMEDwww-apache/mod_perl does not build against www-servers/apache2-2.4.1-r22012-11-27 18:54:34
366809Serveridl0rUNCONFIRMEDwww-apache/mod_perl-2.0.5 fails tests2011-05-12 23:01:20
427194ApplicationshollowUNCONFIRMEDwww-servers/nginx: add rtmp module support2012-11-26 08:04:35
442610ServerhollowUNCONFIRMEDwww-servers/nginx - Feature support request for dav-ext-module.2012-11-26 20:05:19
446734EbuildshollowUNCONFIRMEDwww-servers/nginx - init script changes owner and mode of /var/log/nginx on each startup/restart2013-01-21 03:28:06
401397ServerhollowUNCONFIRMEDwww-servers/nginx: add automatic minification module (jitify)2012-11-26 08:02:58
458064ApplicationshaskellUNCONFIRMEDx11-misc/xmobar-0.16 with dev-lang/ghc-6.12.3-r2 - src/Xmobar.hs:170:16: Not in scope: `void'2013-02-18 13:39:06
433998DevelopmenthaskellUNCONFIRMEDincompatibility between =dev-lang/ghc-7.4.1-r1 and =x11-wm/xmonad-0.102012-12-16 13:42:38
431368ApplicationshaskellUNCONFIRMEDx11-misc/xmobar-0.14 - src/Plugins/Monitors/CoreCommon.hs:139:30: No instance for (Applicative (Cont2012-08-14 13:16:12
426772ApplicationshaskellUNCONFIRMEDx11-wm/xmonad - high wakeup count with GHC 7.4.1-r12012-09-15 08:05:04
453492Hardenedhardened-kernelUNCONFIRMEDsys-kernel/hardened-sources-3.7.3: kernel panic when loading modules2013-01-28 14:15:36
417409Core systemhardened-kernelUNCONFIRMEDsys-kernel/hardened-sources-3.2.11 - beam: page allocation failure: order:1, mode:0x20 or swapper: p2012-05-28 10:16:10
456364HardenedhardenedUNCONFIRMEDsys-kernel/hardened-sources-3.7.5 ppc64 xics-common.c fails with "assignment of member 'cause_ipi' i2013-02-10 01:31:44
391839HardenedhardenedUNCONFIRMEDcompiling external module which is using file_operations fails2011-11-25 08:09:59
434722UnspecifiedhannoUNCONFIRMEDnet-mail/mailman-2.1.14 uses python_mod_cleanup() incorrectly2012-09-11 15:14:21
428724Core systemhannoUNCONFIRMEDsys-auth/pam_mount-2.13: man: invalid option -- 'l', ERROR: ld.so: object 'libsandbox.so' from LD_PR2012-07-31 00:10:12
387147Core systemhannoUNCONFIRMEDsys-auth/pam_mount-2.12: running xfce4-session-logout eats all memory2013-01-08 13:37:30
381365Core systemhannoUNCONFIRMEDsys-auth/pam_mount uses all virtual memory with app-cdr/k3b-2.0.2-r12013-01-08 13:37:30
431522ApplicationsgstreamerUNCONFIRMEDmedia-video/flumotion: fails to build with python3* as system interpreter2012-12-28 00:22:54
391381ApplicationsgstreamerUNCONFIRMEDmedia-video/flumotion-0.10.0 version bump2012-10-01 15:17:35
457080EbuildsgraphicsUNCONFIRMEDmedia-gfx/cellwriter-1.3.5 - version bump request and please move it to app-accessibility/2013-02-13 18:34:41
456896LibrarygraphicsUNCONFIRMEDmedia-libs/lensfun-0.2.5-r2 - Fatal error: can't create out/posix.x86_64/release/libs/lensfun/mod-co2013-02-12 08:34:39
448670ApplicationsgraphicsUNCONFIRMEDmedia-gfx/inkscape-0.48.4 - Superfluous dependencies, make them USE-dependent or remove them.2012-12-26 23:33:10
438436ApplicationsgraphicsUNCONFIRMEDmedia-gfx/enblend-4.0 USE=doc - !pdfTeX error: pdfetex (file ./smooth-edge.pdf): reading image file 2012-10-15 11:31:41
387963EbuildsgraphicsUNCONFIRMEDmedia-gfx/gtkimageview: awkward configure.in adds unuseful dependency to gnome-common2013-01-20 18:14:43
312935EbuildsgraphicsUNCONFIRMEDmedia-gfx/ufraw: Optionalize more dependencies and improve metadata.xml2011-10-09 07:35:16
453392GNOMEgnomeUNCONFIRMEDgnome-base/gdm-3.6 USE=plymouth prevents the automatic switch to vt7 on startup2013-02-12 09:11:09
457624GNOMEgnomeUNCONFIRMEDgnome-extra/gnome-system-monitor-3.6.1 has incorrect dependency on dev-cpp/glibmm2013-02-14 21:52:35
455386GNOMEgnomeUNCONFIRMEDnet-misc/vinagre-3.6.2: No toolbar in fullscreen mode after upgrading to gnome 3.6 for RDP2013-02-05 02:29:22
453842GNOMEgnomeUNCONFIRMED[PATCH] gnome-base/gnome-shell-3.6.2-r1: Fix partialy memory leaks issues2013-02-12 09:35:27
451318GNOMEgnomeUNCONFIRMEDgnome-extra/nemo: "Open in Terminal" does not open a terminal2013-01-11 16:28:05
451130GNOMEgnomeUNCONFIRMEDcinnamon lock screen does not work with gnome 3.62013-01-15 21:11:27
450246LibrarygnomeUNCONFIRMEDdev-python/pygtk-2.24.0 - memory leak in _wrap_pango_cairo_create_layout2013-01-05 16:55:14
436054GNOMEgnomeUNCONFIRMEDgnome-base/gnome-control-center-3.4.2-r1 QA Notice: This package installs one or more .desktop files2012-11-25 09:53:38
448894DevelopmentgnomeUNCONFIRMEDapp-mobilephone/gnome-phone-manager-0.68 : Only should be included directly2012-12-27 23:08:41
436052GNOMEgnomeUNCONFIRMEDgnome-base/gnome-shell-3.4.2 QA Notice: This package installs one or more .desktop files that do not2012-11-21 18:48:32
434842GNOMEgnomeUNCONFIRMEDmedia-video/cheese-3.4.2 This package installs one or more .desktop files that do not pass validati2012-11-21 18:48:25
389813GNOMEgnomeUNCONFIRMEDgnome-base/nautilus-3.2.1 fails to mount volumes correctly2012-10-28 10:29:55
379001LibrarygnomeUNCONFIRMEDsys-libs/ldb-1.1.4 fails on portage-multilib because of waflib module's python support2013-01-01 18:40:16
447328genkernelgenkernelUNCONFIRMEDsys-kernel/genkernel-3.4.45: encrypted filesystems from initramfs.mounts cannot be mounted2012-12-15 11:14:42
419773genkernelgenkernelUNCONFIRMEDearly bind mounts are listed twice in the mount table2012-06-05 14:14:06
409979genkernelgenkernelUNCONFIRMEDinitrd mounting /usr read/write2012-09-05 12:25:29
418463genkernelgenkernelUNCONFIRMEDlinuxrc in genkernel's initramfs does not properly deal with bind mounts2012-07-21 17:31:55
457888GamesgamesUNCONFIRMEDgames-simulation/bcs-demo: broken link in description2013-02-16 21:03:10
447846GamesgamesUNCONFIRMEDgames-roguelike/scourge removal request2012-12-19 16:40:04
435818GamesgamesUNCONFIRMEDgames-roguelike/dungeons-of-dredmor-1.1.2.ebuild - new ebuild2012-09-22 08:12:03
429286GamesgamesUNCONFIRMEDMouse behavior in games-fps/quake2-icculus is inverted in both x and y axis.2012-08-01 00:20:46
420603GamesgamesUNCONFIRMEDgames-roguelike/dungeons-of-dreadmore - new ebuild2012-06-10 23:28:34
417561GamesgamesUNCONFIRMEDgames-rpg/monsterrpg2: new ebuild2012-10-19 04:48:30
411099GamesgamesUNCONFIRMEDgames-simulation/tpt_merbo-1.0 - A mod of The Powder Toy, a particle simulator2012-04-07 15:00:08
402741GamesgamesUNCONFIRMEDNew ebuild: games-rpg/analogue-demo - Analogue: A Hate Story2012-02-08 19:14:06
383829GamesgamesUNCONFIRMEDgames-arcade/diamond-girl (new ebuild)2012-02-07 14:45:53
378861GamesgamesUNCONFIRMEDandyetitmoves - New Ebuild for And Yet It Moves2012-04-30 19:23:10
456662Core systemfreedesktop-bugsUNCONFIRMEDsys-fs/udisks-2.0.91 - memory leak in /usr/lib/udisks2/udisksd2013-02-12 14:59:47
403523Core systemfreedesktop-bugsUNCONFIRMEDsys-power/pm-utils-1.4.1-r2: power.d/xfs_buffer writes wrong/invalid value(s) in battery mode2012-02-14 18:47:19
407725ApplicationsforensicsUNCONFIRMEDapp-forensics/chkrootkit-0.49 -n option does not recognize nfs4 mounts2012-03-13 10:15:38
430056Applicationsford_prefectUNCONFIRMEDmedia-sound/pulseaudio-1.1-r1 USE=lirc does not build lirc module2012-08-05 22:53:00
410663Applicationsford_prefectUNCONFIRMEDmedia-sound/pulseaudio - without "flat-volumes = no" in daemon.conf pulseaudio doesn't restore mixer2012-04-04 07:10:48
394875Applicationsford_prefectUNCONFIRMEDmedia-sound/pulseaudio - module-tunnel-sink is unreliable2012-12-15 12:50:15
434262ApplicationsfontsUNCONFIRMEDmedia-fonts/urwvn-fonts - wrong license due to vn garamond2013-01-06 03:07:50
401207UnspecifiedfontsUNCONFIRMEDmedia-gfx/fontforge-20110222-r1: Crash while select more than 4 points while press "Shift/Ctrl"2012-01-28 17:49:29
423817DevelopmentflameeyesUNCONFIRMEDdev-util/dwarves-1.9: ostra-cg cannot find python module ostra: ImportError: No module named ostra2012-06-27 18:54:10
449720Core systemferringbUNCONFIRMEDsys-apps/pkgcore-0.8.6: SyntaxError during compilation of Python modules for Python 3.22013-01-02 10:12:25
376153EselecteselectUNCONFIRMEDRequest: eselect module for managing /etc/init.d/net.* symlinks2011-07-26 10:41:35
373613EselecteselectUNCONFIRMEDapp-admin/eselect broken for eselect modules which rely on skel.bash (such as blas, cblas, lapack)2011-07-04 12:04:13
444199EbuildsenlightenmentUNCONFIRMED[enlightenment overlay] several packages moved in enlightenment svn2012-12-22 20:35:59
372707EbuildsenlightenmentUNCONFIRMED[enlightenment-overlay] x11-plugins/e_modules-comp-scale: new ebuild2012-12-22 20:35:46
407099Project-specific documentationembeddedUNCONFIRMEDIncorrect mount options and binfmt_misc mask for "Compiling with qemu-user chroot" secion2012-03-06 17:22:43
451990LibraryemacsUNCONFIRMEDapp-emacs/python-mode-6.1.0 should install autopair2013-01-15 12:34:04
458350LibraryemacsUNCONFIRMEDapp-emacs/sml-mode-6.3 version bump2013-02-19 20:27:12
437118EbuildsdotnetUNCONFIRMEDdev-lang/mono-9999 - git master live ebuild2012-10-04 18:35:50
380647UnspecifieddolsenUNCONFIRMEDapp-portage/layman-2.0.0: More complete support for CVS2012-02-28 05:33:36
439618DevelopmentdotnetUNCONFIRMEDdev-lang/mono-3 version bump2013-02-16 23:15:04
435168EbuildsdotnetUNCONFIRMEDdev-lang/mono-2.10.9-r2 merge fails with configure error2012-10-04 18:38:09
372453EbuildsdotnetUNCONFIRMEDapp-portage/eclass-manpages - Documentation for mono.eclass is awfull (one line)2011-06-29 10:17:45
404263EbuildsdotnetUNCONFIRMEDdev-lang/mono-2.10.5: remove MAKEOPTS=-j1 limitation2012-02-19 11:00:47
457668Otherdocs-teamUNCONFIRMED[fa] handbook/hb-net-modules.xml2013-02-15 08:30:33
445626Installation Handbookdocs-teamUNCONFIRMEDSwap amount in handbook needs a discussion2012-12-02 15:31:04
442930New Documentationdocs-teamUNCONFIRMEDHow to install Gentoo with a UEFI motherboard2012-12-28 16:49:35
450022ServerdjcUNCONFIRMEDwww-apache/mod_wsgi lacks a way to specify which python version to use2013-01-05 17:09:38
442162ApplicationsdjcUNCONFIRMEDnet-misc/openvpn-2.1.4 - src_install: rmdir: failed to remove ‘/var/tmp/portage/net-misc/openvpn-2.12012-11-07 14:09:59
458006Applicationsdev-zeroUNCONFIRMEDx11-drivers/xf86-video-vmware with media-libs/mesa-9.1_rc1 - module fails to load2013-02-20 00:43:23
444306Librarydev-zeroUNCONFIRMEDx11-drivers/xf86-input-vmmouse-12.9.0 with x11-base/xorg-server-1.13.0-r1 - Warning: attempting to l2013-01-01 21:31:12
435686Librarydev-zeroUNCONFIRMEDdev-libs/boost-1.49.0-r1 - In file included from [...] libs/date_time/src/gregorian/greg_month.cpp:12012-11-11 05:45:20
458284Core - Dependenciesdev-portageUNCONFIRMEDsys-apps/portage-2.1.11.52: 'emerge --depclean' does not remove old gentoo-sources2013-02-20 11:35:04
380907Applicationsdev-zeroUNCONFIRMEDx11-drivers/xf86-input-vmmouse-12.7.0: /usr/bin/vmmouse_detect segfaults during boot2012-07-11 14:54:13
422491Coredev-portageUNCONFIRMEDemerging updates to nfs-mounted file systems can cause running programs to segfault2012-06-21 02:59:59
416907Core systemdev-portageUNCONFIRMEDOption to remove orphaned dependencies when using emerge -C2012-12-25 21:12:35
382827Coredev-portageUNCONFIRMEDsys-apps/portage-2.1.10.11 crashes with confusing error when out of memory: TypeError: an integer is2011-09-14 13:56:03
404423Unspecifiedcommon-lispUNCONFIRMEDdev-lisp/ecls-12.2.1 fails to run tests - An error occurred during initialization: Module error: Don2013-02-02 10:15:50
455582ServerclusterUNCONFIRMEDsys-cluster/ceph should be started before netmount2013-02-05 12:25:27
411687ApplicationscjkUNCONFIRMEDapp-i18n/ibus-mozc: support uim-mozc (Mozc engine for app-i18n/uim)2012-04-12 23:00:50
434138ApplicationscjkUNCONFIRMEDapp-i18n/scim-1.4.14 breaks x11-wm/windowmaker's root window mouse actions2012-09-14 15:30:36
436218EbuildsclusterUNCONFIRMEDnet-misc/pssh with dev-lang/python-3.2 - pssh --help: ImportError: No module named version2013-01-04 06:31:50
442122EbuildschutzpahUNCONFIRMEDwww-plugins/mozplugger-1.14.6 version bump2013-02-21 08:37:18
410293Keywording and StabilizationchutzpahUNCONFIRMEDStable request for www-plugins/mozplugger-1.14.32013-02-21 08:38:30
404575ApplicationschutzpahUNCONFIRMEDwww-plugins/mozplugger should RDEPEND on sys-devel/m42013-02-21 08:40:45
433102Core systemcardoeUNCONFIRMEDx11-drivers/nvidia-drivers - CONFIG_AMD_IOMMU causes kernel module to fail?2012-11-13 09:49:39
457784BugzillabugzillaUNCONFIRMED/data/cached/buglist-*.html missing last-modified timestamps2013-02-16 03:03:10
457782BugzillabugzillaUNCONFIRMEDbugs.gentoo.org (mostly) inaccessible to bots2013-02-16 03:09:26
431082BugzillabugzillaUNCONFIRMEDIt is not possible to set attachment type/patch flag in expert mode enter_bug2012-08-12 13:58:16
458568Applicationsbug-wranglersUNCONFIRMEDUdisks2 fails to mount flash drive when ACL isn't supported in kernel2013-02-21 13:23:05
410477ApplicationsbluenessUNCONFIRMEDnet-p2p/bitcoind-0.5* - init.d script's stop action fails to stop daemon2013-01-25 18:58:34
449272PrintingbillieUNCONFIRMEDnet-print/hplip-3.12.11 may remove user from all groups except lp2013-02-01 09:18:39
447466ApplicationsbazaarUNCONFIRMEDdev-vcs/bzr-gtk-0.103.0: USE="-nautilus" does not remove /usr/share/nautilus-python/extensions/nauti2012-12-27 23:41:30
458496Core systembase-systemUNCONFIRMEDsys-apps/util-linux-2.22.2 install fails with: unable to read SONAME from libmount.so2013-02-20 20:32:45
454404Core systembase-systemUNCONFIRMEDsys-fs/static-dev: should also check for devtmpfs mounted at /dev2013-01-29 18:37:25
454196Core systembase-systemUNCONFIRMEDsys-apps/groff-1.22.1 installs broken symbolic link - /usr/share/doc/groff-1.22.1/pdf/mom-pdf.pdf: b2013-01-26 18:20:42
452604Eclasses and Profilesbase-systemUNCONFIRMEDCPU_FEATURES: move USE="mmx sse etc..." CPU features to USE expanded variable2013-01-25 05:38:49
442374Applicationsbase-systemUNCONFIRMEDsys-fs/cryptsetup - Replace ${dev} to be more descriptive in * pre_mount: mkswap ${dev} ...2012-11-08 19:02:10
435564Core systembase-systemUNCONFIRMEDsys-boot/grub-2.00: ignores 'GRUB_GFXMODE' and does not use framebuffer2012-11-03 22:59:15
432454Applicationsbase-systemUNCONFIRMEDsys-block/open-iscsi - init script has problems with automatic mounting of iSCSI2012-10-22 16:22:50
419741Applicationsbase-systemUNCONFIRMEDdev-util/mono-tools-2.10 fails to emerge with Automake 1.11.52012-06-11 07:28:14
410605Core systembase-systemUNCONFIRMEDsys-apps/util-linux-2.20-r1: fsck complains about checking file systems mounted ro2013-02-05 14:52:10
402057Core systembase-systemUNCONFIRMEDsys-power/apcupsd-3.14.10-r1 - daemon fails to stop during shutdown2012-08-03 19:38:52
394605Core systembase-systemUNCONFIRMEDsys-process/lsof does not list libraries anymore2012-01-01 13:05:31
390245Core systembase-systemUNCONFIRMEDsys-fs/mtools-4.0.15 - mcd fails to mount SD memory card (with all available (tested) card readers)2011-11-20 07:19:18
386539Core systembase-systemUNCONFIRMEDsys-boot/grub-1.99-r2 doesn't detect framebuffer resolutions if /usr is not mounted2011-11-11 13:32:10
381123Applicationsarmin76UNCONFIRMEDx11-drivers/xf86-video-intel[sna] CPU load very high when remotely connecting to a local X-Server us2012-09-16 18:39:43
367331Ebuildsbase-systemUNCONFIRMEDsys-fs/quotatool-1.4.6: quotatool doesnt skip "rootfs / rootfs" mount entry2011-05-17 18:14:10
411861Ebuildsapp-backupUNCONFIRMEDapp-backup/backuppc-3.2.1-r1 needs several apache modules: ebuild should enforce that2012-04-14 05:51:11
421135Ebuildsapache-bugsUNCONFIRMEDwww-servers/apache-2.4* - add support for mod_proxy_fcgi2013-02-20 00:33:10
429564ApplicationsangelosUNCONFIRMEDgnome-extra/docky-2.1.4 compile error with mono 2.11.12012-09-11 06:58:49
429674Libraryamd64UNCONFIRMEDapp-emulation/emul-linux-x86-medialibs: move media-libs/faac to a separate package due to license "i2012-11-02 18:16:56
417191Ebuildsamd64UNCONFIRMEDapp-emulation/emul-linux-x86-gtklibs-20120520 needs pax marking - gtk-query-immodules-2.0-32: error 2012-12-12 16:42:02
450248ApplicationsalonblUNCONFIRMEDapp-laptop/laptop-mode-tools-1.62: /usr/sbin/laptop_mode: line 239: .: /etc/laptop-mode/conf.d/board2013-02-10 19:55:43
451824ApplicationsalexxyUNCONFIRMEDsci-chemistry/vmd-1.9.1-r2 with tcl/tk-8.6 break g(r) analysis module2013-01-17 20:52:47
445550ApplicationsalexxyUNCONFIRMEDwww-apps/rutorrent-3.4-r1: outputs garbage to Apache error.log if PHP is running in strict mode2012-12-02 06:13:37
431920EbuildsalexxyUNCONFIRMEDnet-wireless/wimax-1.5.2-r1 installs /var/log/wimax with mode 7772013-01-01 21:49:31
430478Core systema3liUNCONFIRMEDsys-boot/plymouth-0.8.6.1 version bump2013-01-30 10:49:51
437728Core systema3liUNCONFIRMEDsys-boot/plymouth - static archives (*.a) and libtool library files (*.la) do not belong in /2012-11-15 22:53:53
411321Ebuildsa3liUNCONFIRMEDsys-boot/plymouth boot fails : switchroot can't switch /dev from /sysroot/dev2012-04-23 20:05:34
428146Core systema3liUNCONFIRMEDsys-boot/plymouth-0.8.4 with x11-libs/libdrm-2.4.37 - .../work/plymouth-0.8.4/src/plugins/renderers/2013-02-07 11:16:42
366875Ebuildsmaintainer-wantedUNCONFIRMED[new package] sys-fs/gdatafs - Gdatafs is a FUSE implemtation that mount picassa web and youtube to 2011-12-08 06:16:16
370099Ebuildsmaintainer-neededUNCONFIRMEDmedia-sound/line6usb kernel sources accessed through /lib/modules/`uname -r`2012-12-01 08:18:42
339725EbuildsaballierUNCONFIRMEDmedia-sound/lmms fails to build remote_vst_plugin: winebuild: as --32 failed with status 12011-04-19 16:10:52


back
Please read "Why adblockers are bad".



other Ads
Trace My Cash
Wenn Sie sich schon immer mal gefragt haben, wo eigentlich Ihr geliebtes Bargeld geblieben ist, finden Sie hier vielleicht die Antwort.
www.tracemycash.com
Other free services
toURL.org
Shorten long
URLs to short
links like
http://tourl.org/2
tourl.org
.
Reverse DNS lookup
Find out which hostname(s)
resolve to a
given IP or other hostnames for the server
www.reversednslookup.org

New Packages

- as rdf newsfeed
- as rss newsfeed
- as Atom newsfeed
2017-03-29
ansible - 2.1.5.0
Ebuild name:

app-admin/ansible-2.1.5.0

Description

Model-driven deployment, config management, and command execution framewo

Added to portage

2017-03-29

ansible - 2.2.2.0
Ebuild name:

app-admin/ansible-2.2.2.0

Description

Model-driven deployment, config management, and command execution framewo

Added to portage

2017-03-29

bloaty - 0_p20170321
Ebuild name:

dev-util/bloaty-0_p20170321

Description

A size profiler for binaries

Added to portage

2017-03-29

collada_parser - 1.12.8
Ebuild name:

dev-ros/collada_parser-1.12.8

Description

C++ parser for the Collada robot description format

Added to portage

2017-03-29

collada_urdf - 1.12.8
Ebuild name:

dev-ros/collada_urdf-1.12.8

Description

Tool to convert Unified Robot Description Format (URDF) documents into

Added to portage

2017-03-29

combustion - 0.6.0
Ebuild name:

dev-ruby/combustion-0.6.0

Description

Elegant Rails Engine Testing

Added to portage

2017-03-29

constantly - 15.1.0
Ebuild name:

dev-python/constantly-15.1.0

Description

Symbolic constants in Python

Added to portage

2017-03-29

containerd - 0.2.3_p20170308
Ebuild name:

app-emulation/containerd-0.2.3_p20170308

Description

A daemon to control runC

Added to portage

2017-03-29

cups - 2.2.3
Ebuild name:

net-print/cups-2.2.3

Description

The Common Unix Printing System

Added to portage

2017-03-29

diskimage-builder - 2.2.0
Ebuild name:

app-emulation/diskimage-builder-2.2.0

Description

Golden Disk Image builder.

Added to portage

2017-03-29

docker - 17.03.1
Ebuild name:

app-emulation/docker-17.03.1

Description

The core functions you need to create Docker images and run Docker con

Added to portage

2017-03-29

gdk-pixbuf - 2.36.6
Ebuild name:

x11-libs/gdk-pixbuf-2.36.6

Description

Image loading library for GTK+

Added to portage

2017-03-29

gevent - 1.2.1
Ebuild name:

dev-python/gevent-1.2.1

Description

Coroutine-based network library

Added to portage

2017-03-29

gnome-documents - 3.22.2
Ebuild name:

gnome-extra/gnome-documents-3.22.2

Description

A document manager application for GNOME

Added to portage

2017-03-29

gvfs - 1.30.4
Ebuild name:

gnome-base/gvfs-1.30.4

Description

Virtual filesystem implementation for gio

Added to portage

2017-03-29

html5lib - 0.9999999-r2
Ebuild name:

dev-python/html5lib-0.9999999-r2

Description

HTML parser based on the HTML5 specification

Added to portage

2017-03-29

https_dns_proxy - 9999
Ebuild name:

net-dns/https_dns_proxy-9999

Description

A lightweight DNS-over-HTTPS proxy.

Added to portage

2017-03-29

hwids - 20170328
Ebuild name:

sys-apps/hwids-20170328

Description

Hardware (PCI, USB, OUI, IAB) IDs databases

Added to portage

2017-03-29

hyper-h2 - 3.0.0
Ebuild name:

dev-python/hyper-h2-3.0.0

Description

HTTP/2 State-Machine based protocol implementation

Added to portage

2017-03-29

hyperframe - 5.0.0
Ebuild name:

dev-python/hyperframe-5.0.0

Description

HTTP/2 framing layer for Python

Added to portage

2017-03-29

joint_state_publisher - 1.12.8
Ebuild name:

dev-ros/joint_state_publisher-1.12.8

Description

Tool for setting and publishing joint state values for a given

Added to portage

2017-03-29

kdl_parser - 1.12.8
Ebuild name:

dev-ros/kdl_parser-1.12.8

Description

Constructs a KDL tree from an XML robot representation in URDF

Added to portage

2017-03-29

kdl_parser_py - 1.12.8
Ebuild name:

dev-ros/kdl_parser_py-1.12.8

Description

Python tools to construct a KDL tree from an XML robot representation

Added to portage

2017-03-29

libosinfo - 1.0.0-r1
Ebuild name:

sys-libs/libosinfo-1.0.0-r1

Description

GObject library for managing information about real and virtual OSes

Added to portage

2017-03-29

nevow - 0.14.2
Ebuild name:

dev-python/nevow-0.14.2

Description

A web templating framework that provides LivePage, an automatic AJAX toolki

Added to portage

2017-03-29

nexpose - 5.3.2
Ebuild name:

dev-ruby/nexpose-5.3.2

Description

API client for Nexpose vulnerability managment product

Added to portage

2017-03-29

nodelet - 1.9.10
Ebuild name:

dev-ros/nodelet-1.9.10

Description

Provides a way to run multiple algorithms in the same process with zero copy

Added to portage

2017-03-29

nodelet_core - 1.9.10
Ebuild name:

ros-meta/nodelet_core-1.9.10

Description

Nodelet Core Metapackage

Added to portage

2017-03-29

nodelet_topic_tools - 1.9.10
Ebuild name:

dev-ros/nodelet_topic_tools-1.9.10

Description

Common nodelet tools such as a mux, demux and throttle

Added to portage

2017-03-29

openvswitch - 2.7.0-r1
Ebuild name:

net-misc/openvswitch-2.7.0-r1

Description

Production quality, multilayer virtual switch

Added to portage

2017-03-29

osinfo-db - 20170326
Ebuild name:

sys-apps/osinfo-db-20170326

Description

osinfo database files

Added to portage

2017-03-29

osinfo-db-tools - 1.1.0
Ebuild name:

sys-apps/osinfo-db-tools-1.1.0

Description

Tools for managing the osinfo database

Added to portage

2017-03-29

priority - 1.3.0
Ebuild name:

dev-python/priority-1.3.0

Description

A pure-Python implementation of the HTTP/2 priority tree

Added to portage

2017-03-29

py-ubjson - 0.9.0
Ebuild name:

dev-python/py-ubjson-0.9.0

Description

Universal Binary JSON encoder/decoder

Added to portage

2017-03-29

pynacl - 1.1.1
Ebuild name:

dev-python/pynacl-1.1.1

Description

Python binding to the Networking and Cryptography (NaCl) library

Added to portage

2017-03-29

pytrie - 0.3
Ebuild name:

dev-python/pytrie-0.3

Description

A pure Python implementation of the trie data structure.

Added to portage

2017-03-29

robot_model - 1.12.8
Ebuild name:

ros-meta/robot_model-1.12.8

Description

Packages for modeling various aspects of robot information

Added to portage

2017-03-29

ruby - 2.2.7
Ebuild name:

dev-lang/ruby-2.2.7

Description

An object-oriented scripting language

Added to portage

2017-03-29

ruby-mode - 2.4.1
Ebuild name:

app-emacs/ruby-mode-2.4.1

Description

Emacs major mode for editing Ruby code

Added to portage

2017-03-29

rxvt-unicode - 9.22-r1
Ebuild name:

x11-terms/rxvt-unicode-9.22-r1

Description

rxvt clone with xft and unicode support

Added to portage

2017-03-29

spark-parser - 1.6.0
Ebuild name:

dev-python/spark-parser-1.6.0

Description

An Early-Algorithm Context-free grammar Parser

Added to portage

2017-03-29

surf - 2.0
Ebuild name:

www-client/surf-2.0

Description

a simple web browser based on WebKit/GTK+

Added to portage

2017-03-29

tellico - 3.0.2
Ebuild name:

kde-misc/tellico-3.0.2

Description

A collection manager based on KDE Frameworks

Added to portage

2017-03-29

term-ansicolor - 1.5.0
Ebuild name:

dev-ruby/term-ansicolor-1.5.0

Description

Small Ruby library that colors strings using ANSI escape sequences

Added to portage

2017-03-29

test_nodelet - 1.9.10
Ebuild name:

dev-ros/test_nodelet-1.9.10

Description

Nodelet unit tests

Added to portage

2017-03-29

test_nodelet_topic_tools - 1.9.10
Ebuild name:

dev-ros/test_nodelet_topic_tools-1.9.10

Description

Nodelet topic tools unit tests

Added to portage

2017-03-29

treq - 17.3.1
Ebuild name:

dev-python/treq-17.3.1

Description

A requests-like API built on top of twisted.web's Agent

Added to portage

2017-03-29

urdf - 1.12.8
Ebuild name:

dev-ros/urdf-1.12.8

Description

C++ parser for the Unified Robot Description Format (URDF)

Added to portage

2017-03-29

urdf_parser_plugin - 1.12.8
Ebuild name:

dev-ros/urdf_parser_plugin-1.12.8

Description

C++ base class for URDF parsers

Added to portage

2017-03-29

xdis - 3.3.0
Ebuild name:

dev-python/xdis-3.3.0

Description

Python cross-version byte-code disassembler and marshal routines

Added to portage

2017-03-29

2017-03-28
appframework - 1.03-r5
Ebuild name:

dev-java/appframework-1.03-r5

Description

Set of Java classes to build desktop applications easily

Added to portage

2017-03-28

autoconf-archive - 2017.03.21
Ebuild name:

sys-devel/autoconf-archive-2017.03.21

Description

GNU Autoconf Macro Archive

Added to portage

2017-03-28

btrfs-progs - 4.10-r1
Ebuild name:

sys-fs/btrfs-progs-4.10-r1

Description

Btrfs filesystem utilities

Added to portage

2017-03-28

ck-sources - 4.10.6
Ebuild name:

sys-kernel/ck-sources-4.10.6

Description

Con Kolivas' high performance patchset and Gentoo's genpatches for Lin

Added to portage

2017-03-28

ck-sources - 4.9.18
Ebuild name:

sys-kernel/ck-sources-4.9.18

Description

Con Kolivas' high performance patchset and Gentoo's genpatches for Lin

Added to portage

2017-03-28

ctop - 0.5.1
Ebuild name:

sys-process/ctop-0.5.1

Description

Top-like interface for container-metrics

Added to portage

2017-03-28

curses - 1.2.1
Ebuild name:

dev-ruby/curses-1.2.1

Description

Ruby binding for curses, ncurses, and PDCurses

Added to portage

2017-03-28

delayer-deferred - 1.1.1
Ebuild name:

dev-ruby/delayer-deferred-1.1.1

Description

Ruby implementation of JSDeferred

Added to portage

2017-03-28

freeradius - 3.0.13
Ebuild name:

net-dialup/freeradius-3.0.13

Description

Highly configurable free RADIUS server

Added to portage

2017-03-28

glib - 2.50.3-r1
Ebuild name:

dev-libs/glib-2.50.3-r1

Description

The GLib library of C routines

Added to portage

2017-03-28

hunspell - 1.6.1-r1
Ebuild name:

app-text/hunspell-1.6.1-r1

Description

Hunspell spell checker - an improved replacement for myspell in OOo

Added to portage

2017-03-28

ipmiutil - 3.0.3
Ebuild name:

sys-apps/ipmiutil-3.0.3

Description

IPMI Management Utilities

Added to portage

2017-03-28

libressl - 2.5.2
Ebuild name:

dev-libs/libressl-2.5.2

Description

Free version of the SSL/TLS protocol forked from OpenSSL

Added to portage

2017-03-28

libwebsockets - 2.1.1
Ebuild name:

net-libs/libwebsockets-2.1.1

Description

canonical libwebsockets.org websocket library

Added to portage

2017-03-28

logstash-bin - 5.2.2
Ebuild name:

app-admin/logstash-bin-5.2.2

Description

Tool for managing events and logs

Added to portage

2017-03-28

mcelog - 149
Ebuild name:

app-admin/mcelog-149

Description

A tool to log and decode Machine Check Exceptions

Added to portage

2017-03-28

mustache - 1.0.5
Ebuild name:

dev-ruby/mustache-1.0.5

Description

Mustache is a framework-agnostic way to render logic-free views

Added to portage

2017-03-28

nethogs - 0.8.5-r1
Ebuild name:

net-analyzer/nethogs-0.8.5-r1

Description

A small 'net top' tool, grouping bandwidth by process

Added to portage

2017-03-28

nghttp2 - 1.21.0
Ebuild name:

net-libs/nghttp2-1.21.0

Description

HTTP/2 C Library

Added to portage

2017-03-28

openipmi - 2.0.23_rc1
Ebuild name:

sys-libs/openipmi-2.0.23_rc1

Description

Library interface to IPMI

Added to portage

2017-03-28

openssh - 7.5_p1-r1
Ebuild name:

net-misc/openssh-7.5_p1-r1

Description

Port of OpenBSD's free SSH release

Added to portage

2017-03-28

opera-developer - 45.0.2545.0
Ebuild name:

www-client/opera-developer-45.0.2545.0

Description

A fast and secure web browser

Added to portage

2017-03-28

paperwork - 1.1.2
Ebuild name:

app-text/paperwork-1.1.2

Description

a personal document manager for scanned documents (and PDFs)

Added to portage

2017-03-28

paperwork-backend - 1.1.2
Ebuild name:

app-text/paperwork-backend-1.1.2

Description

Backend part of Paperwork (Python API, no UI)

Added to portage

2017-03-28

pycharm-community - 2017.1
Ebuild name:

dev-util/pycharm-community-2017.1

Description

Intelligent Python IDE with unique code assistance and analysis

Added to portage

2017-03-28

pycharm-professional - 2017.1
Ebuild name:

dev-util/pycharm-professional-2017.1

Description

Intelligent Python IDE with unique code assistance and analysi

Added to portage

2017-03-28

pynotifier - 0.7.0-r3
Ebuild name:

dev-python/pynotifier-0.7.0-r3

Description

pyNotifier provides an implementation of a notifier/event scheduler

Added to portage

2017-03-28

python - 3.6.1
Ebuild name:

dev-lang/python-3.6.1

Description

An interpreted, interactive, object-oriented programming language

Added to portage

2017-03-28

r8168 - 8.044.02
Ebuild name:

net-misc/r8168-8.044.02

Description

r8168 driver for Realtek 8111/8168 PCI-E NICs

Added to portage

2017-03-28

re2 - 0.2017.03.01
Ebuild name:

dev-libs/re2-0.2017.03.01

Description

An efficent, principled regular expression library

Added to portage

2017-03-28

runc - 1.0.0_rc3
Ebuild name:

app-emulation/runc-1.0.0_rc3

Description

runc container cli tools

Added to portage

2017-03-28

salt - 2016.11.3
Ebuild name:

app-admin/salt-2016.11.3

Description

Salt is a remote execution and configuration manager

Added to portage

2017-03-28

salt - 2016.3.6
Ebuild name:

app-admin/salt-2016.3.6

Description

Salt is a remote execution and configuration manager

Added to portage

2017-03-28

shellcheck - 0.4.6
Ebuild name:

dev-util/shellcheck-0.4.6

Description

Shell script analysis tool

Added to portage

2017-03-28

vivaldi - 1.8.770.46_p1
Ebuild name:

www-client/vivaldi-1.8.770.46_p1

Description

A new browser for our friends

Added to portage

2017-03-28

winetricks - 20170327
Ebuild name:

app-emulation/winetricks-20170327

Description

Easy way to install DLLs needed to work around problems in Wine

Added to portage

2017-03-28

youtube-dl - 2017.03.26
Ebuild name:

net-misc/youtube-dl-2017.03.26

Description

Download videos from YouTube.com (and more sites...)

Added to portage

2017-03-28

rdf newsfeed | rss newsfeed | Atom newsfeed
- Powered by LeopardCMS - Running on Gentoo -
Copyright 2004-2017 Sascha Nitsch Unternehmensberatung UG(haftungsbeschänkt)
Valid XHTML1.1 : Valid CSS : buttonmaker
- Level Triple-A Conformance to Web Content Accessibility Guidelines 1.0 -
- Copyright and legal notices -
Time to create this page: 9.6 ms
system status display