from small one page howto to huge articles all in one place
 

search text in:




Other .linuxhowtos.org sites: www.linuxhowtos.org
toolsntoys.linuxhowtos.org



Last additions:
How to make X listen on port 6000

How to make X listen on port 6000

words:

34

views:

38092

userrating:

average rating: 1.5 (4 votes) (1=very good 6=terrible)


May, 25th 2007:
April, 26th 2007:
Apr, 10th. 2007:
Druckversion . pdf icon
You are here: Portage


Details of app-editors/mp:

Description: Minimum Profit: A text editor for programmers
Homepage:
http://www.triptico.com/software/mp.html

available versions:

releasesalphaamd64armhppaia64mipsppcppc64ppc macoss390shsparcx86USE-Flagsdependenciesebuild warnings
mp-5.2.2 ++--+-++---++gtk
iconv
kde
ncurses
nls
pcre
qt4
>=x11-libs/pango-1.8.0
app-text/grutatxt
dev-lang/perl
dev-libs/atk
dev-libs/glib
dev-libs/libpcre USE-Flag: pcre
media-libs/fontconfig
media-libs/freetype
sys-devel/gettext USE-Flag: nls
sys-libs/ncurses USE-Flag: ncurses
virtual/libiconv

virtual/pkgconfig

x11-libs/cairo
x11-libs/gtk+ USE-Flag: gtk

show
show
Legend:
+ stable
~ testing
- not available
some ebuild warning depend on specific use-flags or architectures, all ebuild-warnings are shown.

Known bugs:
bug IDcomponentassigned tostatusdescriptionlast change
434702ApplicationsspingUNCONFIRMEDmedia-sound/mp3splt-gtk-0.7.3: QA Notice: This package installs one or more .desktop files that do n2012-11-21 18:48:15
426472Ebuildsmedia-videoUNCONFIRMEDmedia-plugins/live-2012.06.26: QA: compile: please use append-cppflags for preprocessor flags2012-07-18 15:11:05
451946ApplicationszerochaosUNCONFIRMEDdev-ruby/metasploit_data_models-0.4.0 version bump request2013-01-15 12:25:13
456818LibraryyngwinUNCONFIRMEDx11-libs/cairo-1.12.14: version bump2013-02-14 10:01:48
432954EbuildsxmwUNCONFIRMEDx11-misc/simpleswitcher - (new ebuild) simple EWMH window switcher2012-08-28 14:33:26
446312ApplicationsxmwUNCONFIRMEDapp-shells/autojump-21.1.0 causes startDM.sh to segfault during system start2013-01-25 08:51:42
449508EbuildsxboxUNCONFIRMEDmedia-tv/xbmc-12.0_rc2 with media-video/libav-0.8.4 - configure: error: You need either libswresampl2013-01-19 19:49:11
409015DevelopmentxarthisiusUNCONFIRMEDdev-util/intel-ocl-sdk: libOpenCL.so uses incompatible SONAME without SOVERSION2012-10-02 16:31:38
447862Applicationsx11UNCONFIRMEDx11-drivers/xf86-video-ati, x11-base/xorg-server or related components memory leak2013-01-03 13:26:06
446034Applicationsx11UNCONFIRMEDx11-drivers/xf86-video-intel-2.20.14 causes high cpu time consumption with X server2012-12-05 14:30:46
445590Libraryx11UNCONFIRMEDmedia-libs/mesa-9.0[g3dvl,vdpau]: Segmentation fault at surface.c:366 with media-video/mplayer2012-12-08 16:33:09
430000Applicationsx11UNCONFIRMED>=x11-drivers/ati-drivers-12.6 incompatible with >=x11-drivers/xf86-video-intel-2.20.32013-02-19 19:10:05
430070Applicationsx11UNCONFIRMEDx11-base/xorg-server-1.12.99.903 - using space in media-gfx/gimp-2.8.0-r1 causes segmentation fault 2012-08-08 18:40:49
428174Libraryx11UNCONFIRMEDmedia-libs/mesa-8.1_rc1_pre20120724 USE=r600-llvm-compiler - R600RegisterInfo.td:4762:27997: error: 2012-12-08 03:34:08
426550Ebuildsx11UNCONFIRMEDx11-misc/transset-1.0.0: incomplete man page2012-07-18 19:20:30
419757Ebuildsx11UNCONFIRMEDx11-libs/libXcomposite-0.4.3-r1 - configure: Package xfixes was not found in the pkg-config search p2012-06-06 09:23:20
401779Developmentx11UNCONFIRMEDx11-base/xorg-server-1.11.4 - XIO: fatal IO error 11 (Resource temporarily unavailable) on X server2012-02-01 17:35:48
390455Applicationsx11UNCONFIRMEDx11-misc/xcompmgr doesn't handle shape change2011-11-14 04:06:05
385219Applicationsx11UNCONFIRMED[x11 overlay] x11-drivers/xf86-input-synaptics-9999 compile fails2011-10-02 18:49:08
456826DevelopmentwxwidgetsUNCONFIRMEDdev-util/codeblocks-12.11 - Version bump.2013-02-11 19:12:11
455956ApplicationswxwidgetsUNCONFIRMEDapp-editors/wxhexeditor-0.21 version bump2013-02-07 11:28:22
452864ApplicationswschlichUNCONFIRMEDsys-power/sispmctl-3.1 - Version bump2013-01-18 22:41:39
407245EbuildswineUNCONFIRMEDapp-emulation/crossover-office-pro-bin-11.0.0 version bump2012-11-17 19:10:14
442150EbuildswschlichUNCONFIRMED=dev-util/sel-0.08.4 - ebuild improvements2012-11-07 04:02:20
436900EbuildswschlichUNCONFIRMEDnet-misc/connect-1.103(?) version bump and HOMEPAGE change2012-10-02 13:46:58
451174DevelopmentwltUNCONFIRMEDdev-db/firebird-2.1.3.18185.0 - Unable to complete network request to host "localhost". Error readin2013-01-10 12:51:53
420939ApplicationswltUNCONFIRMEDFirebird-2.5.1.26351.0 with use xinetd implies superclassic patch and cannot build/install fb_inet_s2012-06-13 07:50:17
448062ApplicationswilliamhUNCONFIRMEDapp-accessibility/speech-dispatcher-0.7.1-r1 src_compile(): mv: cannot stat '.deps/spd_audio.Tpo': N2013-01-01 12:02:28
400897EbuildswineUNCONFIRMEDapp-emulation/crossover-office-pro-bin-10.2.0 version bump2012-02-27 22:15:26
449032Serverweb-appsUNCONFIRMEDwww-apps/ampache-3.5.* needs additional dependency < dev-lang/php-5.42012-12-28 21:06:13
444368Applicationsweb-appsUNCONFIRMEDwww-apps/lxr fails with current dev-db/mysql. Bump version to 1.0.0?2012-11-23 16:04:59
397987Ebuildsweb-appsUNCONFIRMEDwww-apps/ampache-9999 LiveVCS ebuild2012-01-08 16:52:08
396289Ebuildsweb-appsUNCONFIRMEDapp-text/htp-1.17: version bump2011-12-29 16:27:39
439822Applicationsvserver-devsUNCONFIRMEDapp-backup/vzdump use "--rsyncable" gzip option2013-01-20 19:35:42
447408DevelopmentvoyageurUNCONFIRMEDsys-devel/llvm-3.1r2 - X86ELFWriterInfo.cpp:85:1: interner Compiler-Fehler: Speicherzugriffsfehler2012-12-22 12:30:47
442958DevelopmentvoyageurUNCONFIRMEDsys-devel/llvm fails to cross compile2012-11-13 16:20:28
427808EbuildsvoyageurUNCONFIRMEDx11-base/xorg-server-1.12.3 crashing at start-up when compiled with sys-devel/clang2012-12-31 12:32:19
427304ApplicationsvoyageurUNCONFIRMED=dev-libs/mpfr-3.1.1 fails tests with clang-3.1-r42012-10-08 15:16:38
416827EbuildsvoyageurUNCONFIRMEDdev-libs/glib - CFLAGS="-fplugin=/usr/lib64/llvm/dragonegg.so" - gbitlock.c:210:3: sorry, unimplemen2012-09-28 13:05:51
393489EbuildsvoyageurUNCONFIRMEDapp-office/libreoffice-3.5.0.0 fails to compile with sys-devel/dragonegg-3.02012-09-28 13:05:51
400547DevelopmentvoyageurUNCONFIRMEDdev-libs/STLport-5.2.1 does not compile using clang++ due to error in stlport/stl/_locale.h2012-01-25 13:51:23
393391KDEvoyageurUNCONFIRMED[kde overlay] kde-base/katepart-9999 fails to compile with sys-devel/dragonegg-3.02012-09-28 13:05:52
393373UnspecifiedvoyageurUNCONFIRMEDx11-libs/qt-gui-4.7.4-r1 fails to compile with sys-devel/dragonegg-3.02012-09-28 13:05:52
393377UnspecifiedvoyageurUNCONFIRMEDx11-libs/pixman-0.24.0 fails to compile with sys-devel/dragonegg-3.02012-09-28 13:05:51
393379EbuildsvoyageurUNCONFIRMEDx11-libs/qt-qt3support-4.7.4 fails to compile with sys-devel/dragonegg-3.02012-09-28 13:05:51
393381EbuildsvoyageurUNCONFIRMEDx11-libs/qt-webkit-4.7.4 fails to compile with sys-devel/dragonegg-3.02012-09-28 13:05:52
393383EbuildsvoyageurUNCONFIRMEDsys-devel/llvm-3.0 fails to compile with sys-devel/dragonegg-3.02012-09-28 13:05:52
393389KDEvoyageurUNCONFIRMED[kde overlay] kde-base/kdelibs-9999 fails to compile with sys-devel/dragonegg-3.02012-09-28 13:05:51
393385EbuildsvoyageurUNCONFIRMEDmedia-libs/phonon-vlc-0.4.1 fails to compile with sys-devel/dragonegg-3.02012-09-28 13:05:51
455348EbuildsvostorgaUNCONFIRMEDnet-news/liferea 1.10 rc1 version bump2013-02-05 11:25:38
437938EbuildsvostorgaUNCONFIRMEDnet-nds/phpldapadmin-1.2.3 version bump2012-10-11 13:24:27
430474ApplicationsvoipUNCONFIRMEDnet-voip/ekiga-3.2.7 with sys-devel/gcc-4.7 - ../../../../lib/engine/addressbook/source-impl.h:209:32012-12-14 13:07:23
392379ApplicationsvmwareUNCONFIRMEDapp-emulation/vmware-modules-238.5: vmmon-only/linux/hostif.c:2749:4: error: implicit declaration of2012-03-26 11:36:37
373333EbuildsvmwareUNCONFIRMEDapp-emulation/vmware-ovftool-2.0.1.260188: version bump2011-07-03 16:45:55
455914ApplicationsvimUNCONFIRMEDapp-editors/{g,}vim-7.3.806 version bump2013-02-07 03:13:05
448472ApplicationsvimUNCONFIRMEDapp-editors/gvim - segmentation fault when using clang_complete2012-12-25 15:39:05
417921ApplicationsvimUNCONFIRMEDapp-editors/vim - bash completion fails with paths containing spaces2012-05-28 11:50:58
457570ApplicationstoveUNCONFIRMEDapp-shells/zsh fails to compile with ncurses[tinfo]2013-02-14 19:59:26
445534GamestuponeUNCONFIRMEDmedia-libs/varconf-1.0.0: version bump request2012-12-02 01:59:02
416265EbuildstuponeUNCONFIRMEDVersion bump: media-libs/glm-0.9.3.32012-05-16 12:48:08
393605ApplicationstuponeUNCONFIRMED[BUMP] app-misc/geneweb-6.05 version bump2013-02-19 18:52:27
372375ApplicationstoveUNCONFIRMEDapp-shells/zsh-4.3.11-r1 error: "compaudit:107: unknown group"2012-12-22 09:22:46
453584EbuildstoveUNCONFIRMEDapp-shells/zsh - prompt_gentoo_setup: replace globally declared variables with local variables2013-01-24 09:42:42
434574Toolstools-portageUNCONFIRMEDapp-portage/genlop: bashcomp script fails when make.conf is in /etc/portage/2012-12-13 16:13:07
373823Toolstools-portageUNCONFIRMEDapp-portage/gentoolkit-0.3.0.4: `euse -i` dumps errors about missing repo_name files2012-12-25 01:55:28
377863Toolstools-portageUNCONFIRMEDapp-portage/gentoolkit: euse works improperly on g/fbsd2011-08-06 10:12:39
382589Toolstools-portageUNCONFIRMEDapp-portage/gentoolkit-0.3.0.4-r4: revdep-rebuild --library '/usr/lib/libgmp.so.3' doesn#t work2011-12-14 06:43:22
457684DevelopmenttoolchainUNCONFIRMEDdev-util/mingw64-runtime-2.0.7 version bump2013-02-19 04:36:50
458020Core systemtoolchainUNCONFIRMED[toolchain overlay] sys-libs/glibc-2.6.1 does not compile with up to date gcc and binutils (via cros2013-02-18 04:43:58
448124DevelopmenttoolchainUNCONFIRMEDsys-devel-gcc-4.5.3: internal compiler error on sci-biology/ncbi-tools++-9.0.0/work/ncbi_cxx--9_0_0/2012-12-26 17:28:43
446698LibrarytoolchainUNCONFIRMEDdev-libs/ppl-1.0 version bump request2013-02-05 08:27:08
447708Core systemtoolchainUNCONFIRMEDsys-devel/gcc-4.7.2 fails to crosscompile for mingw64: options.c:952:3: error: ‘HAVE_GAS_ALIGNED_COM2013-02-18 16:35:04
440308DevelopmenttoolchainUNCONFIRMEDcross-avr/gcc-4.7.2 - libgcc/configure: /var/tmp/portage/cross-avr/gcc-4.7.2/work/build/./gcc/as: li2012-10-30 19:53:50
437316Core systemtoolchainUNCONFIRMEDsys-devel/prelink-20120628: read-only files (mounts) trigger abort: Could not rename temporary to ..2013-01-23 11:03:37
436636JavatoolchainUNCONFIRMEDsys-devel/gcc-{4.5,4.6,4.7?}: gcj fails to compile java source code on ia64 (hardened) - Exception i2012-12-14 08:15:05
434452EbuildstoolchainUNCONFIRMED[4.5/ICE] www-client/firefox-15.0.1 - .../work/mozilla-release/js/src/vm/ObjectImpl.cpp:485:1: inter2012-12-07 08:28:56
434908Core systemtoolchainUNCONFIRMEDsys-devel/gcc-4.6.3: ICE in .../work/qemu-kvm-1.1.1/target-i386/op_helper.c:3650:1: internal compile2013-01-04 21:00:13
433056Core systemtoolchainUNCONFIRMEDsys-devel/gcc-4.7.1 fails to crosscompile with cross-powerpc64-unknown-linux-gnu/gcc-4.6.3: cc1: err2012-10-03 01:27:13
432300Core systemtoolchainUNCONFIRMEDsys-devel/gcc-4.5.3-r2 fails to crosscompile: gcc-4.5.3/libstdc++-v3/src/atomic.cc:91:62: error: inv2012-08-22 14:43:31
428220ApplicationstoolchainUNCONFIRMEDwww-client/firefox-10.0.5 - ld: BFD (GNU Binutils) 2.21.1 internal error, aborting at /var/tmp/porta2012-07-27 17:14:46
414967Core systemtoolchainUNCONFIRMEDsys-devel/gcc-4.6.3 in dev-lang/gforth-0.7.0 - ./engine.c:460:1: internal compiler error: in simplif2012-06-28 17:14:55
418209Core systemtoolchainUNCONFIRMEDcross-armv7m-none-eabi/gcc-4.5.3 stage1 cross-compiler fails2012-11-06 07:23:57
456172ApplicationstommyUNCONFIRMEDdev-vcs/subversion-(1.7.* ?) needs dev-db/sqlite:3 to be compiled with threadsafe2013-02-11 11:20:24
449212ApplicationstitanofoldUNCONFIRMEDapp-office/odeskteam-3.6.1 version bump2012-12-29 17:14:26
376643ApplicationstommyUNCONFIRMEDdev-libs/libtommath-0.42.0 cross compilation fix2013-01-26 23:25:03
457504EbuildstomjbeUNCONFIRMEDapp-backup/bacula-5.2.12: add support for installing examples into docdir2013-02-14 15:48:10
421881DevelopmenttexUNCONFIRMEDdev-tex/isotope version bump2012-06-19 11:47:38
423981EbuildstexUNCONFIRMEDdev-tex/dot2texi-3.0_p1 version bump2012-10-29 15:33:31
427208EbuildstexUNCONFIRMEDdev-tex/rubber-20100306 version bump request and HOMEPAGE update2012-12-22 18:27:45
435338ApplicationstexUNCONFIRMEDdev-tex/chktex-1.7.0 - .../work/chktex-1.7.0/FindErrs.c:320: warning: implicit declaration of functi2012-09-18 13:41:50
437116EbuildstexUNCONFIRMEDdev-tex/biblatex-2.5 version bump request2013-02-02 09:26:44
449198LibrarytexUNCONFIRMEDdev-tex/serienbrief-0.2.4 version bump2012-12-29 15:26:48
417927ApplicationstexUNCONFIRMEDdev-tex/latexmk - bash completion fails with paths containing spaces2012-05-28 11:51:57
458388EbuildstetrominoUNCONFIRMEDmedia-libs/libv4l-0.9.3 version bump2013-02-21 10:36:12
452910Core systemsystemdUNCONFIRMEDsys-apps/systemd-196[python] needs dev-python/pygobject:3 - ImportError: No module named gi.reposito2013-01-20 17:07:04
433457Core systemsystemdUNCONFIRMEDsys-apps/systemd should not store coredumps in its journal yet2012-10-27 21:52:30
455806EbuildssysadminUNCONFIRMEDnet-analyzer/{nagios,nagios-core}-3.4.4 - version bump request2013-02-06 12:51:08
453626ApplicationssysadminUNCONFIRMEDnet-analyzer/nagios-core-3.3.1 incomplete privilege grant2013-01-23 16:36:54
417323ApplicationssysadminUNCONFIRMEDnet-analyzer/nagios-core version bump to 3.4.12012-10-30 00:47:14
391827EbuildssysadminUNCONFIRMEDnet-analyzer/nagios-check_logfiles 2.3.2.1-r1 -> 3.4.5.2 version bump2012-08-19 15:26:59
456412ServerswegenerUNCONFIRMEDnet-dns/pdns-3.2 version bump2013-02-10 14:48:24
426990LibraryswaponUNCONFIRMEDnet-libs/gsoap-2.8.9 USE=examples - chaining.o: In function `ns__pow': chaining.c:(.text+0x55): unde2013-01-12 16:57:59
416573EbuildsswaponUNCONFIRMEDx11-drivers/xf86-video-virtualbox - invalid conversion from ‘void*’ to ‘RTHEAPSIMPLEBLOCK*’ [-fpermi2012-06-16 18:59:56
410553UnspecifiedswaponUNCONFIRMEDx11-drivers/xf86-video-virtualbox / app-emulation/virtualbox-guest-additions fail to cross-compile2012-04-03 15:23:22
448112ApplicationsspingUNCONFIRMEDmedia-gfx/gimp-2.8.2-r1 has several test failures.2012-12-24 00:28:37
442092ApplicationsspingUNCONFIRMEDmedia-gfx/gimp-9999 - Portage patch failed to apply (ltmain.sh version 2.4.2)!2012-11-10 00:24:49
454504ApplicationssoundUNCONFIRMED>=media-sound/mpg123-1.14.4 x32 ABI built with wrong LFS alias2013-01-29 14:56:43
453748EbuildssoundUNCONFIRMEDmedia-libs/fmod-4.44.04 version bump2013-01-24 02:59:38
448466EbuildssoundUNCONFIRMEDmedia-sound/gpodder 3.4.0 version bump request2012-12-25 03:39:36
436528LibrarysoundUNCONFIRMEDmedia-libs/speex: Resampler stops in the middle of run with multiple channels2012-09-29 15:26:02
418185ApplicationssoundUNCONFIRMEDmedia-sound/xmp-3.5.0 fails to play LZMA compressed module2012-06-03 13:36:25
398571LibrarysoundUNCONFIRMEDmedia-sound/id3v2-0.1.12 crashes when tagging mp3 with VBR due to a bug in media-libs/id3lib-3.8.32012-01-18 07:32:41
410333ApplicationssoundUNCONFIRMEDmedia-sound/milkytracker-0.90.85 - In member function ‘virtual bool DecompressorGZIP::decompress(con2013-01-30 18:31:25
442544Applicationsshell-toolsUNCONFIRMEDapp-shells/bash-completion-1.3 - No support for XZ compression with Okular.2012-11-11 16:23:59
440430Applicationsshell-toolsUNCONFIRMEDapp-shells/gentoo-bashcomp-20101217-r1: some elog messages should only be shown for the first instal2013-02-07 19:52:02
440428Applicationsshell-toolsUNCONFIRMEDapp-shells/bash-completion-1.3: some elog messages should only be shown for the first install.2012-10-31 16:10:30
426346Applicationsshell-toolsUNCONFIRMEDapp-shells/bash-completion - cd autocomplete's non-directories2012-07-17 20:17:44
426570Applicationsshell-toolsUNCONFIRMEDapp-shells/gentoo-bashcomp extended by a completion for eshowkw2012-07-17 16:56:11
431958Unclassifiedshell-toolsUNCONFIRMEDapp-shells/zsh-completion-20091203-r1 is broken because =sys-apps/portage-2.2.0_alpha121 does not in2013-01-28 08:57:32
432378Applicationsshell-toolsUNCONFIRMEDapp-shells/bash-completion - hard-coded path "/sbin/modinfo" in /usr/share/bash-completion/module-in2012-11-03 18:30:08
403123Unspecifiedshell-toolsUNCONFIRMEDapp-shells/gentoo-bashcomp - Add ebuild(1) --skip-manifest completion support2012-02-13 17:23:49
439978Applicationsshell-toolsUNCONFIRMEDapp-shells/zsh-completion - please add additional completions for ebuild2012-10-29 03:50:21
417945Applicationsshell-toolsUNCONFIRMEDapp-misc/devtodo - bash completion fails with paths containing spaces2012-05-28 12:08:16
417929Applicationsshell-toolsUNCONFIRMEDapp-shells/bash-completion: some builtin completions don't work with spaces2012-05-28 11:52:38
417925Applicationsshell-toolsUNCONFIRMEDapp-shells/gentoo-bashcomp - bash completion fails with paths containing spaces2012-05-28 11:51:25
417717Unspecifiedshell-toolsUNCONFIRMED[Tracker] bash completion files that fail with paths containing spaces2012-05-28 10:15:02
431628Default ConfigssecurityUNCONFIRMEDinformation disclosure of the IP address of all connected users to all simple users2012-09-10 06:20:24
447064ApplicationssgmlUNCONFIRMEDapp-text/build-docbook-catalog - file:///etc/xml/docbook:1: parser error : Document is empty2012-12-13 16:31:25
395711KernelsecurityUNCONFIRMEDkernel: tight loop and no preemption can cause system stall (CVE-2011-4621)2011-12-22 19:16:12
455430Librarysci-geosciencesUNCONFIRMEDsci-libs/shapelib-1.3.0-r1 - Please make a rev-bump after changing ebuild to install headers.2013-02-07 12:28:41
441760Ebuildssci-geosciencesUNCONFIRMEDsci-geosciences/gpsd-3.7 - NameError: name 'gps_regress' is not defined: File "/var/tmp/portage/sc2012-11-07 02:15:55
445824Applicationssci-geosciencesUNCONFIRMEDsci-libs/shapelib-1.3.0-r1 with perl-gcpan/DBD-XBase - file collision in /usr/bin/dbfdump2012-12-04 15:31:13
421325Applicationssci-geosciencesUNCONFIRMEDsci-geosciences/osm2pgsql-20100413 with sci-libs/geos-3.3.3 - In function ‘char* get_wkt_simple(osmN2012-10-10 14:53:15
405649Ebuildssci-geosciencesUNCONFIRMEDsci-geosciences/openstreetmap-icons-20110601 does not compile2012-03-16 09:50:52
439438Ebuildssci-chemistryUNCONFIRMEDsci-chemistry/wxmacmolplt-7.4.3 version bump2012-10-23 19:24:23
392061Ebuildssci-chemistryUNCONFIRMEDsci-chemistry/platon-20110126 checksum failure - version bump ?2011-11-29 15:58:48
368473Applicationssci-biologyUNCONFIRMEDsci-biology/hmmer-3.0 fails to build with "mpi.c:27:23: error: impl_dummy.: No such file or director2011-06-21 09:31:43
452622LibrarysciUNCONFIRMEDdev-python/pytables needs to be recompiled for the exact sci-libs/hdf5 version.2013-01-18 20:03:31
450886DevelopmentsciUNCONFIRMEDdev-python/numpy-1.6.2 with dev-lang/icc - blas_*_info: libraries mkl,vml,guide not found in [libd2013-01-08 14:09:21
449320LibrarysciUNCONFIRMEDsci-libs/cholmod-2.0.1 - configure: .../temp/ccKrajc0.o: In function `main': conftest.c:(.text+0x7):2013-01-05 00:28:07
447502LibrarysciUNCONFIRMEDdev-python/numpy-1.6.2 - FAIL: test_pareto (test_random.TestRandomDist)2013-01-05 08:15:18
446356ApplicationssciUNCONFIRMEDsci-visualization/mayavi-4.2.0 - /var/tmp/portage/sci-visualization/mayavi-4.2.0/temp/environment: l2012-12-27 09:32:14
444104ApplicationssciUNCONFIRMEDsci-libs/scipy-0.11.0 - numpy.distutils.system_info.BlasNotFoundError2012-12-06 15:49:39
442880EbuildssciUNCONFIRMED[science overlay] sci-libs/trilinos-10.12.2 - Version bump; install location fix; prefix support.2012-11-12 19:00:06
424461EbuildssciUNCONFIRMED[science overlay] app-portage/g-octave-9999 fails running with ImportError: cannot import name Confi2012-07-02 10:57:20
413515DevelopmentsciUNCONFIRMEDsci-libs/scipy - import failures due to missing symbols in clapack.so2013-02-07 13:44:35
397885ApplicationssciUNCONFIRMEDsci-misc/boinc-6.12.42: boincmgr process keeps running and an empty space is left in the taskbar aft2012-04-18 12:43:50
383659ApplicationssciUNCONFIRMED[science overlay] sci-biology/emboss-6.4 version bump2012-02-24 18:29:22
458412DevelopmentschemeUNCONFIRMEDdev-scheme/racket-5.3.3 version bump2013-02-20 14:34:10
446190ServersambaUNCONFIRMEDnet-fs/samba-3.5.19: cross compile fixes2012-12-06 05:03:46
395007Prefix SupportryaoUNCONFIRMEDImport net-misc/tor-0.2.2.34-r1 on x64-macos2012-08-10 18:51:21
453262EbuildsrubyUNCONFIRMEDdev-ruby/pdf-reader-1.3.0 version bump request2013-01-21 12:10:53
397329ApplicationsrubyUNCONFIRMEDdev-lang/ruby-1.9.3_p0 does not compile2012-01-03 21:33:00
456184Ebuildsrobbat2UNCONFIRMEDsys-block/tw_cli-10.2.2.1 version bump2013-02-08 17:23:20
449990Core systemrobbat2UNCONFIRMEDsys-process/audit - init script doesn't handle /var/lock on tmpfs properly2013-01-03 12:37:09
448354Core systemrobbat2UNCONFIRMEDsys-fs/lvm2-2.02.97-r1 fails to crosscompile: configure: error: thin_check not found in path2013-01-19 16:12:30
436986Applicationsrobbat2UNCONFIRMEDapp-portage/g-cpan - perl-gcpan/Finance-QuoteHist-1.16 attempts to pull in perl-gcpan/Date-Manip, ig2012-10-02 17:09:49
411115Developmentrobbat2UNCONFIRMEDdev-util/rats-2.3 version bump and HOMEPAGE change2012-04-07 08:41:07
402277Applicationsrobbat2UNCONFIRMEDnet-misc/memcached-1.4.13 version bump (1.4.11 does not build)2013-01-01 15:39:01
401473Ebuildsrobbat2UNCONFIRMEDapp-misc/dnetc-2.9110.519 version bump2012-11-19 09:35:41
401249Applicationsrobbat2UNCONFIRMEDnet-mail/qmailadmin-1.2.16 version bump2012-01-30 11:52:34
395839Applicationsrobbat2UNCONFIRMEDnet-misc/adjtimex-1.29 is not compatible with baselayout-22011-12-26 10:07:56
392953Ebuildsrobbat2UNCONFIRMEDdev-java/lucene-3.6.1 Version Bump2012-11-19 09:35:47
376169Applicationsrobbat2UNCONFIRMEDapp-backup/amanda-3.2.[12] EXTRA_ECONF=--with-dump-honor-nodump - /usr/sbin/dump 9Sf /dev/null /dev/2013-01-13 19:09:47
458186ApplicationsreavertmUNCONFIRMED=dev-util/ddd-3.3.12-r3: fails to compile with ncurses[tinfo]2013-02-19 20:20:58
373891EbuildsramerethUNCONFIRMEDnet-misc/stunnel build fails: #error OpenSSL library compiled without thread support2012-12-25 04:27:10
437028UnspecifiedrafaelmartinsUNCONFIRMEDdev-lua/luafilesystem-1.6.0 version bump2013-02-03 13:08:28
451132ApplicationsrajivUNCONFIRMEDnet-dns/dnstop version bump request2013-02-03 15:00:48
434236DevelopmentrafaelmartinsUNCONFIRMEDdev-lua/luafilesystem-1.5.0 with dev-lang/lua-5.2.1: src/lfs.c:779:30: error: array type has incompl2013-02-03 13:08:19
419389ApplicationsradhermitUNCONFIRMEDwww-client/lynx-2.8.8_pre12 fails to build: ../../../WWW/Library/Implementation/HTUtils.h:735:17: fa2012-06-16 09:40:28
432106DevelopmentradhermitUNCONFIRMEDdev-libs/protobuf-2.4.0a fails to crosscompile: …/protoc: cannot execute binary file2013-01-01 20:30:56
430996EbuildsradioUNCONFIRMEDnet-wireless/gnuradio-3.6.1-r1 does not byte-compile grc_gnuradio package2012-08-12 11:35:18
458278DevelopmentqtUNCONFIRMEDdev-util/eric-5.2.7 - RuntimeError: the sip module implements API v9.0 to v9.1 but the PyKDE4.kdeui 2013-02-21 12:24:07
458266ApplicationsqtUNCONFIRMEDmedia-video/smplayer should respect LINGUAS2013-02-20 14:37:33
451456LibraryqtUNCONFIRMED[qt overlay] Qt5 packages try to link against already installed versions during recompilation2013-02-14 11:59:11
458170EbuildsqtUNCONFIRMEDnet-news/quiterss-0.12.1 - version bump request2013-02-18 22:02:11
408275Applicationsqmail-bugsUNCONFIRMEDmail-mta/netqmail-1.06 - SMTPRCPTTO is empty2012-12-10 15:51:17
440214EbuildsqaUNCONFIRMED[tracker] packages with emerge messages that can be improved by checking the previous installed vers2013-02-14 19:45:48
442326ApplicationsqemuUNCONFIRMEDsys-firmware/sgabios-0.1_pre8 - Compile phase failure - ld: i386:x86-64 architecture of input file `2012-11-08 10:43:27
405727Eclasses and ProfilesqaUNCONFIRMEDalternatives.eclass - various improvements2012-02-27 00:05:53
390571CoreqaUNCONFIRMEDdev-perl/CDDB_get 2.27 - environment: line 345: pushd: /var/tmp/portage/dev-perl/CDDB_get-2.27/work/2011-11-22 19:19:25
455210DevelopmentpythonUNCONFIRMEDdev-lang/python-3.2.3 fails to build native Parser/pgen while crosscompiling2013-02-04 19:42:53
407681ApplicationspythonUNCONFIRMEDmedia-sound/quodlibet-2.3.92-r1 segfaults when dev-lang/python-2.7.2-r3 is compiled with the hardene2012-10-06 17:14:29
413863DevelopmentpythonUNCONFIRMEDdev-lang/python-3.2.3 - improve cross compilation2012-12-17 14:57:26
404063DevelopmentpythonUNCONFIRMEDVersion bump: =dev-python/kinterbasdb-3.3.02012-03-09 08:44:10
402659DevelopmentpythonUNCONFIRMEDdev-python/pydb-1.26-r1 - ImportError: No module named fns2012-04-24 16:19:54
371009DevelopmentpythonUNCONFIRMEDdev-lang/python-2.7.1-r1 fails to cross compile on mipsel-r3000-linux-uclibc2011-10-02 21:07:28
458256ApplicationsprometheanfireUNCONFIRMEDmedia-sound/spotify-0.8.8.323-r1 spotify-dbus.py isn't python 3.2 compatible2013-02-19 14:22:25
440316ApplicationsproaudioUNCONFIRMEDmedia-sound/sonic-visualiser-2.0 version bump2013-01-11 12:08:59
397671EbuildsproaudioUNCONFIRMEDmedia-sound/vmpk add USE=doc2012-01-05 02:47:42
391675EbuildsproaudioUNCONFIRMEDmedia-plugins/swh-plugins - make x86 extensions optional at compile time2012-07-04 13:47:31
457518PrintingprintingUNCONFIRMEDapp-text/gsview 5.0 version bump2013-02-14 14:02:47
450080ApplicationsprintingUNCONFIRMEDapp-text/pdftk-1.45 version bump2013-01-21 15:08:02
450220ApplicationsprintingUNCONFIRMED=net-print/cups-1.5.2-r4 - German localization file has empty strings.2013-01-05 18:07:19
455238LibraryprintingUNCONFIRMEDmedia-libs/vigra-1.7.1-r1 failed (compile phase): ImportError: No module named nose2013-02-05 01:00:18
420623PrintingprintingUNCONFIRMEDnet-print/foo2zjs-99999999 fails emerge with permission denied, access attempt outside the sandbox2013-01-27 23:07:16
429442EbuildsprintingUNCONFIRMEDapp-text/ghostscript-gpl - disable endian check when cross-compiling2012-08-02 13:07:09
455926Prefix SupportprefixUNCONFIRMEDperl-5.16.2 will install empty if prefix lives in /usr/local2013-02-06 22:57:05
446796ApplicationsprefixUNCONFIRMEDapp-misc/pax-utils: src_install tries to compile stuff2013-01-02 17:41:59
433972Prefix SupportprefixUNCONFIRMEDapp-text/tree-1.6.0-r1: failed to compile on Mac OSX Mountain Lion2012-10-10 01:23:24
422535Prefix SupportprefixUNCONFIRMEDdev-lisp/sbcl-1.0.55-r1: Fail to compile on x64 OS X due to missing binary2012-06-21 05:23:34
413167Prefix SupportprefixUNCONFIRMEDsys-fs/fuse-2.9.0: emerge failed at compile phase.2012-04-22 23:17:14
392979Prefix SupportprefixUNCONFIRMEDmedia-gfx/fontforge-20110222-r1 fails to compile on x86-macos2012-05-31 12:28:59
387733Prefix SupportprefixUNCONFIRMEDmedia-video/mplayer2-9999 fails to build on MacOS X in gentoo prefix2012-05-13 21:53:31
381105Prefix SupportprefixUNCONFIRMEDdev-lang/nasm-2.09.10: failed to compile in prefix/linux-amd642011-08-30 04:04:34
371601Prefix SupportprefixUNCONFIRMEDmedia-libs/gegl fails to compile2012-06-23 20:46:50
401617Core systemppc64UNCONFIRMEDsys-kernel/gentoo-sources-3.2.1-r2 produces a lot of "BUG: using smp_processor_id() in preemptible .2012-02-05 03:20:56
379967Applicationspolynomial-cUNCONFIRMEDapp-emulation/virtualbox-modules-4.0.12 doesn't check kernel config on compatibility2011-08-22 12:36:13
380301Applicationspolynomial-cUNCONFIRMEDapp-emulation/virtualbox-4.1.2 crashes when compiling with -O2 option2012-02-01 09:06:12
383669Applicationspolynomial-cUNCONFIRMEDapp-emulation/virtualbox-4.1.2: fails to compile due to Java name clash2011-12-21 14:52:14
366215Applicationspolynomial-cUNCONFIRMEDapp-emulation/virtualbox has incomplete dependencies2013-01-01 09:29:16
456800Developmentphp-bugsUNCONFIRMEDdev-php/pecl-memcache-3.0.7 version bump2013-02-11 17:02:08
456820Developmentphp-bugsUNCONFIRMEDdev-lang/php-5.3.21-r2 fails to compile with USE="ssl"2013-02-12 08:54:30
455156Developmentphp-bugsUNCONFIRMEDdev-php/PEAR-MDB2 + drivers version bump2013-02-04 02:31:17
453924Developmentphp-bugsUNCONFIRMEDdev-lang/php-5.4.8 - Shouldn't create /var/lib/net-snmp/mib_indexes at runtime2013-01-26 01:47:58
453840Libraryphp-bugsUNCONFIRMEDdev-php/pecl-ssh2-0.12 version bump request2013-01-28 13:43:19
453412Developmentphp-bugsUNCONFIRMEDdev-php/PHPUnit_MockObject-1.2.3 - Version Bump2013-02-19 17:42:20
453410Developmentphp-bugsUNCONFIRMEDdev-php/PHP_CodeCoverage-1.2.7 - Version Bump2013-02-19 14:37:27
451512Libraryphp-bugsUNCONFIRMEDdev-php/xcache-3.0.1 version bump2013-02-05 20:33:39
449264Libraryphp-bugsUNCONFIRMEDdev-php/pecl-mongo-1.3.2 version bump2013-01-08 14:42:51
448558Applicationsphp-bugsUNCONFIRMEDdev-php/PEAR-Mail_Mime-1.8.7 version bump request2012-12-25 17:46:14
443070Ebuildsphp-bugsUNCONFIRMEDdev-php/PEAR-Spreadsheet_Excel_Writer-0.9.3 version bump2013-01-14 14:16:17
435742Applicationsphp-bugsUNCONFIRMEDdev-php/igbinary-1.1.1-r1 with dev-lang/php[threads] compilation fails with: apc_serializer.h:57:5: 2012-09-21 16:43:14
422459Applicationsphp-bugsUNCONFIRMEDdev-php/smarty-2.6.26 version bump request2013-01-21 18:16:37
392719Developmentphp-bugsUNCONFIRMEDdev-lang/php does not compile with alternative ROOT2012-03-02 12:58:20
429378DevelopmentperlUNCONFIRMEDdev-lang/perl-5.16 already provides Data::Dumper2012-11-10 12:52:41
420245DevelopmentperlUNCONFIRMEDdev-perl/DBD-mysql-4.021 version bump2012-06-08 16:58:51
407801EbuildsperlUNCONFIRMEDdev-libs/syck to 0.70 version bump2012-03-28 10:17:03
378645DevelopmentperlUNCONFIRMEDdev-perl/math-pari ignores profile, and fails when compiling on2011-08-20 17:10:38
431036ApplicationspchristUNCONFIRMEDdev-lisp/sbcl fails to compile (when the build system is testing "sb-posix")2012-08-30 18:50:48
458440ApplicationspatrickUNCONFIRMEDapp-office/openerp-6.1.1-r1 USE=-postgres - sed: can't read /var/tmp/portage/app-office/openerp-6.1.2013-02-20 15:16:18
445120LibrarypatrickUNCONFIRMEDsys-libs/tdb-1.2.10 - Compilatin phase failed - [Errno 2] No such file or directory: '/var/tmp/porta2012-12-08 15:46:16
444502ApplicationspatrickUNCONFIRMEDapp-benchmarks/phoronix-test-suite-4.0.1 - No matter what, it complains that PHP_TARGETS is empty2012-12-25 22:09:37
430274EbuildspatrickUNCONFIRMEDwww-servers/apache-2.2.22-r1: modules aren't compiled with -fPIC2013-02-16 13:34:26
425008ApplicationspatrickUNCONFIRMEDapp-crypt/gorilla-1.5.3.6 version bump2013-02-05 22:02:45
410699ApplicationspatrickUNCONFIRMEDwww-servers/apache-2.4.1-r2 /etc/init.d/apache2 start complains about Config variable ${SVN_REPOS_LO2013-02-16 13:32:09
406187LibrarypatrickUNCONFIRMEDsys-libs/talloc-2.0.7 - [Errno 2] No such file or directory: '/var/tmp/portage/sys-libs/talloc-2.0.72012-03-29 20:03:40
410451ApplicationspatrickUNCONFIRMEDwww-servers/apache-2.4.1-r1 APACHE2_MPMS="itk" - configure: error: MPM itk is not supported on this 2013-02-16 13:20:37
397403ApplicationspatrickUNCONFIRMEDwww-apps/otrs - add app-admin/webapp-config compatibility / webapp.eclass support2012-08-24 13:09:08
391041ServerpatrickUNCONFIRMEDwww-servers/apache 2.2 - suexec and django non-ASCII file upload incompatibility as apache cut out L2013-02-16 14:04:07
385783ApplicationspatrickUNCONFIRMEDwww-servers/apache-2.2.21 cross-compilation fix (libtool related)2013-02-16 13:33:00
385779ApplicationspatrickUNCONFIRMEDapp-admin/apache-tools-2.2.21 cross-compilation fix (libtool related)2013-02-16 13:32:00
446172Core systempam-bugsUNCONFIRMEDsys-libs/pam-1.1.5 fails to cross-compile because flex is not installed in the target2013-01-09 09:31:35
373979EbuildspatrickUNCONFIRMEDapp-emulation/virtualbox-modules-4.0.10 does not compile if KBUILD_OUTPUT != KERNEL_DIR2012-09-11 09:29:19
458508EbuildspachoUNCONFIRMEDsys-power/bbswitch kernel 3.8 compatibility hack2013-02-20 22:50:36
371915Applicationspam-bugsUNCONFIRMEDwtmp contains duplicate log entries2011-06-16 23:05:59
452162ApplicationspachoUNCONFIRMED=net-wireless/bluez-5.2 version bump request2013-02-08 20:41:38
444652OpenRCopenrcUNCONFIRMEDUpgrade to OpenRC 0.11.5 breaks services: "You are attempting to run an openrc service on a system w2012-12-16 02:58:07
434020OpenRCopenrcUNCONFIRMEDnet.example in docs dir suggest a faulty bond0-configuration.2012-09-05 11:55:57
456980ApplicationsopenofficeUNCONFIRMEDapp-office/libreoffice-4.0.0.3 - inserting movie or sound in impress fails with "The format of the s2013-02-13 19:08:21
367793OpenRCopenrcUNCONFIRMED[TRACKER] packages with scripts that are not openrc compatible2011-12-12 05:30:39
372551OpenRCopenrcUNCONFIRMEDsys-apps/openrc: rc.c:read_key() hangs waiting for input at Interactive? prompt (termios problem)2012-02-15 12:49:05
378633Core systemopenrcUNCONFIRMEDrestarting one interface complains that dhcpcd is already running, even if in fact it is not (race c2011-08-13 14:26:13
412545DevelopmentolemarkusUNCONFIRMEDdev-php/phpmd 1.3.3 version bump2012-04-18 19:40:01
452674LibraryolemarkusUNCONFIRMEDdev-php/Yaml-2.1.7 - The Symfony 2 YAML Component2013-02-19 14:34:22
401559Ebuildsoli.huberUNCONFIRMEDwww-apps/joomla-2.5.0 version bump2012-04-23 21:29:49
436558Ebuildsoli.huberUNCONFIRMEDwww-apps/joomla-3.0.0 version bump2012-11-26 22:52:16
377933ApplicationsopenofficeUNCONFIRMEDapp-office/libreoffice-3.4.2.3 Impress text boxes become inaccessible when containing RTL text2012-04-03 23:26:53
448142EbuildsnixphoeniUNCONFIRMEDsci-electronics/eagle-6.4.0 - Version bump.2013-01-29 13:36:42
436534EbuildsnirbheekUNCONFIRMEDmedia-fonts/source-sans-pro-1.036 version bump2012-09-29 15:26:54
457566LibrarynikoliUNCONFIRMEDmedia-libs/libechonest-2.0.3 version bump2013-02-15 15:35:23
448938EbuildsnikoliUNCONFIRMEDmedia-video/mplayer2 needs a local description of bindist USE-flag2012-12-27 20:30:03
452484ApplicationsnikoliUNCONFIRMED=media-video/mplayer2-2.0_p20120828 ABI=x32 - cpudetect.c:206: Error: invalid instruction suffix for2013-01-29 12:55:58
437840ApplicationsnetmonUNCONFIRMEDnet-analyzer/net-snmp-5.7.2_rc1 - snmpd(XX): floating-point assist fault at ip 20000595aab3efc2, isr2012-10-14 18:00:40
435982ApplicationsnetmonUNCONFIRMEDnet-analyzer/tcpdump-4.3.0 fails tests: esp4, esp5, isakmp4, ikev2pI22012-10-12 10:51:32
433443EbuildsnetmonUNCONFIRMEDnet-analyzer/snmptt should install snmptthandler-embedded2012-09-03 15:46:10
430428EbuildsnetmonUNCONFIRMEDnet-analyzer/ntop-5.0.1 version bump2013-01-11 16:41:42
374085ApplicationsnetmonUNCONFIRMEDnet-analyzer/tcptrace cross compilation fix2011-07-08 19:12:28
383055EbuildsnetmonUNCONFIRMEDnet-analyzer/rrdtool[ruby] - fails to compile2011-09-16 22:56:02
373865ApplicationsnetmonUNCONFIRMEDnet-analyzer/tcptraceroute cross compiling fix2011-07-05 00:10:15
447902Ebuildsnet-proxyUNCONFIRMEDnet-proxy/dansguardian-2.12.0.3 version bump request2012-12-21 05:38:19
433942Applicationsnet-p2pUNCONFIRMEDnet-p2p/amule - amule fails to start when an empty ~/.aMule/statistics.dat file is present2012-09-04 15:33:37
445776Ebuildsnet-p2pUNCONFIRMEDnet-p2p/wire-1.1.3 version bump request2012-12-03 11:25:21
446184Applicationsnet-p2pUNCONFIRMEDnet-libs/libtorrent-0.13.2: fails to cross compile2012-12-06 05:02:50
446186Applicationsnet-p2pUNCONFIRMEDnet-p2p/rtorrent-0.9.2: bad configure check prevents cross-compilation2012-12-06 05:03:19
406685Ebuildsnet-p2pUNCONFIRMEDapp-arch/torrentzip-0.9 version bump request2012-12-30 07:20:56
445276Ebuildsnet-mailUNCONFIRMEDmail-client/alpine-2.10 - Version bump request.2013-01-22 08:16:27
448352Core systemnet-mailUNCONFIRMEDdev-libs/cyrus-sasl-2.1.25-r3 fails to crosscompile: ./makemd5: ./makemd5: cannot execute binary fil2012-12-25 18:07:35
448574Applicationsnet-mailUNCONFIRMEDmail-client/etpan-ng-0.7 fails to recognize address book when composing message2012-12-26 02:54:28
450116Ebuildsnet-mailUNCONFIRMEDnet-mail/fetchyahoo-2.14.9 bump request2013-01-05 16:03:52
425328Applicationsnet-mailUNCONFIRMEDmail-client/cone-{0.89,0.90} segfault on unsuccessful attempt of login to spop3 server2012-07-09 11:36:39
429802Ebuildsnet-imUNCONFIRMEDnet-im/sendxmpp-1.20 with 2012-08-04 16:43:36
432706Applicationsnet-imUNCONFIRMEDnet-im/pidgin 2.10.6 XMMP/IRC accounts do not connect automatically, "waiting for network connection2012-08-28 09:58:27
449526Applicationsnet-imUNCONFIRMEDnet-im/pidgin-2.10.6 fails to compile with USE="eds" and gnome-extra/evolution-data-server-3.62013-02-12 16:15:52
453642Applicationsnet-imUNCONFIRMEDnet-im/empathy-2.34.0-r2 - accounts window fails to open2013-01-23 16:38:50
428486Ebuildsnet-ircUNCONFIRMEDnet-irc/ngircd-19.2 version bump2012-07-29 05:08:33
381051Ebuildsnet-imUNCONFIRMEDnet-im/ekg version bump to 1.8rc22012-05-04 04:26:34
399489Applicationsnet-imUNCONFIRMEDnet-im/pidgin XMPP/SASL authentication fail with >=dev-libs/cyrus-sasl-2.1.252012-02-07 20:53:55
380889Applicationsnet-imUNCONFIRMEDnet-im/sendxmpp-1.20 does not work when dev-perl/XML-Stream-1.22 is installed (1.23 needed)2011-09-01 19:39:25
445288Ebuildsnet-fsUNCONFIRMEDnet-fs/nfs-utils-1.2.7 version bump2013-01-03 16:19:34
436122Ebuildsnet-dialupUNCONFIRMEDnet-dialup/ppp-2.4.5-r3 - Failed Patch: 80_all_eaptls-mppe-0.991-gentoo.patch !2012-11-09 04:09:40
425332Ebuildsnet-dialupUNCONFIRMEDnet-dialup/capisuite-0.4.5 doesn't compile with python 3.* as active python interpreter2012-07-09 11:37:10
406139Applicationsnet-dialupUNCONFIRMEDnet-dialup/ppp-2.4.5-r2: /etc/resolv.conf gets emptied upon connection re-negotiation.2012-04-06 22:11:33
384883Applicationsnet-dialupUNCONFIRMEDnet-dialup/ppp: with net-dns/openresolv /etc/ppp/ip-up.d/50-initd.sh stomps /etc/ppp/ip-up.d/40-dns.2011-10-01 02:49:50
374667Applicationsnet-dialupUNCONFIRMEDnet-dialup/rp-pppoe fail to cross compile2011-07-10 18:06:14
373635Ebuildsnet-dialupUNCONFIRMEDnet-dialup/ppp: add postinst message for break compatibility with dependent packages2011-07-01 01:38:55
373365Applicationsnet-dialupUNCONFIRMEDnet-dialup/radiusclient-ng fail to cross-compile2011-07-01 19:11:38
373369Applicationsnet-dialupUNCONFIRMEDnet-dialup/freeradius-client fail to cross-compile2011-07-03 16:45:23
373347Applicationsnet-dialupUNCONFIRMEDnet-dialup/radiusclient fail to cross-compile2011-07-01 19:11:18
451978ApplicationsnaotaUNCONFIRMEDmedia-video/v4l2loopback-0.6.2 - Version bump to support kernel 3.72013-01-14 22:49:56
436978Applicationsmysql-bugsUNCONFIRMEDdev-db/mysql-5.6 version bump2013-02-07 05:41:47
416553Ebuildsmysql-bugsUNCONFIRMEDdev-db/mysql++ version bump 3.1.02013-02-14 15:02:05
385513Developmentmysql-bugsUNCONFIRMEDdev-db/mariadb-5.1.50: failed to compile x86-libs with multilib-overlay enabled2011-10-30 04:20:27
383405Servermysql-bugsUNCONFIRMEDmod-auth-mysql: version bump and enhancements2012-11-27 20:00:29
427700Ebuildsmr_bones_UNCONFIRMEDapp-misc/figlet-2.2.5 version bump2012-07-23 12:15:04
417947Applicationsmr_bones_UNCONFIRMEDapp-misc/figlet - bash completion fails with paths containing spaces2012-05-28 12:08:37
422447ApplicationsmozillaUNCONFIRMEDwww-client/firefox 10.0.5 creates /tmp/mozilla-media-cache2012-06-20 12:56:08
427038ApplicationsmozillaUNCONFIRMEDthunderbird: useflag "crypt" use uncompatible version of enigmail or gnupgp2012-07-25 01:52:10
446866UnspecifiedmozillaUNCONFIRMEDdev-libs/nspr-4.9.2 - checking whether the C compiler (gcc -Os -pipe -march=armv6j -mfpu=vfp -mfloat2013-01-05 13:03:54
445154ApplicationsmozillaUNCONFIRMEDwww-client/firefox-17.0-r1[-libnotify] and mail-client/thunderbird-17.0-r1[-libnotify] always compil2012-12-17 15:23:57
415705EbuildsmozillaUNCONFIRMEDdev-libs/nspr-4.9: native-nsinstall: cannot access nspr-config (error installations by cross compila2013-01-05 13:03:46
406541ApplicationsmozillaUNCONFIRMEDmail-client/thunderbird-10.0.1-r1 and www-client/firefox-10.0.1-r1 - checking whether the C compiler2012-03-06 13:50:15
452558DevelopmentmlUNCONFIRMEDdev-lang/mlton-20100608 fails to build, unknown type name '__gmp_const'2013-01-25 08:43:11
377079ApplicationsmmokrejsUNCONFIRMEDsci-biology/GBrowse-2.39 fails to compile2011-08-02 20:22:32
391705Applicationsmobile-phoneUNCONFIRMEDapp-mobilephone/kannel-1.5.0 version bump2011-11-24 17:47:28
417525Ebuildsmobile-phoneUNCONFIRMEDapp-mobilephone/dfu-util-0.7 version bump2013-01-25 02:12:45
445055ApplicationsmlUNCONFIRMEDnet-misc/unison-2.40.102 version bump2012-11-28 15:44:46
458062Core systemmiskaUNCONFIRMEDsys-power/acpid-2.0.18 version bump2013-02-18 13:37:27
411829Applicationsmirror-adminUNCONFIRMEDwww-apps/mirmon-2.5 version bump2012-04-24 16:58:27
411521ApplicationsmgornyUNCONFIRMEDapp-arch/zpaq-4.04 execution attempt in: 2013-01-12 17:31:30
456110Applicationsmedia-videoUNCONFIRMED[multimedia overlay] mpv-9999 --disable-tv-bsdbt848 and --disable-radio-bsdbt848 does not exist anym2013-02-09 15:41:09
457652Applicationsmedia-videoUNCONFIRMEDmedia-video/mplayer-1.1 - fix building against >=media-libs/giflib-52013-02-18 15:14:07
454568Librarymedia-videoUNCONFIRMEDmedia-libs/mlt-0.8.8 - luma.c:92:11: erreur interne du compilateur: dans build2_stat, à tree.c:38032013-02-01 10:14:17
449306Applicationsmedia-videoUNCONFIRMEDmedia-video/gaupol-0.21 version bump request2012-12-30 16:48:12
442886Applicationsmedia-videoUNCONFIRMEDmedia-video/devede' - elog mentions "lame" for mplayer, but that flag isn't used in mplayer.2012-11-12 18:50:32
433375Applicationsmedia-videoUNCONFIRMEDmedia-video/cinelerra ignores LDFLAGS, causing multilib compile failure2012-11-20 12:23:36
430960Applicationsmedia-videoUNCONFIRMEDmedia-video/vlc[vaapi] should depend on virtual/ffmpeg[vaapi]2013-01-26 17:56:56
427004Applicationsmedia-videoUNCONFIRMEDmedia-video/ffmpeg-0.10.3 ABI=x32 - libavfilter/libmpcodecs/vf_ilpack.c:116: Error: operand type mis2012-09-25 03:49:30
418037Applicationsmedia-videoUNCONFIRMEDmedia-video/subtitlecomposer-0.5.3 USE=xine fails due to underlinking: ld: CMakeFiles/subtitlecompos2012-05-29 00:01:02
386947Librarymedia-videoUNCONFIRMEDmedia-libs/libdv-1.0.0-r2 - enc_input.c:1021:26: error: array type has incomplete element type2011-11-12 17:03:32
384947Applicationsmedia-videoUNCONFIRMEDmedia-video/aacskeys-0.4.0c-r1: please update ProcessingDeviceKeysSimple.txt2012-08-23 16:40:14
378557Librarymedia-videoUNCONFIRMEDmedia-libs/libvpx-0.9.7: Compile failure with debug USE flag - "No rule to make target libvpx_g.so, 2012-09-15 05:01:43
367699Ebuildsmedia-videoUNCONFIRMEDmedia-video/winki - winki: [..] ImportError: No module named gnome (missing RDEPEND?)2011-05-17 23:55:09
413457Applicationsmedia-tvUNCONFIRMEDmedia-tv/dvbstreamer-2.1.0 version bump2012-04-29 13:11:46
388189Ebuildsmedia-tvUNCONFIRMEDVersion bump: media-tv/freevo-1.9.2b22011-10-23 11:53:46
454618Applicationsmedia-opticalUNCONFIRMEDapp-cdr/kcdemu-0.5.0 version bump2013-01-30 14:05:54
455790Applicationsmedia-opticalUNCONFIRMEDapp-cdr/pburn-3.7.14 version bump2013-02-06 13:41:07
430894Core systemmattmUNCONFIRMEDsys-power/apcupsd-3.14.10-r1[snmp] fails to build with latest net-snmp2013-02-02 23:16:04
430690EbuildsmattmUNCONFIRMEDnet-libs/wt-3.2.2 - Aborting due to QA concerns: 4 files installed in /tmp/portage/net-libs/wt-3.2.22012-09-17 06:33:36
458376Ebuildsmaintainer-wantedUNCONFIRMEDdev-db/odb-examples - Programming examples for use with ODB (dependency of dev-db/odb)2013-02-20 13:24:27
458520Ebuildsmaintainer-wantedUNCONFIRMEDgames-board/pachi-10.00 - Simple Go/Baduk/Weiqi Bot2013-02-21 12:34:44
458152Ebuildsmaintainer-wantedUNCONFIRMEDdev-db/odb-2.2.0 - C++ Object-Relational Mapping (ORM) implemented as a gcc plugin2013-02-19 22:42:42
454724Ebuildsmaintainer-wantedUNCONFIRMEDnet-analyzer/tallow - Block hosts that attempt to bruteforce SSH using the journald API2013-01-30 19:39:56
454744Ebuildsmaintainer-wantedUNCONFIRMEDnet-dns/validns should depend on new package dev-perl/Test-Command-Simple for src_test()2013-01-31 16:22:52
452624Ebuildsmaintainer-wantedUNCONFIRMED[bumprequest] dev-ruby/fcgi - FastCGI library for Ruby2013-02-20 12:36:37
453348Ebuildsmaintainer-wantedUNCONFIRMEDdev-ada/zlib-ada-1.3 - a thick [Ada] binding to the popular compression/decompression library ZLib2013-02-18 20:21:56
448168Applicationsmaintainer-wantedUNCONFIRMEDdev-perl/pDLNA - a UPnP and DLNA service which serves multimedia content to compatible clients on th2012-12-24 15:40:36
448016Ebuildsmaintainer-wantedUNCONFIRMEDapp-misc/hardening-wrapper - New package. - Compiler wrapper to enable security hardening flags2012-12-26 21:51:22
446076Developmentmaintainer-wantedUNCONFIRMEDdev-lua/tir-0.9.3.3 - simple Lua+Mongrel2 web framework2012-12-05 14:16:08
446024Ebuildsmaintainer-wantedUNCONFIRMEDdev-python/python-sipsimple-0.31.1 - SDK for easy development of SIP multimedia end-points2012-12-16 23:53:59
445736Ebuildsmaintainer-wantedUNCONFIRMEDdev-libs/weston-1.0.2 - Wayland reference compositor2013-02-19 12:11:30
442342Ebuildsmaintainer-wantedUNCONFIRMEDdev-perl/Data-Diver - Simple, ad-hoc access to elements of deeply nested structures2012-12-27 11:11:38
437960Ebuildsmaintainer-wantedUNCONFIRMEDdev-libs/libdivecomputer-0.2.0 - Library for communication with dive computers from various manufact2012-10-11 13:48:40
442222Ebuildsmaintainer-wantedUNCONFIRMEDdev-libs/thrust - a parallel algorithms library which resembles the C++ Standard Template Library2012-11-07 17:53:54
439206Ebuildsmaintainer-wantedUNCONFIRMEDdev-php/composer - Dependency Manager for PHP2012-10-31 02:15:10
432688Ebuildsmaintainer-wantedUNCONFIRMEDapp-shells/zsh-completions-0.6.0 - Additional completion definitions for Zsh2012-10-22 11:21:26
431842Ebuildsmaintainer-wantedUNCONFIRMEDmedia-sound/lyvi - A simple command-line lyrics viewer for various audio players2012-08-18 16:10:35
431706Applicationsmaintainer-wantedUNCONFIRMEDdev-lang/jwasm - masm compatible crossplatform assembler2012-10-20 19:27:43
430642Ebuildsmaintainer-wantedUNCONFIRMEDssdeep-2.9 - computes context triggered piecewise hashes (fuzzy hashes)2012-08-09 23:59:51
427730Ebuildsmaintainer-wantedUNCONFIRMEDNew: dev-python/django-mptt-0.4.2 - Utilities for implementing a modified pre-order traversal tree i2012-12-12 11:46:23
427734Ebuildsmaintainer-wantedUNCONFIRMEDNew: dev-python/django-sekizai-0.4.2 - Django Template Blocks with extra functionality2012-12-12 11:51:41
427728Ebuildsmaintainer-wantedUNCONFIRMEDNew: dev-python/django-classy-tags-0.3.4.1 - Class based template tags for Django2012-12-12 11:41:28
426946Ebuildsmaintainer-wantedUNCONFIRMEDx11-wm/beshell - a simple desktop shell on KDE technology (namely KIO and Solid) for the rest of us2012-09-06 15:53:17
418285Ebuildsmaintainer-wantedUNCONFIRMEDmedia-libs/dcmtk - DCMTK - a collection of libraries and applications implementing large parts the D2012-05-30 18:44:00
418311Ebuildsmaintainer-wantedUNCONFIRMEDdev-lua/lualdap-1.1 - Simple interface from Lua to an LDAP client2012-05-31 02:15:05
415829Ebuildsmaintainer-wantedUNCONFIRMEDsci-chemistry/cclib-1.0.1 - Library for parsing and interpreting the results of computational chemis2012-05-15 15:01:01
417681Ebuildsmaintainer-wantedUNCONFIRMEDmedia-plugins/gimp-apng-0.1.0 - provides Animated PNG (APNG) image file load and save modules for th2012-07-06 20:09:12
417009Ebuildsmaintainer-wantedUNCONFIRMEDwww-misc/monitorix-2.5.2 version bump2012-05-22 06:37:42
416355Ebuildsmaintainer-wantedUNCONFIRMEDkde-misc/kimtoy - an input method frontend for kde, alternative to kimpanel2012-05-29 03:54:14
412921Ebuildsmaintainer-wantedUNCONFIRMEDapp-text/peg-multimarkdown - An implementation of MultiMarkdown in C, using a PEG grammar2012-04-24 14:13:30
413535Ebuildsmaintainer-wantedUNCONFIRMEDdev-lang/julia - a high-level, high-performance dynamic programming language for technical computing2012-12-19 07:31:31
415375Ebuildsmaintainer-wantedUNCONFIRMEDapp-office/makebeamerinfo - Creates .info file for use with app-office/impressive and dev-tex/latex-2012-05-10 14:51:46
412249Ebuildsmaintainer-wantedUNCONFIRMEDdev-cpp/mpfrc++ -- high-performance C++ interface for MPFR library2012-10-31 13:24:54
411895Ebuildsmaintainer-wantedUNCONFIRMEDapp-text/peg-markdown -- an implementation of John Gruber's markdown in C2012-06-30 09:24:16
409759Ebuildsmaintainer-wantedUNCONFIRMEDx11-themes/gtk-engines-clearlooks-compact-1.5 - Theme for Clearlooks GTK+ engine, optimized for smal2012-07-12 11:32:18
408225Ebuildsmaintainer-wantedUNCONFIRMEDdev-python/runsnakerun-2.0.2_alpha1: GUI to display python profile dumps from cProfile, python-profi2012-03-15 01:15:15
407669Applicationsmaintainer-wantedUNCONFIRMEDapp-misc/imgur-2.0 - A simple Imgur Bash screenshot utility2012-03-13 09:55:22
407349Ebuildsmaintainer-wantedUNCONFIRMEDapp-misc/mpdlcd - Display MPD status on a lcdproc server2012-03-08 21:41:55
407199Ebuildsmaintainer-wantedUNCONFIRMEDmedia-video/smtube: smplayer youtube helper2012-10-01 16:18:41
406935Ebuildsmaintainer-wantedUNCONFIRMEDmedia-libs/silly-0.1.0 - Silly image codec (Simple Image Loading LibrarY)2012-03-05 20:40:08
406937Ebuildsmaintainer-wantedUNCONFIRMEDdev-libs/rapidxml-1.13 - an attempt to create the fastest XML parser possible2012-03-05 20:41:21
404477Ebuildsmaintainer-wantedUNCONFIRMEDNew Ebuild: x11-misc/unagi-0.3 Unagi Compositing Manager2012-02-22 05:09:14
405945Ebuildsmaintainer-wantedUNCONFIRMEDNew ebuild: app-misc/pycarddav - a simple way of accessing a CardDAV resource, mainly for use with m2012-10-14 18:19:44
402101Applicationsmaintainer-wantedUNCONFIRMEDmedia-video/mplayer-vaapi live ebuild request2012-11-12 21:03:16
401921Ebuildsmaintainer-wantedUNCONFIRMEDsci-libs/o2scl - An object-oriented library for scientific computing in C++2012-02-04 17:07:01
399009Ebuildsmaintainer-wantedUNCONFIRMEDnet-im/myagent-im - Instant messenger that implements Mail.ru protocol2012-01-17 03:58:52
398733Ebuildsmaintainer-wantedUNCONFIRMEDnet-fs/unfs3-0.9.22 A portable user-space implementation of the NFSv3 server specification2012-01-15 19:29:12
398485Ebuildsmaintainer-wantedUNCONFIRMEDmedia-sound/eko-0.6.0.ebuild simple sound editor2012-01-11 17:11:12
396247Ebuildsmaintainer-wantedUNCONFIRMEDx11-misc/xcompmgr-dana - Dana Jansens's fork of the X Composisting Manager2011-12-28 18:12:36
389027Ebuildsmaintainer-wantedUNCONFIRMEDnet-misc/qpid-cpp - cross-platform Enterprise Messaging system which implements the Advanced Message2012-08-31 06:30:43
389029Ebuildsmaintainer-wantedUNCONFIRMEDsys-libs/libuser - implements a standardized interface for manipulating and administering user and g2011-11-01 15:42:13
389129Gamesmaintainer-wantedUNCONFIRMEDgames-action/voxatron - game set in a world completely made of tiny cubes that can be blasted to smi2012-06-03 22:42:56
389151Ebuildsmaintainer-wantedUNCONFIRMEDnet-misc/justwifiindicator-0.1 - Simple WiFi signal strength tray indicator2011-11-20 12:10:03
389489Ebuildsmaintainer-wantedUNCONFIRMEDmedia-video/smoviecat - Simple Movie Catalog2011-11-05 15:49:59
388533Ebuildsmaintainer-wantedUNCONFIRMEDmemcacheq-0.2.0.ebuild - Simple Queue Service over Memcache2011-10-26 14:10:13
381563Librarymaintainer-wantedUNCONFIRMEDSISL - "The SINTEF Spline Library", a comprehensive NURBS library for the modeling and interrogation2011-10-07 01:01:21
379121Ebuildsmaintainer-wantedUNCONFIRMEDx11-plugins/gkrellm-snmp: A GKrellM plugin to read SNMP agents2011-08-15 01:49:46
377859Ebuildsmaintainer-wantedUNCONFIRMEDapp-misc/libspnav - A free, compatible alternative for 3Dconnexion's 3D input SDK2011-09-22 19:29:47
377811Ebuildsmaintainer-wantedUNCONFIRMEDGaalet - Geometric Algebra Library C++ (Expression Template)2011-08-13 16:40:09
375673Ebuildsmaintainer-wantedUNCONFIRMED[ebuild] dev-db/mydumper-{0.2.3,0.5.1} (New Package)2011-11-02 16:48:35
374377Ebuildsmaintainer-wantedUNCONFIRMED[ebuild request] www-clients/qtweb ebuild - lightweight, html5 compliant qt-based web-browser2011-07-10 17:26:58
373217Applicationsmaintainer-wantedUNCONFIRMEDmedia-sound/audacious-mplayer plugin: new package2012-02-03 02:38:51
370315Ebuildsmaintainer-wantedUNCONFIRMEDdev-tcltk/tcl-snmptools-1.0.ebuild (new ebuild)2011-09-03 04:27:14
367429Ebuildsmaintainer-wantedUNCONFIRMEDmedia-sound/jackctlmmc-4 - JackCtlMMC is a slightly simpler command-line version of QJackMMC2011-05-17 11:44:37
365933Ebuildsmaintainer-wantedUNCONFIRMEDNew Ebuild, plug-0.7: Linux software for Fender Mustang amplifiers2011-05-07 04:30:11
457830Applicationsmaintainer-neededUNCONFIRMEDmedia-gfx/freecad-0.13 - Version bump.2013-02-17 09:29:20
456256Librarymaintainer-neededUNCONFIRMEDdev-libs/libical fails when cross compiling2013-02-12 02:26:18
457184Applicationsmaintainer-neededUNCONFIRMEDsys-fs/archfs - 1.0.0 version bump and rename to sys-fs/rdiff-backup-fs2013-02-14 04:32:11
447812Keywording and Stabilizationmaintainer-neededUNCONFIRMEDapp-doc/gimp-help-2.6.1 stable request2013-02-16 13:26:25
444135Applicationsmaintainer-neededUNCONFIRMEDapp-misc/gpsdrive-2.11-r3 with boost-1.52.0-r3: /var/tmp/portage/app-misc/gpsdrive-2.11-r3/work/gpsd2013-01-11 19:10:30
446968Applicationsmaintainer-neededUNCONFIRMEDnet-misc/netkit-telnetd-0.17-r10 - Use native gcc instead of CC (cross compile issue)2013-02-16 13:35:19
438466Ebuildsmaintainer-neededUNCONFIRMEDsci-libs/opencascade-6.5.4 version bump2013-01-15 05:59:37
438622Ebuildsmaintainer-neededUNCONFIRMEDnet-wireless/broadcom-sta-6.20.55.19 version bump2013-02-07 12:05:08
432296Developmentmaintainer-neededUNCONFIRMEDdev-libs/apr-1.4.5 fails to crosscompile: configure: error: cannot run test program while cross comp2013-01-03 18:43:02
427426Applicationsmaintainer-neededUNCONFIRMEDapp-misc/run-mailcap - run-mailcap unlinks tmplink before an app has a chance to read a file2012-07-30 18:15:09
427030Applicationsmaintainer-neededUNCONFIRMEDnet-misc/sks version bump (and it should install an init.d script along with a uid/gid)2013-01-05 21:37:02
408335Ebuildsmaintainer-neededUNCONFIRMEDapp-misc/ckermit-9.0.302 version bump2012-03-17 12:07:46
409239Ebuildsmaintainer-neededUNCONFIRMEDapp-arch/ppmd-10.1_p4 version bump2012-04-24 09:03:00
381031Applicationsmaintainer-neededUNCONFIRMED[version bump] app-arch/rpm5-5.4.12012-07-26 08:04:22
385775Applicationsmaintainer-neededUNCONFIRMEDdev-libs/apr-util-1.3.11 cross compilation fix (libtool related)2013-01-01 20:20:51
378711Applicationsmaintainer-neededUNCONFIRMEDdev-libs/dietlibc-0.33_pre20110403 - allow to install in proper place when cross-compiling2013-01-03 20:15:43
370761Ebuildsmaintainer-neededUNCONFIRMEDwww-apache/mod_auth_imap2 patch to fix compilation2013-01-04 14:14:29
375089Ebuildsmaintainer-neededUNCONFIRMED=x11-wm/stumpwm-9999 bump request (ebuild included)2011-07-28 23:45:14
385401ApplicationslxnayUNCONFIRMEDapp-admin/packagekit-base-0.6.18 compile error on using python3 as default2012-05-12 22:10:25
405127UnspecifiedlxnayUNCONFIRMEDnet-nds/389-ds-base-1.2.10.0 version bump2012-10-02 20:26:41
415607ApplicationslxnayUNCONFIRMEDx11-apps/ardesia-1.0 version bump request2012-05-12 19:55:08
456696ApplicationslxnayUNCONFIRMED[sabayon overlay] app-text/gimagereader-0.9: complains: Could not load sane or twain, scanning will 2013-02-13 13:59:47
452874Applicationslu_zeroUNCONFIRMEDmedia-video/mplayer-1.1 - mplayer-1.1-libav-9.patch introducing enum AVPixelFormat, should be called2013-02-18 15:15:08
444394Core systemlu_zeroUNCONFIRMEDsys-apps/dtc-1.3.0-r1 - /usr/bin/install: cannot stat 'fdtdump': No such file or directory2012-12-21 15:58:17
433127Applicationslu_zeroUNCONFIRMEDmedia-video/lives-1.6.3 version bump2012-11-14 19:05:41
435086Core systemlu_zeroUNCONFIRMEDsys-apps/spu-tools-2.3.0.136 - version bump2012-09-16 14:40:23
435088Core systemlu_zeroUNCONFIRMEDsys-libs/libspe2-2.3.0.138 - version bump / snapshot2012-09-16 14:41:39
370429UnspecifiedlivecdUNCONFIRMEDsplash-themes-livecd-2011 bump!!!2012-02-11 09:25:00
442418ApplicationslehoUNCONFIRMEDmedia-tv/tvheadend-3.2.18 version bump2013-02-15 12:16:40
450528Serverldap-bugsUNCONFIRMEDnet-nds/openldap-2.4.30: configure: error: crossing compiling: use --with-yielding_select=yes|no|man2013-01-07 11:32:59
438702Core systemldap-bugsUNCONFIRMEDsys-auth/nss_ldap-265 encodes wrong libc version in library name if compiling for $ROOT2012-10-17 13:23:33
376519Ebuildslang-miscUNCONFIRMEDdev-lang/dmd-2.054 version bump2011-09-19 08:24:26
439342ApplicationslackUNCONFIRMEDx11-plugins/gkrellweather-2.0.8 does not properly display temperature2012-10-23 10:08:19
416161EbuildslackUNCONFIRMEDx11-misc/nts-82 version bump request2012-05-16 03:08:43
415931ApplicationslackUNCONFIRMEDapp-admin/gkrellm patch for ATI radeon temperature support2012-05-15 16:33:50
399619EbuildslackUNCONFIRMEDx11-plugins/gkrellstock-0.5.1 version bump2012-01-22 15:05:17
417701Ebuildsl33tmmxUNCONFIRMEDmedia-sound/a2jmidid-7 version bump2012-12-18 11:47:01
442822Ebuildskernel-miscUNCONFIRMEDdev-libs/klibc-2.0.2 version bump2012-11-12 12:23:59
438784Eclasses and Profileskernel-miscUNCONFIRMEDlinux-mod.eclass - kernel modules packages are incompatible with using multiple kernels2012-10-18 14:18:50
417313Unspecifiedkernel-miscUNCONFIRMEDsys-fs/avfs-1.0.0 ecompressdir stumbles over an symlink2012-05-24 14:13:30
390293Unspecifiedkernel-miscUNCONFIRMED[enhancement] sys-fs/sshfs-fuse: Improve remote permissions when files and directories are created2011-11-15 00:36:35
458426EbuildskernelUNCONFIRMED=sys-kernel/gentoo-sources-3.8.0 fails to compile: invalid operands to binary == (have ‘kuid_t’ and 2013-02-20 11:26:46
457742EbuildskdeUNCONFIRMEDmedia-libs/phonon-vlc-0.6.2 version bump request2013-02-15 19:14:23
457920KDEkdeUNCONFIRMEDkde-base/kate-4.10.0-r1 improved ebuild2013-02-18 04:25:35
445222Core systemkernelUNCONFIRMEDsys-kernel/vanilla-sources uli526x module incompatible with GART_IOMMU2012-12-11 12:37:18
455356Core systemkernelUNCONFIRMEDsys-kernel/gentoo-sources-3.6.11 panic in smp.c2013-02-03 22:52:48
455880Core systemkernelUNCONFIRMEDCONFIG_DEVTMPFS default value in kernel configuration (gentoo-sources and potentially others)2013-02-17 19:40:19
442984KDEkdeUNCONFIRMEDapp-office/calligra-l10n-2.5.3 does not compile.2012-11-15 14:52:36
449630KDEkdeUNCONFIRMEDkde-base/kdelibs-4.9.4-r1: several *.desktop files are not compliant with XDG standard (missing trai2013-01-01 13:31:13
455218KDEkdeUNCONFIRMEDx11-themes/oxygen-gtk-1.3.2.1:2 x11-themes/oxygen-gtk-1.1.2:3 version bump request2013-02-15 12:45:02
458384Core systemkernelUNCONFIRMEDsys-kernel/gentoo-sources 3.5.7.6 version bump?2013-02-20 02:12:47
456230KDEkdeUNCONFIRMEDapp-cdr/k3b-2.0.2-r4: complains about "process can't started. Calling of In/Output module not possib2013-02-10 15:13:30
455338KDEkdeUNCONFIRMEDmedia-libs/phonon-gstreamer-4.6.3 version bump2013-02-05 11:25:08
406047KDEkdeUNCONFIRMEDKDE 4.8.1 compose key doesn't work with Kwrite & Konsole2012-03-23 08:13:36
456100ApplicationsjwzUNCONFIRMEDx11-misc/xscreensaver-5.21 version bump2013-02-07 22:36:30
450942ServerjsbronderUNCONFIRMEDsys-cluster/mpe2-1.0.6_p1 installs mpecc.in and mpefc.in to /usr/bin/2013-01-08 20:09:17
451056DevelopmentjsbronderUNCONFIRMEDsys-cluster/mpich2-1.2.1_p1-r1 fails to crosscompile: configure: error: Unable to determine Fortran 2013-01-09 15:17:48
456984ServerjsbronderUNCONFIRMEDsys-cluster/mpich2-1.5 should not DEPEND on sys-apps/hwloc2013-02-14 15:14:18
373923LibraryjsbronderUNCONFIRMEDsys-cluster/openmpi-1.5.3-r1: mpirun hangs or fails with Segmentation faults2012-02-06 19:20:57
407155UnspecifiedjsbronderUNCONFIRMEDsys-cluster/openmpi - Rmpi fails to install under dev-lang/R-2.14.2 due to undefined symbol: mca_bas2012-05-11 12:13:24
414623Core systemjsbronderUNCONFIRMEDsys-cluster/torque-4.0.1 version bump2012-05-04 21:38:17
375117Libraryjmfo1982UNCONFIRMEDIf i686-pc-linux-gnu-windres is present, configure process detects it and attempts to cross-compile2011-12-12 16:27:25
409867EbuildsjmbsvicettoUNCONFIRMEDnet-misc/vde-2.3.2 version bump including Python support2012-06-08 13:16:39
457810Core systemjlecUNCONFIRMEDsys-fs/aufs3-3_p20130207 with USE="inotify" and sys-kernel/hardened-sources-3.7.5 doesn't compile - 2013-02-17 09:10:21
448348Core systemjlecUNCONFIRMEDsys-fs/aufs-util-3.6 fails to crosscompile: ./ver: ./ver: cannot execute binary file2012-12-25 16:14:13
434610ApplicationsjlecUNCONFIRMEDgnome-extra/zeitgeist-datahub-0.9.5 version bump2012-09-11 14:22:09
455086ApplicationsjerUNCONFIRMEDnet-misc/chrony-1.27 - Version bump2013-02-02 08:13:18
456718LibraryjdhoreUNCONFIRMEDmedia-plugins/audacious-plugins-3.3.4 is incompatible with media-video/libav, fails during configure2013-02-11 17:14:50
375939ApplicationsjerUNCONFIRMEDwww-client/opera: flash complains about GTK+ 2 vs 3 symbol conflict2013-01-20 12:27:08
458264JavajavaUNCONFIRMEDdev-java/sablecc-3.7 version bump2013-02-19 15:22:14
456932JavajavaUNCONFIRMEDERROR: dev-java/netbeans-javafx-7.2 failed (compile phase)2013-02-13 20:19:37
453804JavajavaUNCONFIRMEDCreate ebuilds for jdk 8 (early access release), a current Java 8 partial implementation2013-01-24 12:02:05
450298JavajavaUNCONFIRMEDdev-lang/scala-2.10.0 version bump2013-02-14 01:32:57
442804JavajavaUNCONFIRMEDdev-java/jgoodies-forms-{1.5.1,1.6.0} version bump2013-01-20 18:41:59
435808JavajavaUNCONFIRMEDdev-java/opensaml-2.5.3 version bump request2012-09-22 06:45:45
440994JavajavaUNCONFIRMEDdev-java/xmlgraphics-commons-1.5 version bump2012-11-03 20:31:14
434222JavajavaUNCONFIRMEDdev-java/ant-ivy-2.0.0 compilation failed2012-09-07 15:04:44
435764JavajavaUNCONFIRMEDdev-java/wss4j-1.6.7 version bump request2012-09-21 18:44:27
435256JavajavaUNCONFIRMEDdev-java/xml-security-1.5.2 (aka apache santuario) version bump2012-09-16 20:18:33
430054JavajavaUNCONFIRMEDdev-java/pdfbox-1.7 version bump2013-01-17 07:48:53
430062JavajavaUNCONFIRMEDdev-java/glazedlists-1.8 version bump2012-08-05 19:29:55
430184JavajavaUNCONFIRMEDdev-java/jansi and dev-java/jansi-native: Version bump (+ new dependency)2012-08-06 14:27:16
428340JavajavaUNCONFIRMEDVersion Bump: dev-java/jsr250-1.12012-07-27 16:31:44
427932JavajavaUNCONFIRMED[java-overlay] dev-java/j3d-core-1.5.1: compile phase fails with image resolution errors2012-07-24 19:35:50
421077JavajavaUNCONFIRMEDdev-java/icedtea-7.2.2 compilation fails with Unrecognised option: -XX:-PrintVMOptions2012-10-18 16:15:26
426380JavajavaUNCONFIRMEDdev-java/cglib-{2.2.2,3.0} version bump request2012-08-18 14:17:39
426382JavajavaUNCONFIRMEDdev-java/nekohtml-1.9.16 version bump2012-08-07 21:02:08
426294JavajavaUNCONFIRMEDnet-nds/jxplorer-3.3 - version bump request2013-01-28 15:25:13
421677JavajavaUNCONFIRMEDdev-java/ant-commons-net-1.8.4 - *** Semantic Error: The abstract method "int compareTo(java.lang.Ob2012-06-19 02:39:45
421503JavajavaUNCONFIRMEDdev-java/groovy-{1.8.8,2.0.6,2.1.0} version bump request2013-01-29 00:25:12
417895JavajavaUNCONFIRMEDdev-java/stringtemplate-4.0.6 released2012-12-07 19:10:27
405865JavajavaUNCONFIRMEDjavatoolkit improvement for xpath-like xml handling2012-02-26 15:48:58
405715JavajavaUNCONFIRMEDjava eclass improved documentation2012-02-25 09:32:02
385467DevelopmentjavaUNCONFIRMEDdev-util/eclipse-sdk-4.2 version bump2013-02-04 12:41:26
380493JavajavaUNCONFIRMEDdev-java/saxon-9.1.0.8 version bump2012-02-16 10:02:58
381693ServerjavaUNCONFIRMEDtomcat-6 init fails when CATALINA_TMPDIR does not exist2011-10-24 21:05:19
371947CVS/SVN/Gitinfra-bugsUNCONFIRMEDDo not allow commits of packages with no ebuilds (eg. empty directories.)2011-09-25 06:48:23
423681Ebuildsin-gentooUNCONFIRMEDmail-client/nmh 1.5 version bump2012-06-27 02:39:38
447628Applicationsidl0rUNCONFIRMEDmedia-plugins/vdr-imonlcd-1.0.0 version bump2012-12-17 18:54:12
417129Applicationsidl0rUNCONFIRMEDnet-dns/bind-tools-9.8.1[ssl] hardcodes OpenSSL path checks which breaks cross-compiling/etc...2013-02-08 06:12:18
377599Applicationsidl0rUNCONFIRMEDVersion bump: media-plugins/vdr-xineliboutput-1.0.72012-11-13 16:04:32
454354Applicationsidella4UNCONFIRMEDapp-emulation/xen-tools-4.2.1 - Fails to compile with KeyError: '.text.asm.out/../src/smp.c.68'2013-02-01 21:20:22
453566ApplicationshwoarangUNCONFIRMEDmedia-sound/lastfmplayer 2.1.30 version bump2013-02-11 11:46:14
443898ServerhwoarangUNCONFIRMED>=net-ftp/vsftpd-3.0.0: 500 OOPS: priv_sock_get_cmd with seccomp_sandbox=YES (default)2012-11-19 10:55:09
443728EbuildshwoarangUNCONFIRMEDapp-laptop/prey-0.5.4-r1: /etc/init.d/prey-trigger is installed as invalid symlink, first run attemp2013-01-15 19:43:12
406757ApplicationshwoarangUNCONFIRMEDmedia-video/rtmpdump crashes with gnutls[nettle]2012-03-24 09:19:49
403841EbuildshwoarangUNCONFIRMEDdev-embedded/openocd-9999 - refactor and improve device support2012-11-05 12:32:05
427194ApplicationshollowUNCONFIRMEDwww-servers/nginx: add rtmp module support2012-11-26 08:04:35
447614Ebuildshd_brummyUNCONFIRMEDapp-misc/iguanaIR-1.0.3 version bump2012-12-17 18:53:44
455498ApplicationshaubiUNCONFIRMEDdev-db/tora-2.1.4 version bump2013-02-21 10:45:19
454476ApplicationshasufellUNCONFIRMEDnet-misc/badvpn-1.999.127 version bump2013-01-29 13:32:19
444544EbuildshaskellUNCONFIRMED[haskell overlay] dev-haskell/accelerate-cuda passes CFLAGS into non-gcc compiler2012-11-24 17:29:02
433998DevelopmenthaskellUNCONFIRMEDincompatibility between =dev-lang/ghc-7.4.1-r1 and =x11-wm/xmonad-0.102012-12-16 13:42:38
421623DevelopmenthaskellUNCONFIRMEDdev-lang/ghc-7.4.1-r1: unable to compile with portage because it results in a segmentation fault.2012-06-19 16:29:37
401669Core systemhardened-kernelUNCONFIRMEDsys-kernel/hardened-sources-2.6.32-r89: Compilation broken on ia642012-02-27 01:07:20
447702Core systemhardened-kernelUNCONFIRMEDsys-kernel/hardened-sources-3.7.0 fails to crosscompile for Ski-Simulator: include/linux/gfp.h:295:22012-12-19 09:10:48
457662HardenedhardenedUNCONFIRMEDFusion MPT base driver 3.04.20 on SAS1064ET very slow boot2013-02-15 06:40:34
446850HardenedhardenedUNCONFIRMEDthunderbird-17.0-r2 fails to install with CONFIG_PAX_MPROTECT enabled2012-12-14 17:52:48
437732HardenedhardenedUNCONFIRMEDmedia-video/ffmpeg-0.10.3 can't install ffmpeg due to grsec restrictions2012-10-09 14:52:20
401667EbuildshardenedUNCONFIRMEDnet-libs/libproxy-0.4.7 - Segmentation fault /usr/bin/gmcs /nologo /target:library /out:/var/tmp/por2012-02-03 21:57:47
391839HardenedhardenedUNCONFIRMEDcompiling external module which is using file_operations fails2011-11-25 08:09:59
438316ApplicationshannoUNCONFIRMEDsci-geosciences/viking-1.3.2.1 version bump2012-10-15 04:31:21
436102EbuildshannoUNCONFIRMEDnet-analyzer/greenbone-security-desktop-1.2.2: version bump2012-09-24 22:50:20
416587LibraryhannoUNCONFIRMEDmedia-libs/gegl-0.2.0: fails to compile with USE="introspection"2012-11-17 12:46:15
411275EbuildshannoUNCONFIRMEDnet-im/python-otr-1.0.0_beta6 version bump2012-10-27 11:06:09
414697EbuildshannoUNCONFIRMEDnet-analyzer/greenbone-security-assistant-3.0.3 version bump2012-10-10 19:39:05
406333ApplicationshannoUNCONFIRMEDmedia-gfx/gimp-2.6.12 - Black and yellow striped rectangle on zoom2012-04-02 22:14:48
402379EbuildshannoUNCONFIRMEDnet-analyzer/openvas-* version bumps2013-02-17 13:47:30
399687ApplicationshannoUNCONFIRMEDSVGs exported by app-office/libreoffice cause segmentation fault in media-gfx/gimp-2.6.11-r52012-01-23 09:36:24
392365ApplicationshannoUNCONFIRMEDmail-mta/courier init script complains about ebegin/eend2011-12-04 03:27:36
392261UnspecifiedhannoUNCONFIRMEDapp-emulation/dosemu -fno-pic causes build failure when using hardened compiler with PIE2012-12-23 17:38:30
373847ApplicationshannoUNCONFIRMEDmedia-gfx/gimp-2.6.11-r1: crash on startup with error GLib-WARNING ignoring no-arg, optional-arg or 2011-10-22 18:15:20
448576LibrarygurligebisUNCONFIRMEDdev-php/ZendFramework-2.0.6 version bump2012-12-26 11:47:26
421829ApplicationsgstreamerUNCONFIRMEDmedia-plugins/gst-plugins-ffmpeg-0.10.13-r1 with ABI=x32 - libswscale/x86/swscale_template.c:998: Er2012-09-11 06:15:09
422707EbuildsgstreamerUNCONFIRMEDmedia-plugins/gst-plugins-ffmpeg-0.10.13-r2 blocking, conflicts ffmpeg and libav2012-09-03 18:03:01
427768ApplicationsgstreamerUNCONFIRMEDmedia-plugins/gst-plugins-ffmpeg-0.10.13-r2 - gstffmpegutils.c:42:40: error: parameter 1 ('smp_fmt')2012-07-24 15:31:30
402763EbuildsgstreamerUNCONFIRMEDmedia-plugins/gst-plugins-ffmpeg-0.10.13-r1 - libavcodec/arm/dsputil_vfp.S:45: Error: selected proce2012-02-09 01:08:01
396583ApplicationsgstreamerUNCONFIRMEDmedia-plugins/gst-plugins-ffmpeg-0.10.13-r1 - libavcodec/x86/h264_deblock_10bit.asm:421: error: inva2012-02-29 20:47:12
391381ApplicationsgstreamerUNCONFIRMEDmedia-video/flumotion-0.10.0 version bump2012-10-01 15:17:35
374043ApplicationsgstreamerUNCONFIRMEDmedia-plugins/gst-plugins-ffmpeg-0.10.11-r1 does not compile on x86 with mstackrealign CFLAG and gcc2011-07-10 10:04:50
383995ApplicationsgstreamerUNCONFIRMEDmedia-plugins/gst-plugins-ffmpeg-0.10.12 fails test2012-09-06 23:05:53
365043GNOMEgstreamerUNCONFIRMEDmedia-plugins/gst-plugins-v4l2-0.10.28-r1: v4l2src is not working with ffmpegcolorspace (gst-plugins2011-07-07 12:30:25
384311ApplicationsgregkhUNCONFIRMEDnet-misc/bti add patch to allow compilation on non-GNU systems2012-09-23 09:36:41
456990LibrarygraphicsUNCONFIRMEDmedia-libs/lensfun-0.2.7 version bump2013-02-12 21:58:13
457080EbuildsgraphicsUNCONFIRMEDmedia-gfx/cellwriter-1.3.5 - version bump request and please move it to app-accessibility/2013-02-13 18:34:41
456780LibrarygraphicsUNCONFIRMEDmedia-libs/icclib-2.14: iccdump segfaults on startup2013-02-12 15:13:03
448900LibrarygraphicsUNCONFIRMEDmedia-libs/gexiv2-0.5.0 version bump request2012-12-28 14:52:07
431986ApplicationsgraphicsUNCONFIRMEDmedia-gfx/luminance-hdr-2.3.0 - crash when loading any hdr file if compiled with -march=core22012-08-20 12:08:47
417711ApplicationsgraphicsUNCONFIRMEDmedia-gfx/graphviz-2.26.3-r4 + distcc - iffe: x86_64-pc-linux-gnu-gcc : not a C compiler: should not2012-06-05 19:48:49
416835ApplicationsgraphicsUNCONFIRMEDmedia-gfx/nip2 should support USE="compat examples"2013-02-16 14:13:54
312935EbuildsgraphicsUNCONFIRMEDmedia-gfx/ufraw: Optionalize more dependencies and improve metadata.xml2011-10-09 07:35:16
373387ApplicationsgraphicsUNCONFIRMEDmedia-gfx/hugin-2011.0.0 fail to compile; ld cannot find -lwx_gtk2_gl-2.82012-03-26 20:18:36
373479ApplicationsgraphicsUNCONFIRMEDmedia-libs/lensfun - Lensfun plugin for GIMP2013-01-10 07:42:30
386019ApplicationsgraphicsUNCONFIRMEDmedia-gfx/openclipart-2.3 version bump2012-06-19 16:44:15
387373ApplicationsgraphicsUNCONFIRMEDmedia-gfx/imagemagick-6.7.1.0 segmentation fault if not enough space in /tmp2011-10-21 07:30:54
385897ApplicationsgraphicsUNCONFIRMEDmedia-gfx/enblend-4.0 fails compilation with use="+image-cache"2011-10-07 00:52:55
383239EbuildsgraphicsUNCONFIRMEDmedia-gfx/wings-1.4.1 version bump2011-09-16 21:42:53
403085ApplicationsgpeUNCONFIRMEDVersion bump for x11-misc/xoo-0.82012-05-12 23:10:02
408153ApplicationsgnustepUNCONFIRMED[gnustep overlay] gnustep-apps/sogo-1.3.14 and 2.0.0rc1 version bumps2012-11-22 15:43:06
393335Javagnu_andrewUNCONFIRMEDdev-java/icedtea-7.2.0-r3 - segmentation fault in /var/tmp/portage/dev-java/icedtea-7.2.0-r3/work/ic2011-12-25 05:58:41
454474GNOMEgnomeUNCONFIRMEDnet-im/empathy-3.6.3: history uses wrong encoding to show utf8 logs2013-01-28 22:49:52
450930GNOMEgnomeUNCONFIRMEDglib-2.34.x causes nautilus-2.32 to consume 1 whole core when attempting to display thumbnails2013-02-20 16:36:03
450260GNOMEgnomeUNCONFIRMEDnet-im/empathy-3.6.2-r2 fails to compile2013-01-04 21:31:54
449274GNOMEgnomeUNCONFIRMEDnet-im/empathy-3.6.2-r2 main menu doesn't function properly2012-12-30 13:23:21
448896EbuildsgnomeUNCONFIRMEDdev-python/pygobject-3.4.2-r1 (and others): py-compile coming from 2012-12-28 19:03:04
445864GNOMEgnomeUNCONFIRMED[gnome-overlay] gnome-extra/gnome-clock: 0.1.5 version bump2012-12-03 20:58:07
445840GNOMEgnomeUNCONFIRMED[gnome-overlay] gnome-base/nautilus: 3.7.2 version bump2012-12-03 19:18:41
439964GNOMEgnomeUNCONFIRMED[gnome-overlay] app-text/evince: 3.7.1 version bump2012-10-28 16:08:13
438560EbuildsgnomeUNCONFIRMEDmedia-sound/rhythmbox-2.98 version bump2013-01-12 11:04:35
434510GNOMEgnomeUNCONFIRMEDgnome-base/gnome-shell-3.2.2.1: autocomplete in the run dialog does not work for non-members of grou2012-09-16 11:37:30
422695GNOMEgnomeUNCONFIRMEDmail-client/evolution-3.2.3-r1 fails to compile with USE flag clutter2012-06-20 19:07:36
366147Ebuildsgentoo-perlUNCONFIRMEDdev-perl/Fuse version bump request2011-05-06 21:14:01
448624genkernelgenkernelUNCONFIRMEDlast step of compile_kernel() does not respect ${KERNEL_OUTPUTDIR} in genkernel-3.4.452012-12-26 01:26:22
401149genkernelgenkernelUNCONFIRMEDcomputer hangs before shutdown with genkernel config when trying suspend to ram2012-01-28 10:25:48
447842GamesgamesUNCONFIRMEDgames-roguelike/adom-1.2.0_pre3 version bump - Ebuild included2012-12-19 21:19:26
434148GamesgamesUNCONFIRMEDgames-sports/vdrift version bump 2012-07-222012-12-20 19:10:16
424321GamesgamesUNCONFIRMEDgames-emulation/hatari-1.6.2 version bump2012-10-06 07:31:47
419055GamesgamesUNCONFIRMEDgames-emulation:mednafen-0.9.21 does not compile2012-06-01 20:48:36
411715GamesgamesUNCONFIRMEDgames-fps/etxreal-0.30 - a heavily improved Quake 3 Arena engine2012-04-30 19:06:16
395389GamesgamesUNCONFIRMEDgames-puzzle/cuyo-2.1.2: version bump2011-12-20 18:55:36
387061GamesgamesUNCONFIRMEDVersion bump games-roguelike/tome-4.0.0b32 and correct HOMEPAGE in ebuild2013-01-07 17:31:33
383319GamesgamesUNCONFIRMEDgames-fps/ezquake-bin: version bump (-> 2.1)2011-09-17 09:39:58
375237GamesgamesUNCONFIRMEDgames-strategy/netpanzer-0.8.4: version bump request2012-01-24 03:19:29
375183GamesgamesUNCONFIRMEDgames-strategy/freecnc-20041219: version bump request2011-07-14 15:27:59
372413GamesgamesUNCONFIRMEDImproved ebuild for games-action/transcend, also fixing sound on amd642012-12-14 06:03:39
367263GamesgamesUNCONFIRMEDgames-mud/kildclient-2.11.0 version bump2011-05-14 17:35:04
409583GNOMEfreedesktop-bugsUNCONFIRMEDapp-misc/tracker-9999 fails to compile with sys-devel/gettext-0.182012-04-02 12:35:18
436158LibraryfontsUNCONFIRMEDmedia-fonts/lohit-fonts-20120607 version bump2012-09-25 05:17:02
429922ApplicationsfontsUNCONFIRMEDmedia-gfx/fontforge-20120731 version bump2012-09-22 19:07:17
431430LibraryfontsUNCONFIRMEDmedia-fonts/libertine-ttf-5.3.0.20120702 version bump2013-01-01 22:02:26
406891ApplicationsfontsUNCONFIRMEDmedia-libs/freetype-1.4_pre20080316-r2 compile failure: make[2]: execvp: ../libtool: Permission deni2012-03-05 20:19:14
420901EbuildsfontsUNCONFIRMEDmedia-fonts/vlgothic-20120610 version bump2012-12-27 08:49:43
423001EbuildsfontsUNCONFIRMEDmedia-fonts/ricty-3.2.0 version bump2012-06-23 14:13:21
454802DevelopmentflameeyesUNCONFIRMEDdev-utils/google-perftools-2.0-r1 ARMv6 does not imply 'dmb' instruction availability but it is used2013-02-02 00:14:37
423817DevelopmentflameeyesUNCONFIRMEDdev-util/dwarves-1.9: ostra-cg cannot find python module ostra: ImportError: No module named ostra2012-06-27 18:54:10
449720Core systemferringbUNCONFIRMEDsys-apps/pkgcore-0.8.6: SyntaxError during compilation of Python modules for Python 3.22013-01-02 10:12:25
399839EbuildsfauliUNCONFIRMEDapp-admin/tmpwatch reports "Cannot stat file" with --fuser on sufficiently loaded system2012-02-17 15:33:53
372707EbuildsenlightenmentUNCONFIRMED[enlightenment-overlay] x11-plugins/e_modules-comp-scale: new ebuild2012-12-22 20:35:46
412909EbuildsembeddedUNCONFIRMEDx11/libxcb: xcb-proto should be RDEPEND instead of DEPEND or cross compiling fail2012-05-10 03:29:04
381073EbuildselvanorUNCONFIRMEDversion bump net-print/xerox-drivers2012-10-09 13:57:57
406425EbuildselvanorUNCONFIRMEDmedia-gfx/iscan-plugin-gt-f720-0.1.1 version bump2012-08-22 11:59:30
406503EbuildselvanorUNCONFIRMEDapp-office/openerp-server-6.0.3 version bump2012-03-02 17:28:05
458350LibraryemacsUNCONFIRMEDapp-emacs/sml-mode-6.3 version bump2013-02-19 20:27:12
370063DevelopmentembeddedUNCONFIRMEDsys-devel/crossdev: settings masked via arch profiles are not considered with cross-compilers2012-03-08 21:08:25
407099Project-specific documentationembeddedUNCONFIRMEDIncorrect mount options and binfmt_misc mask for "Compiling with qemu-user chroot" secion2012-03-06 17:22:43
439618DevelopmentdotnetUNCONFIRMEDdev-lang/mono-3 version bump2013-02-16 23:15:04
380647UnspecifieddolsenUNCONFIRMEDapp-portage/layman-2.0.0: More complete support for CVS2012-02-28 05:33:36
425312Other documentsdocs-teamUNCONFIRMEDnvidia guide xorg.conf can be simplified2012-07-13 20:07:44
392743Other documentsdocs-teamUNCONFIRMEDImplicit assumptions -> confusion when trying to use printer on a Win7 machine2011-12-29 01:31:50
451996ApplicationsdjcUNCONFIRMEDdev-vcs/hgsubversion-1.4: compilation failure with Python 2.52013-01-15 12:37:58
442162ApplicationsdjcUNCONFIRMEDnet-misc/openvpn-2.1.4 - src_install: rmdir: failed to remove ‘/var/tmp/portage/net-misc/openvpn-2.12012-11-07 14:09:59
442420ApplicationsdilfridgeUNCONFIRMEDmedia-libs/opencv-2.4.3 with USE=cuda : /opt/cuda/bin/nvcc compiles in /tmp which results in "No spa2013-02-04 21:24:25
454900Developmentdev-zeroUNCONFIRMEDdev-php/libvirt-php-0.4.7 version bump and patches2013-02-04 09:50:47
456094Ebuildsdev-zeroUNCONFIRMEDnet-misc/aria2-1.16.3 - version bump request2013-02-07 20:55:51
444306Librarydev-zeroUNCONFIRMEDx11-drivers/xf86-input-vmmouse-12.9.0 with x11-base/xorg-server-1.13.0-r1 - Warning: attempting to l2013-01-01 21:31:12
448626Developmentdev-toolsUNCONFIRMEDdev-util/findbugs-2.0.2 version bump2012-12-26 03:10:32
438816Coredev-portageUNCONFIRMEDsys-apps/portage-2.1.11.9 : /var/tmp/portage/._unmerge_/ directory not cleaned up2012-10-18 17:51:53
447638Coredev-portageUNCONFIRMEDBuilding packages as normal user with fakeroot sometimes fails due to tar complaining about "Too man2012-12-18 19:12:05
437112Unclassifieddev-portageUNCONFIRMEDno TIMESTAMP field when using ftps/https binhost2012-10-08 21:24:38
431978Coredev-portageUNCONFIRMEDsys-apps/portage: FEATURES=preserve-libs missed dependency (libmpc.so.2) in /usr/libexec/gcc/x86_64-2012-12-25 20:59:53
425554Core systemdev-portageUNCONFIRMEDsys-apps/portage-2.2.0_alpha116: Ctrl+C during --jobs simply halts progress w/o quitting2012-12-25 21:05:58
427748Core systemdev-portageUNCONFIRMEDsys-apps/portage-2.2.0_alpha120 crashing when compile fails2012-07-23 18:57:51
417597Repomandev-portageUNCONFIRMEDsys-apps/portage: repoman: Improve description of {P,R}DEPEND.suspect (rename .suspect to .blacklist2012-05-26 11:26:14
406811Coredev-portageUNCONFIRMEDFeature request: enhance portage with "buildsrcpkg" that captures all source files for GPL complianc2012-03-04 07:20:32
399577Core - Dependenciesdev-portageUNCONFIRMEDportage/emerge fails to compute dependencies and fails to report what triggered the problem2012-01-22 15:26:36
365655Unclassifieddev-portageUNCONFIRMEDsys-apps/portage implicit pointer check is broken with gcc-4.52011-05-06 02:51:27
365029Enhancement/Feature Requestsdev-portageUNCONFIRMEDemerge-webrsync incorrect/incomplete proxy error codes handling2011-05-10 11:19:57
426360Ebuildsdev-embeddedUNCONFIRMEDdev-embedded/sgpp-lite-arm-eabi-bin-2012.03.56 version bump2012-07-16 17:54:18
456792LibrarycppUNCONFIRMEDdev-libs/boost-1.52.0-r5 fails to compile with custom /etc/site-config.jam: could not find main targ2013-02-12 22:13:10
447782LibrarycppUNCONFIRMEDdev-libs/boost-1.52.0-r5 - .../temp/environment: line 964: 31328 Segmentation fault b2 "$@"2012-12-19 13:37:44
443140EbuildscppUNCONFIRMEDdev-cpp/gccxml-0.9.0_pre20121114 version bump2012-11-14 21:10:19
438188Developmentcommon-lispUNCONFIRMEDdev-lisp/clisp-2.48-r1 - fails to compile with ENOMEM, although there is plenty left2013-01-01 04:00:02
389783Ebuildscommon-lispUNCONFIRMEDdev-lisp/clozurecl-1.7 fails to build (unquoted SVN_REVISION in generated compiler commands)2011-11-08 19:59:04
407783Ebuildscorvus-gentooUNCONFIRMEDsys-fs/safecopy version bump to 1.72012-03-18 10:43:13
432980Applicationscommon-lispUNCONFIRMEDdev-lisp/sbcl-1.0.55-r1 fails to compile with "The value 18446744073 is not of type (UNSIGNED-BYTE 32012-08-29 09:14:51
421513Ebuildscommon-lispUNCONFIRMEDdev-lisp/asdf-2.24 version bump request2012-09-08 23:37:14
455584ServerclusterUNCONFIRMEDsys-cluster/ceph-0.56.3 version bump2013-02-19 16:46:44
436218EbuildsclusterUNCONFIRMEDnet-misc/pssh with dev-lang/python-3.2 - pssh --help: ImportError: No module named version2013-01-04 06:31:50
452378ServerclusterUNCONFIRMED>=sys-cluster/ceph-0.55.1 with dev-libs/boost-1.49 - In file included from mds/Dumper.cc:24: /usr/in2013-01-15 17:14:48
400771EbuildsclusterUNCONFIRMEDsys-cluster/onesis-2.0.3 version bump2012-01-25 19:13:16
458528ApplicationscjkUNCONFIRMEDapp-emacs/navi2ch - DESCRIPTION improvement2013-02-21 03:10:32
449166ApplicationscjkUNCONFIRMEDapp-i18n/ibus-table-1.4.99 version bump2013-02-12 09:54:43
389511EbuildschutzpahUNCONFIRMEDnet-mailcourier-imap-4.9.3 version bump2011-12-06 23:34:54
412165EbuildschutzpahUNCONFIRMEDnet-mail/courier-imap-4.10.0 version bump2012-12-17 18:47:08
438986EbuildschutzpahUNCONFIRMEDapp-admin/salt-0.10.0 - error: file '.../work/impl_python3_2/salt-0.10.0/scripts/salt-master' does n2012-10-21 14:26:16
442122EbuildschutzpahUNCONFIRMEDwww-plugins/mozplugger-1.14.6 version bump2013-02-21 08:37:18
449132ApplicationschutzpahUNCONFIRMED>=app-admin/salt-0.11.0 does not install config template files2012-12-29 11:40:31
448658ApplicationscjkUNCONFIRMEDapp-i18n/nabi-0.99.11 version bump2012-12-26 23:42:29
406583ApplicationschithanhUNCONFIRMEDwww-plugins/lightspark-0.5.4.1-r1 build fails - error regarding some ffmpeg stuff (?)2012-03-03 01:49:39
384617EbuildschainsawUNCONFIRMEDapp-emulation/dynamips fails to compile (w/ can't find a register in class 'GENERAL_REGS')2011-10-31 10:29:49
429626CatalystcatalystUNCONFIRMEDdev-util/catalyst-2.0.10.1: get_libdir() return an empty value when cross compiling2012-08-13 13:01:10
453156ApplicationscardoeUNCONFIRMEDsys-firmware/seabios-1.7.2 version bump2013-01-29 12:28:45
445884ApplicationscardoeUNCONFIRMEDdev-util/android-ndk-8c version bump2013-02-09 06:25:04
438248ApplicationscalchanUNCONFIRMEDmedia-video/kino-1.3.4 generates XML DVD indices incompatible with media-video/dvdauthor-0.7.02012-10-15 10:52:33
457784BugzillabugzillaUNCONFIRMED/data/cached/buglist-*.html missing last-modified timestamps2013-02-16 03:03:10
435212BugzillabugzillaUNCONFIRMEDgentoo's bugzilla does not support xz compressed patches2012-11-28 14:34:32
373653BugzillabugzillaUNCONFIRMEDUnspecified component kills entered bugdescription2011-10-30 23:17:02
458598Applicationsbug-wranglersUNCONFIRMED[media-gfx/asymptote-2.21] emerge failed with USE="doc latex"2013-02-21 14:49:39
458580Ebuildsbug-wranglersUNCONFIRMEDmedia-gfx/sane-backends-1.0.23 unnecessary linking to libnetsnmp.so2013-02-21 12:38:16
458578Applicationsbug-wranglersUNCONFIRMEDapp-misc/geneweb-5.02: Fatal error: OCaml and preprocessor have incompatible versions2013-02-21 12:27:58
458554Applicationsbug-wranglersUNCONFIRMEDlibarchive-3.0.4-r1 and libarchive-3.1.1 fail compile when using gcc i686-pc-linux-gnu-4.5.4 but not2013-02-21 09:28:12
458550Applicationsbug-wranglersUNCONFIRMEDmedia-libs/mesa-9.1_rc2 cannot compile2013-02-21 08:35:33
442708FreeBSDbsdUNCONFIRMEDsys-fs/fuse4bsd -- version bump request2012-12-09 02:14:11
427430FreeBSDbsdUNCONFIRMEDWhen using latest clang-3.1-r5, sys-freebsd/boot0-9.0/9.1_beta1 will fail to compile2012-11-25 11:39:35
393057FreeBSDbsdUNCONFIRMEDsys-freebsd/freebsd-lib-9.0 fails to compile on sparc-fbsd2011-12-03 18:20:02
419515FreeBSDbsdUNCONFIRMED[keywordreq] dev-util/catalyst and deps compile on amd64-fbsd2012-06-19 23:44:29
393039FreeBSDbsdUNCONFIRMEDapp-misc/screen on Gentoo/FBSD9 - os.h:275:20: error: utmp.h: No such file or directory2012-12-04 00:53:30
390665FreeBSDbsdUNCONFIRMEDdev-libs/openssl-1.0.0 fails to compile on sparc-fbsd2012-03-19 06:50:59
374505ApplicationsbluenessUNCONFIRMEDdev-util/gperf-3.0.4: compile error collect2: ld returned 1 exit status2012-02-04 01:23:02
431048Core systembluenessUNCONFIRMEDsys-kernel/hardened-sources-3.4.7 panic on UP->SMP transition when putting CPU core online - BUG: un2013-01-18 20:53:51
447826Core systembluenessUNCONFIRMEDsys-kernel/hardened-sources-2.6.32-r143 fails to compile for ia64: include/linux/random.h:91:19: err2013-01-18 23:15:20
442254EbuildsbluenessUNCONFIRMEDnet-misc/cgminer-2.9.1 version bump2012-12-20 16:37:50
447224DevelopmentbinkiUNCONFIRMEDdev-vcs/veracity-2.0.0.10822 version bump2013-02-04 11:38:03
412699libbashbetelgeuseUNCONFIRMEDSet builtin implementation2012-04-19 21:58:38
410831libbashbetelgeuseUNCONFIRMEDRead builtin implementation2012-04-05 01:32:10
454404Core systembase-systemUNCONFIRMEDsys-fs/static-dev: should also check for devtmpfs mounted at /dev2013-01-29 18:37:25
449830Core systembase-systemUNCONFIRMEDsys-block/open-iscsi-2.0.873 version bump2013-01-03 03:25:35
445744Core systembase-systemUNCONFIRMEDsys-apps/hprofile - Add patch for improving init file.2012-12-04 15:09:20
440194Core systembase-systemUNCONFIRMEDsys-apps/microcode-data20120606_p2? (v2) version bump request2012-11-06 11:28:26
435410Applicationsbase-systemUNCONFIRMEDapp-arch/zip-3.0: bzip2 flag broken, unicode flag broken, cross compilation broken2013-02-16 13:20:59
426358Core systembase-systemUNCONFIRMEDsys-block/partimage server crashes with pthread error when client attempts to download image2012-07-18 00:00:36
422877Core systembase-systemUNCONFIRMEDnet-firewall/iptables: ip6tables "state" test fails; will not jump to ACCEPT on ESTABLISHED,RELATED 2013-02-16 13:31:38
420337Core systembase-systemUNCONFIRMEDsys-libs/db-{5.2.42,5.3.21} version bump2012-06-09 14:09:24
416361Core systembase-systemUNCONFIRMEDapp-arch/dump-0.4.44-r1 restore crashes restoring UNIX-domain socket with very long name2012-05-18 14:49:10
410567Core systembase-systemUNCONFIRMEDsys-block/noflushd-2.8 version bump2012-04-02 15:16:31
410605Core systembase-systemUNCONFIRMEDsys-apps/util-linux-2.20-r1: fsck complains about checking file systems mounted ro2013-02-05 14:52:10
408047Core systembase-systemUNCONFIRMEDsys-fs/cryptsetup-1.4.1 fails 4 tests : password-hash-test loopaes-test compat-test api-test2013-01-20 10:26:44
401903Core systembase-systemUNCONFIRMEDapp-admin/sysklogd-1.5-r2: improve default syslog.conf to match syslog-ng.conf behavior2012-02-02 17:46:23
399491Core systembase-systemUNCONFIRMEDsys-devel/automake-1.11.2-r1 - fails py-compile-basic.test py-compile-basic2.test py-compile-basedir2012-02-06 11:51:29
429564ApplicationsangelosUNCONFIRMEDgnome-extra/docky-2.1.4 compile error with mono 2.11.12012-09-11 06:58:49
436596Applicationsandrej.filipcicUNCONFIRMEDnet-fs/openafs-1.6.1-r1: parallel build failure - In file included from db_dump.c:31:0: database.h:12012-09-29 15:38:55
432410FreeBSDamd64-fbsdUNCONFIRMED[keywordreq] some packages compile and works on amd64-fbsd2012-11-09 11:06:06
434698Unspecifiedandreis.vinogradovsUNCONFIRMEDdev-libs/libcgroup: init.d script is not POSIX compliant2013-01-03 20:38:46
403551OtheraltUNCONFIRMEDCompilation of gcc-4.5.3-r1 fails with "configure: error: Link tests are not allowed after GCC_NO_EX2012-02-14 10:57:13
380959OtheraltUNCONFIRMEDapp-arch/dpkg: failed to compile on Mac OSX2011-10-08 16:59:55
384401OtheraltUNCONFIRMEDapp-text/texlive-core-2011-r4: failed to compile on prefix/Mac OSX2011-09-25 06:48:07
380957OtheraltUNCONFIRMEDdev-libs/newt: failed to compile on Mac OSX2011-09-13 15:59:04
383605Core systemalsa-bugsUNCONFIRMEDmedia-libs/alsa-lib-1.0.23 crash when compiled with sys-devel/gcc-4.4.5 / -O32011-09-20 16:11:19
439908EbuildsalexxyUNCONFIRMEDsci-chemistry/gamess-20120501.1 version bump2012-10-28 11:49:32
458056ApplicationsaidecoeUNCONFIRMEDapp-admin/hddtemp submission for Samsung 840 Series SSD2013-02-18 13:22:13
413659DevelopmentadaUNCONFIRMEDdev-lang/gnat-gcc 4.6.2 4.7.0 version bumps2012-09-11 19:00:29
440660Eclasses and ProfilesadaUNCONFIRMEDgnatbuild.eclass: /etc/ada/primary_compilers: No such file or directory2012-10-31 21:52:05
402493ApplicationsadaUNCONFIRMEDdev-ada/adasockets-1.8.4.7 - gnatmake: "listener.adb" compilation error2012-02-07 17:45:08
449716ApplicationsaballierUNCONFIRMEDnet-nntp/hellanzb.0.13-r8 - hellanzb.py: ImportError: cannot import name _NO_FILENO2013-01-02 10:57:50
430478Core systema3liUNCONFIRMEDsys-boot/plymouth-0.8.6.1 version bump2013-01-30 10:49:51
399739Libraryrobbat2UNCONFIRMEDdev-db/libdbi-drivers-0.8.3 fails to return column information for empty sqlite3 table2012-10-26 16:54:27
346251ApplicationspdaUNCONFIRMEDapp-pda/gtkpod: normalize volume doesn't work for .mp3 files with ApeV2 tags2013-01-11 16:10:10
413613Applicationsmedia-videoUNCONFIRMEDmedia-video/h264enc-9.4.6 version bump2012-04-26 15:16:26
366875Ebuildsmaintainer-wantedUNCONFIRMED[new package] sys-fs/gdatafs - Gdatafs is a FUSE implemtation that mount picassa web and youtube to 2011-12-08 06:16:16
255644Ebuildsmaintainer-wantedUNCONFIRMEDapp-emulation/basiliskII-jit: a lot improved ebuild2012-12-14 15:37:41
313491ApplicationsgraphicsUNCONFIRMEDmedia-gfx/exact-image: Verify and potentially improve Python-related code2012-10-06 11:48:14
403965EbuildsaballierUNCONFIRMEDmedia-sound/decibel-audio-player-1.09 version bump2012-02-17 04:54:23


back
Please read "Why adblockers are bad".



other Ads
Trace My Cash
Wenn Sie sich schon immer mal gefragt haben, wo eigentlich Ihr geliebtes Bargeld geblieben ist, finden Sie hier vielleicht die Antwort.
www.tracemycash.com
Other free services
toURL.org
Shorten long
URLs to short
links like
http://tourl.org/2
tourl.org
.
Reverse DNS lookup
Find out which hostname(s)
resolve to a
given IP or other hostnames for the server
www.reversednslookup.org

New Packages

- as rdf newsfeed
- as rss newsfeed
- as Atom newsfeed
2017-06-22
Algorithm-Dependency - 1.110.0-r2
Ebuild name:

dev-perl/Algorithm-Dependency-1.110.0-r2

Description

Toolkit for implementing dependency systems

Added to portage

2017-06-22

Chart-Math-Axis - 1.60.0-r2
Ebuild name:

dev-perl/Chart-Math-Axis-1.60.0-r2

Description

Implements an algorithm to find good values for chart axis

Added to portage

2017-06-22

Class-Autouse - 2.10.0-r2
Ebuild name:

dev-perl/Class-Autouse-2.10.0-r2

Description

Runtime aspect loading of one or more classes

Added to portage

2017-06-22

CoverageTestRunner - 1.11
Ebuild name:

dev-python/CoverageTestRunner-1.11

Description

fail Python program unit tests unless they test everything

Added to portage

2017-06-22

Test-ClassAPI - 1.60.0-r2
Ebuild name:

dev-perl/Test-ClassAPI-1.60.0-r2

Description

Provides basic first-pass API testing for large class trees

Added to portage

2017-06-22

asa - 1.30.0-r1
Ebuild name:

dev-perl/asa-1.30.0-r1

Description

Lets your class/object say it works like something else

Added to portage

2017-06-22

chrome-binary-plugins - 59.0.3071.109
Ebuild name:

www-plugins/chrome-binary-plugins-59.0.3071.109

Description

Binary plugins from Google Chrome for use in Chromi

Added to portage

2017-06-22

chrome-binary-plugins - 60.0.3112.40_beta
Ebuild name:

www-plugins/chrome-binary-plugins-60.0.3112.40_beta

Description

Binary plugins from Google Chrome for use in Ch

Added to portage

2017-06-22

cyrus-imapd - 3.0.2
Ebuild name:

net-mail/cyrus-imapd-3.0.2

Description

The Cyrus IMAP Server

Added to portage

2017-06-22

docker-compose - 1.14.0
Ebuild name:

app-emulation/docker-compose-1.14.0

Description

Multi-container orchestration for Docker

Added to portage

2017-06-22

fast_gettext - 1.4.1
Ebuild name:

dev-ruby/fast_gettext-1.4.1

Description

GetText but 3.5x faster, 560x less memory, clean namespace and threadsa

Added to portage

2017-06-22

google-chrome - 59.0.3071.109
Ebuild name:

www-client/google-chrome-59.0.3071.109

Description

The web browser from Google

Added to portage

2017-06-22

google-chrome-beta - 60.0.3112.40
Ebuild name:

www-client/google-chrome-beta-60.0.3112.40

Description

The web browser from Google

Added to portage

2017-06-22

gtk+ - 3.22.16
Ebuild name:

x11-libs/gtk+-3.22.16

Description

Gimp ToolKit +

Added to portage

2017-06-22

haproxy - 1.6.11-r1
Ebuild name:

net-proxy/haproxy-1.6.11-r1

Description

A TCP/HTTP reverse proxy for high availability environments

Added to portage

2017-06-22

haproxy - 1.6.12-r1
Ebuild name:

net-proxy/haproxy-1.6.12-r1

Description

A TCP/HTTP reverse proxy for high availability environments

Added to portage

2017-06-22

haproxy - 1.6.13-r1
Ebuild name:

net-proxy/haproxy-1.6.13-r1

Description

A TCP/HTTP reverse proxy for high availability environments

Added to portage

2017-06-22

haproxy - 1.6.9999-r1
Ebuild name:

net-proxy/haproxy-1.6.9999-r1

Description

A TCP/HTTP reverse proxy for high availability environments

Added to portage

2017-06-22

haproxy - 1.7.5-r1
Ebuild name:

net-proxy/haproxy-1.7.5-r1

Description

A TCP/HTTP reverse proxy for high availability environments

Added to portage

2017-06-22

haproxy - 1.7.6-r1
Ebuild name:

net-proxy/haproxy-1.7.6-r1

Description

A TCP/HTTP reverse proxy for high availability environments

Added to portage

2017-06-22

haproxy - 1.7.9999-r1
Ebuild name:

net-proxy/haproxy-1.7.9999-r1

Description

A TCP/HTTP reverse proxy for high availability environments

Added to portage

2017-06-22

libbsd - 0.8.4
Ebuild name:

dev-libs/libbsd-0.8.4

Description

An library to provide useful functions commonly found on BSD systems

Added to portage

2017-06-22

mate-session-manager - 1.18.0-r1
Ebuild name:

mate-base/mate-session-manager-1.18.0-r1

Description

MATE session manager

Added to portage

2017-06-22

openldap - 2.4.45
Ebuild name:

net-nds/openldap-2.4.45

Description

LDAP suite of application and development tools

Added to portage

2017-06-22

openvpn - 2.4.3
Ebuild name:

net-vpn/openvpn-2.4.3

Description

Robust and highly flexible tunneling application compatible with many OSes

Added to portage

2017-06-22

prefork - 1.40.0-r2
Ebuild name:

dev-perl/prefork-1.40.0-r2

Description

Optimized module loading for forking or non-forking processes

Added to portage

2017-06-22

webkit-gtk - 2.16.4
Ebuild name:

net-libs/webkit-gtk-2.16.4

Description

Open source web browser engine

Added to portage

2017-06-22

2017-06-21
Dist-Zilla-Plugin-PodWeaver - 4.8.0
Ebuild name:

dev-perl/Dist-Zilla-Plugin-PodWeaver-4.8.0

Description

Weave your Pod together from configuration and Dist

Added to portage

2017-06-21

Pod-Elemental - 0.103.4
Ebuild name:

dev-perl/Pod-Elemental-0.103.4

Description

Work with nestable Pod elements

Added to portage

2017-06-21

Pod-Elemental-PerlMunger - 0.200.6
Ebuild name:

dev-perl/Pod-Elemental-PerlMunger-0.200.6

Description

A thing that takes a string of Perl and rewrites its docu

Added to portage

2017-06-21

Pod-Weaver - 4.15.0
Ebuild name:

dev-perl/Pod-Weaver-4.15.0

Description

Weave together a Pod document from an outline

Added to portage

2017-06-21

String-Truncate - 1.100.602
Ebuild name:

dev-perl/String-Truncate-1.100.602

Description

Module for when strings are too long to be displayed in...

Added to portage

2017-06-21

acme-tiny - 20170207
Ebuild name:

app-crypt/acme-tiny-20170207

Description

A tiny, auditable script for Let's Encrypt's ACME Protocol

Added to portage

2017-06-21

acme-tiny - 9999
Ebuild name:

app-crypt/acme-tiny-9999

Description

A tiny, auditable script for Let's Encrypt's ACME Protocol

Added to portage

2017-06-21

bos - 0.1.6
Ebuild name:

dev-ml/bos-0.1.6

Description

Basic OS interaction for OCaml

Added to portage

2017-06-21

chrome-binary-plugins - 61.0.3135.4_alpha
Ebuild name:

www-plugins/chrome-binary-plugins-61.0.3135.4_alpha

Description

Binary plugins from Google Chrome for use in Ch

Added to portage

2017-06-21

colorspacious - 1.1.0
Ebuild name:

dev-python/colorspacious-1.1.0

Description

Powerful, accurate, and easy-to-use Python library for colorspace co

Added to portage

2017-06-21

fpath - 0.7.2
Ebuild name:

dev-ml/fpath-0.7.2

Description

File system paths for OCaml

Added to portage

2017-06-21

gnupg - 2.1.21-r1
Ebuild name:

app-crypt/gnupg-2.1.21-r1

Description

The GNU Privacy Guard, a GPL OpenPGP implementation

Added to portage

2017-06-21

google-chrome-unstable - 61.0.3135.4
Ebuild name:

www-client/google-chrome-unstable-61.0.3135.4

Description

The web browser from Google

Added to portage

2017-06-21

hexpat - 0.20.11
Ebuild name:

dev-haskell/hexpat-0.20.11

Description

XML parser/formatter based on expat

Added to portage

2017-06-21

iperf - 3.2_rc1
Ebuild name:

net-misc/iperf-3.2_rc1

Description

A TCP, UDP, and SCTP network bandwidth measurement tool

Added to portage

2017-06-21

javax-inject - 1-r3
Ebuild name:

dev-java/javax-inject-1-r3

Description

Dependency injection for Java (JSR-330)

Added to portage

2017-06-21

libepoxy - 1.4.3
Ebuild name:

media-libs/libepoxy-1.4.3

Description

Epoxy is a library for handling OpenGL function pointer management for yo

Added to portage

2017-06-21

libmikmod - 3.3.11.1
Ebuild name:

media-libs/libmikmod-3.3.11.1

Description

A library to play a wide range of module formats

Added to portage

2017-06-21

mbedtls - 2.5.1
Ebuild name:

net-libs/mbedtls-2.5.1

Description

Cryptographic library for embedded systems

Added to portage

2017-06-21

mcabber - 1.1.0
Ebuild name:

net-im/mcabber-1.1.0

Description

A small Jabber console client with various features, like MUC, SSL, PGP

Added to portage

2017-06-21

memoist - 0.16.0
Ebuild name:

dev-ruby/memoist-0.16.0

Description

ActiveSupport with a few enhancements

Added to portage

2017-06-21

mesa - 17.1.3
Ebuild name:

media-libs/mesa-17.1.3

Description

OpenGL-like graphic library for Linux

Added to portage

2017-06-21

meson - 0.41.1
Ebuild name:

dev-util/meson-0.41.1

Description

Open source build system

Added to portage

2017-06-21

nova - 15.0.6
Ebuild name:

sys-cluster/nova-15.0.6

Description

Cloud computing fabric controller (main part of an IaaS system) in Python

Added to portage

2017-06-21

ocaml-base64 - 2.2.0
Ebuild name:

dev-ml/ocaml-base64-2.2.0

Description

Library for radix-64 representation (de)coding

Added to portage

2017-06-21

ocaml-magic-mime - 1.1.0
Ebuild name:

dev-ml/ocaml-magic-mime-1.1.0

Description

Convert file extensions to MIME types

Added to portage

2017-06-21

opus - 1.2
Ebuild name:

media-libs/opus-1.2

Description

Open codec designed for internet transmission of interactive speech and audio

Added to portage

2017-06-21

oslo-config - 3.22.1
Ebuild name:

dev-python/oslo-config-3.22.1

Description

Oslo Configuration API

Added to portage

2017-06-21

oslo-messaging - 5.17.2
Ebuild name:

dev-python/oslo-messaging-5.17.2

Description

Messaging API for RPC and notifications over different messaging t

Added to portage

2017-06-21

pbr - 3.1.0
Ebuild name:

dev-python/pbr-3.1.0

Description

Inject some useful and sensible default behaviors into setuptools

Added to portage

2017-06-21

pycobertura - 0.10.0
Ebuild name:

dev-python/pycobertura-0.10.0

Description

Cobertura coverage parser that can diff reports and show coverage pro

Added to portage

2017-06-21

rresult - 0.5.0
Ebuild name:

dev-ml/rresult-0.5.0

Description

Result value combinators for OCaml

Added to portage

2017-06-21

texlive-basic - 2017-r1
Ebuild name:

dev-texlive/texlive-basic-2017-r1

Description

TeXLive Essential programs and files

Added to portage

2017-06-21

unrar - 5.5.5-r1
Ebuild name:

app-arch/unrar-5.5.5-r1

Description

Uncompress rar files

Added to portage

2017-06-21

vulkan-loader - 1.0.51.0
Ebuild name:

media-libs/vulkan-loader-1.0.51.0

Description

Vulkan Installable Client Driver (ICD) Loader

Added to portage

2017-06-21

youtube-dl - 2017.06.18
Ebuild name:

net-misc/youtube-dl-2017.06.18

Description

Download videos from YouTube.com (and more sites...)

Added to portage

2017-06-21

rdf newsfeed | rss newsfeed | Atom newsfeed
- Powered by LeopardCMS - Running on Gentoo -
Copyright 2004-2017 Sascha Nitsch Unternehmensberatung UG(haftungsbeschänkt)
Valid XHTML1.1 : Valid CSS : buttonmaker
- Level Triple-A Conformance to Web Content Accessibility Guidelines 1.0 -
- Copyright and legal notices -
Time to create this page: 11.0 ms
system status display